[Libvirt-ci] Build failed in Jenkins: libvirt-dbus-syntax-check » libvirt-freebsd-10 #60

See <https://ci.centos.org/job/libvirt-dbus-syntax-check/systems=libvirt-freebsd-10/60/display/redirect> ------------------------------------------ Started by upstream project "libvirt-dbus-syntax-check" build number 60 originally caused by: Started by upstream project "libvirt-dbus-build" build number 66 originally caused by: Started by an SCM change [EnvInject] - Loading node environment variables. Building remotely on libvirt-freebsd-10 (libvirt) in workspace <https://ci.centos.org/job/libvirt-dbus-syntax-check/systems=libvirt-freebsd-10/ws/> [libvirt-dbus] $ /bin/sh -xe /tmp/jenkins2814893610010947026.sh + cd build + /usr/local/bin/gmake syntax-check /usr/local/bin/flake8-3.6 --show-source --ignore=E501 .. Traceback (most recent call last): File "/usr/local/lib/python3.6/site-packages/pkg_resources/__init__.py", line 573, in _build_master ws.require(__requires__) File "/usr/local/lib/python3.6/site-packages/pkg_resources/__init__.py", line 891, in require needed = self.resolve(parse_requirements(requirements)) File "/usr/local/lib/python3.6/site-packages/pkg_resources/__init__.py", line 782, in resolve raise VersionConflict(dist, req).with_context(dependent_req) pkg_resources.ContextualVersionConflict: (pyflakes 2.0.0 (/usr/local/lib/python3.6/site-packages), Requirement.parse('pyflakes<1.7.0,>=1.5.0'), {'flake8'}) During handling of the above exception, another exception occurred: Traceback (most recent call last): File "/usr/local/bin/flake8-3.6", line 6, in <module> from pkg_resources import load_entry_point File "/usr/local/lib/python3.6/site-packages/pkg_resources/__init__.py", line 3098, in <module> @_call_aside File "/usr/local/lib/python3.6/site-packages/pkg_resources/__init__.py", line 3082, in _call_aside f(*args, **kwargs) File "/usr/local/lib/python3.6/site-packages/pkg_resources/__init__.py", line 3111, in _initialize_master_working_set working_set = WorkingSet._build_master() File "/usr/local/lib/python3.6/site-packages/pkg_resources/__init__.py", line 575, in _build_master return cls._build_from_requirements(__requires__) File "/usr/local/lib/python3.6/site-packages/pkg_resources/__init__.py", line 588, in _build_from_requirements dists = ws.resolve(reqs, Environment()) File "/usr/local/lib/python3.6/site-packages/pkg_resources/__init__.py", line 777, in resolve raise DistributionNotFound(req, requirers) pkg_resources.DistributionNotFound: The 'pyflakes<1.7.0,>=1.5.0' distribution was not found and is required by flake8 gmake: *** [Makefile:906: flake8] Error 1 Build step 'Execute shell' marked build as failure

See <https://ci.centos.org/job/libvirt-dbus-syntax-check/systems=libvirt-freebsd-10/61/display/redirect> ------------------------------------------ Started by upstream project "libvirt-dbus-syntax-check" build number 61 originally caused by: Started by upstream project "libvirt-dbus-build" build number 67 originally caused by: Started by upstream project "libvirt-glib-build" build number 66 originally caused by: Started by upstream project "libvirt-build" build number 89 originally caused by: Started by an SCM change [EnvInject] - Loading node environment variables. Building remotely on libvirt-freebsd-10 (libvirt) in workspace <https://ci.centos.org/job/libvirt-dbus-syntax-check/systems=libvirt-freebsd-10/ws/> [libvirt-dbus] $ /bin/sh -xe /tmp/jenkins1693511268800023591.sh + cd build + /usr/local/bin/gmake syntax-check /usr/local/bin/flake8-3.6 --show-source --ignore=E501 .. Traceback (most recent call last): File "/usr/local/lib/python3.6/site-packages/pkg_resources/__init__.py", line 573, in _build_master ws.require(__requires__) File "/usr/local/lib/python3.6/site-packages/pkg_resources/__init__.py", line 891, in require needed = self.resolve(parse_requirements(requirements)) File "/usr/local/lib/python3.6/site-packages/pkg_resources/__init__.py", line 782, in resolve raise VersionConflict(dist, req).with_context(dependent_req) pkg_resources.ContextualVersionConflict: (pyflakes 2.0.0 (/usr/local/lib/python3.6/site-packages), Requirement.parse('pyflakes<1.7.0,>=1.5.0'), {'flake8'}) During handling of the above exception, another exception occurred: Traceback (most recent call last): File "/usr/local/bin/flake8-3.6", line 6, in <module> from pkg_resources import load_entry_point File "/usr/local/lib/python3.6/site-packages/pkg_resources/__init__.py", line 3098, in <module> @_call_aside File "/usr/local/lib/python3.6/site-packages/pkg_resources/__init__.py", line 3082, in _call_aside f(*args, **kwargs) File "/usr/local/lib/python3.6/site-packages/pkg_resources/__init__.py", line 3111, in _initialize_master_working_set working_set = WorkingSet._build_master() File "/usr/local/lib/python3.6/site-packages/pkg_resources/__init__.py", line 575, in _build_master return cls._build_from_requirements(__requires__) File "/usr/local/lib/python3.6/site-packages/pkg_resources/__init__.py", line 588, in _build_from_requirements dists = ws.resolve(reqs, Environment()) File "/usr/local/lib/python3.6/site-packages/pkg_resources/__init__.py", line 777, in resolve raise DistributionNotFound(req, requirers) pkg_resources.DistributionNotFound: The 'pyflakes<1.7.0,>=1.5.0' distribution was not found and is required by flake8 gmake: *** [Makefile:906: flake8] Error 1 Build step 'Execute shell' marked build as failure

See <https://ci.centos.org/job/libvirt-dbus-syntax-check/systems=libvirt-freebsd-10/62/display/redirect> ------------------------------------------ Started by upstream project "libvirt-dbus-syntax-check" build number 62 originally caused by: Started by upstream project "libvirt-dbus-build" build number 68 originally caused by: Started by upstream project "libvirt-glib-build" build number 67 originally caused by: Started by upstream project "libvirt-build" build number 90 originally caused by: Started by an SCM change [EnvInject] - Loading node environment variables. Building remotely on libvirt-freebsd-10 (libvirt) in workspace <https://ci.centos.org/job/libvirt-dbus-syntax-check/systems=libvirt-freebsd-10/ws/> [libvirt-dbus] $ /bin/sh -xe /tmp/jenkins3872319397110976473.sh + cd build + /usr/local/bin/gmake syntax-check /usr/local/bin/flake8-3.6 --show-source --ignore=E501 .. Traceback (most recent call last): File "/usr/local/lib/python3.6/site-packages/pkg_resources/__init__.py", line 573, in _build_master ws.require(__requires__) File "/usr/local/lib/python3.6/site-packages/pkg_resources/__init__.py", line 891, in require needed = self.resolve(parse_requirements(requirements)) File "/usr/local/lib/python3.6/site-packages/pkg_resources/__init__.py", line 782, in resolve raise VersionConflict(dist, req).with_context(dependent_req) pkg_resources.ContextualVersionConflict: (pyflakes 2.0.0 (/usr/local/lib/python3.6/site-packages), Requirement.parse('pyflakes<1.7.0,>=1.5.0'), {'flake8'}) During handling of the above exception, another exception occurred: Traceback (most recent call last): File "/usr/local/bin/flake8-3.6", line 6, in <module> from pkg_resources import load_entry_point File "/usr/local/lib/python3.6/site-packages/pkg_resources/__init__.py", line 3098, in <module> @_call_aside File "/usr/local/lib/python3.6/site-packages/pkg_resources/__init__.py", line 3082, in _call_aside f(*args, **kwargs) File "/usr/local/lib/python3.6/site-packages/pkg_resources/__init__.py", line 3111, in _initialize_master_working_set working_set = WorkingSet._build_master() File "/usr/local/lib/python3.6/site-packages/pkg_resources/__init__.py", line 575, in _build_master return cls._build_from_requirements(__requires__) File "/usr/local/lib/python3.6/site-packages/pkg_resources/__init__.py", line 588, in _build_from_requirements dists = ws.resolve(reqs, Environment()) File "/usr/local/lib/python3.6/site-packages/pkg_resources/__init__.py", line 777, in resolve raise DistributionNotFound(req, requirers) pkg_resources.DistributionNotFound: The 'pyflakes<1.7.0,>=1.5.0' distribution was not found and is required by flake8 gmake: *** [Makefile:906: flake8] Error 1 Build step 'Execute shell' marked build as failure

See <https://ci.centos.org/job/libvirt-dbus-syntax-check/systems=libvirt-freebsd-10/63/display/redirect> ------------------------------------------ Started by upstream project "libvirt-dbus-syntax-check" build number 63 originally caused by: Started by upstream project "libvirt-dbus-build" build number 69 originally caused by: Started by upstream project "libvirt-glib-build" build number 68 originally caused by: Started by an SCM change [EnvInject] - Loading node environment variables. Building remotely on libvirt-freebsd-10 (libvirt) in workspace <https://ci.centos.org/job/libvirt-dbus-syntax-check/systems=libvirt-freebsd-10/ws/> [libvirt-dbus] $ /bin/sh -xe /tmp/jenkins8280982874112115152.sh + cd build + /usr/local/bin/gmake syntax-check /usr/local/bin/flake8-3.6 --show-source --ignore=E501 .. Traceback (most recent call last): File "/usr/local/lib/python3.6/site-packages/pkg_resources/__init__.py", line 573, in _build_master ws.require(__requires__) File "/usr/local/lib/python3.6/site-packages/pkg_resources/__init__.py", line 891, in require needed = self.resolve(parse_requirements(requirements)) File "/usr/local/lib/python3.6/site-packages/pkg_resources/__init__.py", line 782, in resolve raise VersionConflict(dist, req).with_context(dependent_req) pkg_resources.ContextualVersionConflict: (pyflakes 2.0.0 (/usr/local/lib/python3.6/site-packages), Requirement.parse('pyflakes<1.7.0,>=1.5.0'), {'flake8'}) During handling of the above exception, another exception occurred: Traceback (most recent call last): File "/usr/local/bin/flake8-3.6", line 6, in <module> from pkg_resources import load_entry_point File "/usr/local/lib/python3.6/site-packages/pkg_resources/__init__.py", line 3098, in <module> @_call_aside File "/usr/local/lib/python3.6/site-packages/pkg_resources/__init__.py", line 3082, in _call_aside f(*args, **kwargs) File "/usr/local/lib/python3.6/site-packages/pkg_resources/__init__.py", line 3111, in _initialize_master_working_set working_set = WorkingSet._build_master() File "/usr/local/lib/python3.6/site-packages/pkg_resources/__init__.py", line 575, in _build_master return cls._build_from_requirements(__requires__) File "/usr/local/lib/python3.6/site-packages/pkg_resources/__init__.py", line 588, in _build_from_requirements dists = ws.resolve(reqs, Environment()) File "/usr/local/lib/python3.6/site-packages/pkg_resources/__init__.py", line 777, in resolve raise DistributionNotFound(req, requirers) pkg_resources.DistributionNotFound: The 'pyflakes<1.7.0,>=1.5.0' distribution was not found and is required by flake8 gmake: *** [Makefile:906: flake8] Error 1 Build step 'Execute shell' marked build as failure

See <https://ci.centos.org/job/libvirt-dbus-syntax-check/systems=libvirt-freebsd-10/64/display/redirect> ------------------------------------------ Started by upstream project "libvirt-dbus-syntax-check" build number 64 originally caused by: Started by upstream project "libvirt-dbus-build" build number 70 originally caused by: Started by upstream project "libvirt-glib-build" build number 69 originally caused by: Started by upstream project "libvirt-build" build number 91 originally caused by: Started by an SCM change [EnvInject] - Loading node environment variables. Building remotely on libvirt-freebsd-10 (libvirt) in workspace <https://ci.centos.org/job/libvirt-dbus-syntax-check/systems=libvirt-freebsd-10/ws/> [libvirt-dbus] $ /bin/sh -xe /tmp/jenkins1281591526520694000.sh + cd build + /usr/local/bin/gmake syntax-check /usr/local/bin/flake8-3.6 --show-source --ignore=E501 .. Traceback (most recent call last): File "/usr/local/lib/python3.6/site-packages/pkg_resources/__init__.py", line 573, in _build_master ws.require(__requires__) File "/usr/local/lib/python3.6/site-packages/pkg_resources/__init__.py", line 891, in require needed = self.resolve(parse_requirements(requirements)) File "/usr/local/lib/python3.6/site-packages/pkg_resources/__init__.py", line 782, in resolve raise VersionConflict(dist, req).with_context(dependent_req) pkg_resources.ContextualVersionConflict: (pyflakes 2.0.0 (/usr/local/lib/python3.6/site-packages), Requirement.parse('pyflakes<1.7.0,>=1.5.0'), {'flake8'}) During handling of the above exception, another exception occurred: Traceback (most recent call last): File "/usr/local/bin/flake8-3.6", line 6, in <module> from pkg_resources import load_entry_point File "/usr/local/lib/python3.6/site-packages/pkg_resources/__init__.py", line 3098, in <module> @_call_aside File "/usr/local/lib/python3.6/site-packages/pkg_resources/__init__.py", line 3082, in _call_aside f(*args, **kwargs) File "/usr/local/lib/python3.6/site-packages/pkg_resources/__init__.py", line 3111, in _initialize_master_working_set working_set = WorkingSet._build_master() File "/usr/local/lib/python3.6/site-packages/pkg_resources/__init__.py", line 575, in _build_master return cls._build_from_requirements(__requires__) File "/usr/local/lib/python3.6/site-packages/pkg_resources/__init__.py", line 588, in _build_from_requirements dists = ws.resolve(reqs, Environment()) File "/usr/local/lib/python3.6/site-packages/pkg_resources/__init__.py", line 777, in resolve raise DistributionNotFound(req, requirers) pkg_resources.DistributionNotFound: The 'pyflakes<1.7.0,>=1.5.0' distribution was not found and is required by flake8 gmake: *** [Makefile:906: flake8] Error 1 Build step 'Execute shell' marked build as failure

See <https://ci.centos.org/job/libvirt-dbus-syntax-check/systems=libvirt-freebsd-10/65/display/redirect> ------------------------------------------ Started by upstream project "libvirt-dbus-syntax-check" build number 65 originally caused by: Started by upstream project "libvirt-dbus-build" build number 71 originally caused by: Started by upstream project "libvirt-glib-build" build number 70 originally caused by: Started by upstream project "libvirt-build" build number 92 originally caused by: Started by an SCM change [EnvInject] - Loading node environment variables. Building remotely on libvirt-freebsd-10 (libvirt) in workspace <https://ci.centos.org/job/libvirt-dbus-syntax-check/systems=libvirt-freebsd-10/ws/> [libvirt-dbus] $ /bin/sh -xe /tmp/jenkins4586816222241098535.sh + cd build + /usr/local/bin/gmake syntax-check /usr/local/bin/flake8-3.6 --show-source --ignore=E501 .. Traceback (most recent call last): File "/usr/local/lib/python3.6/site-packages/pkg_resources/__init__.py", line 573, in _build_master ws.require(__requires__) File "/usr/local/lib/python3.6/site-packages/pkg_resources/__init__.py", line 891, in require needed = self.resolve(parse_requirements(requirements)) File "/usr/local/lib/python3.6/site-packages/pkg_resources/__init__.py", line 782, in resolve raise VersionConflict(dist, req).with_context(dependent_req) pkg_resources.ContextualVersionConflict: (pyflakes 2.0.0 (/usr/local/lib/python3.6/site-packages), Requirement.parse('pyflakes<1.7.0,>=1.5.0'), {'flake8'}) During handling of the above exception, another exception occurred: Traceback (most recent call last): File "/usr/local/bin/flake8-3.6", line 6, in <module> from pkg_resources import load_entry_point File "/usr/local/lib/python3.6/site-packages/pkg_resources/__init__.py", line 3098, in <module> @_call_aside File "/usr/local/lib/python3.6/site-packages/pkg_resources/__init__.py", line 3082, in _call_aside f(*args, **kwargs) File "/usr/local/lib/python3.6/site-packages/pkg_resources/__init__.py", line 3111, in _initialize_master_working_set working_set = WorkingSet._build_master() File "/usr/local/lib/python3.6/site-packages/pkg_resources/__init__.py", line 575, in _build_master return cls._build_from_requirements(__requires__) File "/usr/local/lib/python3.6/site-packages/pkg_resources/__init__.py", line 588, in _build_from_requirements dists = ws.resolve(reqs, Environment()) File "/usr/local/lib/python3.6/site-packages/pkg_resources/__init__.py", line 777, in resolve raise DistributionNotFound(req, requirers) pkg_resources.DistributionNotFound: The 'pyflakes<1.7.0,>=1.5.0' distribution was not found and is required by flake8 gmake: *** [Makefile:906: flake8] Error 1 Build step 'Execute shell' marked build as failure

See <https://ci.centos.org/job/libvirt-dbus-syntax-check/systems=libvirt-freebsd-10/66/display/redirect> ------------------------------------------ Started by upstream project "libvirt-dbus-syntax-check" build number 66 originally caused by: Started by upstream project "libvirt-dbus-build" build number 72 originally caused by: Started by upstream project "libvirt-glib-build" build number 71 originally caused by: Started by upstream project "libvirt-build" build number 93 originally caused by: Started by an SCM change [EnvInject] - Loading node environment variables. Building remotely on libvirt-freebsd-10 (libvirt) in workspace <https://ci.centos.org/job/libvirt-dbus-syntax-check/systems=libvirt-freebsd-10/ws/> [libvirt-dbus] $ /bin/sh -xe /tmp/jenkins4604403298672684924.sh + cd build + /usr/local/bin/gmake syntax-check /usr/local/bin/flake8-3.6 --show-source --ignore=E501 .. Traceback (most recent call last): File "/usr/local/lib/python3.6/site-packages/pkg_resources/__init__.py", line 573, in _build_master ws.require(__requires__) File "/usr/local/lib/python3.6/site-packages/pkg_resources/__init__.py", line 891, in require needed = self.resolve(parse_requirements(requirements)) File "/usr/local/lib/python3.6/site-packages/pkg_resources/__init__.py", line 782, in resolve raise VersionConflict(dist, req).with_context(dependent_req) pkg_resources.ContextualVersionConflict: (pyflakes 2.0.0 (/usr/local/lib/python3.6/site-packages), Requirement.parse('pyflakes<1.7.0,>=1.5.0'), {'flake8'}) During handling of the above exception, another exception occurred: Traceback (most recent call last): File "/usr/local/bin/flake8-3.6", line 6, in <module> from pkg_resources import load_entry_point File "/usr/local/lib/python3.6/site-packages/pkg_resources/__init__.py", line 3098, in <module> @_call_aside File "/usr/local/lib/python3.6/site-packages/pkg_resources/__init__.py", line 3082, in _call_aside f(*args, **kwargs) File "/usr/local/lib/python3.6/site-packages/pkg_resources/__init__.py", line 3111, in _initialize_master_working_set working_set = WorkingSet._build_master() File "/usr/local/lib/python3.6/site-packages/pkg_resources/__init__.py", line 575, in _build_master return cls._build_from_requirements(__requires__) File "/usr/local/lib/python3.6/site-packages/pkg_resources/__init__.py", line 588, in _build_from_requirements dists = ws.resolve(reqs, Environment()) File "/usr/local/lib/python3.6/site-packages/pkg_resources/__init__.py", line 777, in resolve raise DistributionNotFound(req, requirers) pkg_resources.DistributionNotFound: The 'pyflakes<1.7.0,>=1.5.0' distribution was not found and is required by flake8 gmake: *** [Makefile:906: flake8] Error 1 Build step 'Execute shell' marked build as failure

See <https://ci.centos.org/job/libvirt-dbus-syntax-check/systems=libvirt-freebsd-10/67/display/redirect> ------------------------------------------ Started by upstream project "libvirt-dbus-syntax-check" build number 67 originally caused by: Started by upstream project "libvirt-dbus-build" build number 73 originally caused by: Started by upstream project "libvirt-glib-build" build number 72 originally caused by: Started by upstream project "libvirt-build" build number 94 originally caused by: Started by an SCM change [EnvInject] - Loading node environment variables. Building remotely on libvirt-freebsd-10 (libvirt) in workspace <https://ci.centos.org/job/libvirt-dbus-syntax-check/systems=libvirt-freebsd-10/ws/> [libvirt-dbus] $ /bin/sh -xe /tmp/jenkins7063497705796681655.sh + cd build + /usr/local/bin/gmake syntax-check /usr/local/bin/flake8-3.6 --show-source --ignore=E501 .. Traceback (most recent call last): File "/usr/local/lib/python3.6/site-packages/pkg_resources/__init__.py", line 573, in _build_master ws.require(__requires__) File "/usr/local/lib/python3.6/site-packages/pkg_resources/__init__.py", line 891, in require needed = self.resolve(parse_requirements(requirements)) File "/usr/local/lib/python3.6/site-packages/pkg_resources/__init__.py", line 782, in resolve raise VersionConflict(dist, req).with_context(dependent_req) pkg_resources.ContextualVersionConflict: (pyflakes 2.0.0 (/usr/local/lib/python3.6/site-packages), Requirement.parse('pyflakes<1.7.0,>=1.5.0'), {'flake8'}) During handling of the above exception, another exception occurred: Traceback (most recent call last): File "/usr/local/bin/flake8-3.6", line 6, in <module> from pkg_resources import load_entry_point File "/usr/local/lib/python3.6/site-packages/pkg_resources/__init__.py", line 3098, in <module> @_call_aside File "/usr/local/lib/python3.6/site-packages/pkg_resources/__init__.py", line 3082, in _call_aside f(*args, **kwargs) File "/usr/local/lib/python3.6/site-packages/pkg_resources/__init__.py", line 3111, in _initialize_master_working_set working_set = WorkingSet._build_master() File "/usr/local/lib/python3.6/site-packages/pkg_resources/__init__.py", line 575, in _build_master return cls._build_from_requirements(__requires__) File "/usr/local/lib/python3.6/site-packages/pkg_resources/__init__.py", line 588, in _build_from_requirements dists = ws.resolve(reqs, Environment()) File "/usr/local/lib/python3.6/site-packages/pkg_resources/__init__.py", line 777, in resolve raise DistributionNotFound(req, requirers) pkg_resources.DistributionNotFound: The 'pyflakes<1.7.0,>=1.5.0' distribution was not found and is required by flake8 gmake: *** [Makefile:906: flake8] Error 1 Build step 'Execute shell' marked build as failure

See <https://ci.centos.org/job/libvirt-dbus-syntax-check/systems=libvirt-freebsd-10/68/display/redirect> ------------------------------------------ Started by upstream project "libvirt-dbus-syntax-check" build number 68 originally caused by: Started by upstream project "libvirt-dbus-build" build number 74 originally caused by: Started by upstream project "libvirt-glib-build" build number 73 originally caused by: Started by upstream project "libvirt-build" build number 95 originally caused by: Started by an SCM change [EnvInject] - Loading node environment variables. Building remotely on libvirt-freebsd-10 (libvirt) in workspace <https://ci.centos.org/job/libvirt-dbus-syntax-check/systems=libvirt-freebsd-10/ws/> [libvirt-dbus] $ /bin/sh -xe /tmp/jenkins3375372590100429114.sh + cd build + /usr/local/bin/gmake syntax-check /usr/local/bin/flake8-3.6 --show-source --ignore=E501 .. Traceback (most recent call last): File "/usr/local/lib/python3.6/site-packages/pkg_resources/__init__.py", line 573, in _build_master ws.require(__requires__) File "/usr/local/lib/python3.6/site-packages/pkg_resources/__init__.py", line 891, in require needed = self.resolve(parse_requirements(requirements)) File "/usr/local/lib/python3.6/site-packages/pkg_resources/__init__.py", line 782, in resolve raise VersionConflict(dist, req).with_context(dependent_req) pkg_resources.ContextualVersionConflict: (pyflakes 2.0.0 (/usr/local/lib/python3.6/site-packages), Requirement.parse('pyflakes<1.7.0,>=1.5.0'), {'flake8'}) During handling of the above exception, another exception occurred: Traceback (most recent call last): File "/usr/local/bin/flake8-3.6", line 6, in <module> from pkg_resources import load_entry_point File "/usr/local/lib/python3.6/site-packages/pkg_resources/__init__.py", line 3098, in <module> @_call_aside File "/usr/local/lib/python3.6/site-packages/pkg_resources/__init__.py", line 3082, in _call_aside f(*args, **kwargs) File "/usr/local/lib/python3.6/site-packages/pkg_resources/__init__.py", line 3111, in _initialize_master_working_set working_set = WorkingSet._build_master() File "/usr/local/lib/python3.6/site-packages/pkg_resources/__init__.py", line 575, in _build_master return cls._build_from_requirements(__requires__) File "/usr/local/lib/python3.6/site-packages/pkg_resources/__init__.py", line 588, in _build_from_requirements dists = ws.resolve(reqs, Environment()) File "/usr/local/lib/python3.6/site-packages/pkg_resources/__init__.py", line 777, in resolve raise DistributionNotFound(req, requirers) pkg_resources.DistributionNotFound: The 'pyflakes<1.7.0,>=1.5.0' distribution was not found and is required by flake8 gmake: *** [Makefile:906: flake8] Error 1 Build step 'Execute shell' marked build as failure

See <https://ci.centos.org/job/libvirt-dbus-syntax-check/systems=libvirt-freebsd-10/69/display/redirect> ------------------------------------------ Started by upstream project "libvirt-dbus-syntax-check" build number 69 originally caused by: Started by upstream project "libvirt-dbus-build" build number 75 originally caused by: Started by upstream project "libvirt-glib-build" build number 74 originally caused by: Started by upstream project "libvirt-build" build number 96 originally caused by: Started by an SCM change Started by an SCM change Started by an SCM change [EnvInject] - Loading node environment variables. Building remotely on libvirt-freebsd-10 (libvirt) in workspace <https://ci.centos.org/job/libvirt-dbus-syntax-check/systems=libvirt-freebsd-10/ws/> [libvirt-dbus] $ /bin/sh -xe /tmp/jenkins5349524882408362686.sh + cd build + /usr/local/bin/gmake syntax-check /usr/local/bin/flake8-3.6 --show-source --ignore=E501 .. Traceback (most recent call last): File "/usr/local/lib/python3.6/site-packages/pkg_resources/__init__.py", line 573, in _build_master ws.require(__requires__) File "/usr/local/lib/python3.6/site-packages/pkg_resources/__init__.py", line 891, in require needed = self.resolve(parse_requirements(requirements)) File "/usr/local/lib/python3.6/site-packages/pkg_resources/__init__.py", line 782, in resolve raise VersionConflict(dist, req).with_context(dependent_req) pkg_resources.ContextualVersionConflict: (pyflakes 2.0.0 (/usr/local/lib/python3.6/site-packages), Requirement.parse('pyflakes<1.7.0,>=1.5.0'), {'flake8'}) During handling of the above exception, another exception occurred: Traceback (most recent call last): File "/usr/local/bin/flake8-3.6", line 6, in <module> from pkg_resources import load_entry_point File "/usr/local/lib/python3.6/site-packages/pkg_resources/__init__.py", line 3098, in <module> @_call_aside File "/usr/local/lib/python3.6/site-packages/pkg_resources/__init__.py", line 3082, in _call_aside f(*args, **kwargs) File "/usr/local/lib/python3.6/site-packages/pkg_resources/__init__.py", line 3111, in _initialize_master_working_set working_set = WorkingSet._build_master() File "/usr/local/lib/python3.6/site-packages/pkg_resources/__init__.py", line 575, in _build_master return cls._build_from_requirements(__requires__) File "/usr/local/lib/python3.6/site-packages/pkg_resources/__init__.py", line 588, in _build_from_requirements dists = ws.resolve(reqs, Environment()) File "/usr/local/lib/python3.6/site-packages/pkg_resources/__init__.py", line 777, in resolve raise DistributionNotFound(req, requirers) pkg_resources.DistributionNotFound: The 'pyflakes<1.7.0,>=1.5.0' distribution was not found and is required by flake8 gmake: *** [Makefile:906: flake8] Error 1 Build step 'Execute shell' marked build as failure

See <https://ci.centos.org/job/libvirt-dbus-syntax-check/systems=libvirt-freebsd-10/70/display/redirect> ------------------------------------------ Started by upstream project "libvirt-dbus-syntax-check" build number 70 originally caused by: Started by upstream project "libvirt-dbus-build" build number 76 originally caused by: Started by upstream project "libvirt-glib-build" build number 75 originally caused by: Started by upstream project "libvirt-build" build number 97 originally caused by: Started by an SCM change [EnvInject] - Loading node environment variables. Building remotely on libvirt-freebsd-10 (libvirt) in workspace <https://ci.centos.org/job/libvirt-dbus-syntax-check/systems=libvirt-freebsd-10/ws/> [libvirt-dbus] $ /bin/sh -xe /tmp/jenkins4191027449538553910.sh + cd build + /usr/local/bin/gmake syntax-check /usr/local/bin/flake8-3.6 --show-source --ignore=E501 .. Traceback (most recent call last): File "/usr/local/lib/python3.6/site-packages/pkg_resources/__init__.py", line 573, in _build_master ws.require(__requires__) File "/usr/local/lib/python3.6/site-packages/pkg_resources/__init__.py", line 891, in require needed = self.resolve(parse_requirements(requirements)) File "/usr/local/lib/python3.6/site-packages/pkg_resources/__init__.py", line 782, in resolve raise VersionConflict(dist, req).with_context(dependent_req) pkg_resources.ContextualVersionConflict: (pyflakes 2.0.0 (/usr/local/lib/python3.6/site-packages), Requirement.parse('pyflakes<1.7.0,>=1.5.0'), {'flake8'}) During handling of the above exception, another exception occurred: Traceback (most recent call last): File "/usr/local/bin/flake8-3.6", line 6, in <module> from pkg_resources import load_entry_point File "/usr/local/lib/python3.6/site-packages/pkg_resources/__init__.py", line 3098, in <module> @_call_aside File "/usr/local/lib/python3.6/site-packages/pkg_resources/__init__.py", line 3082, in _call_aside f(*args, **kwargs) File "/usr/local/lib/python3.6/site-packages/pkg_resources/__init__.py", line 3111, in _initialize_master_working_set working_set = WorkingSet._build_master() File "/usr/local/lib/python3.6/site-packages/pkg_resources/__init__.py", line 575, in _build_master return cls._build_from_requirements(__requires__) File "/usr/local/lib/python3.6/site-packages/pkg_resources/__init__.py", line 588, in _build_from_requirements dists = ws.resolve(reqs, Environment()) File "/usr/local/lib/python3.6/site-packages/pkg_resources/__init__.py", line 777, in resolve raise DistributionNotFound(req, requirers) pkg_resources.DistributionNotFound: The 'pyflakes<1.7.0,>=1.5.0' distribution was not found and is required by flake8 gmake: *** [Makefile:906: flake8] Error 1 Build step 'Execute shell' marked build as failure

See <https://ci.centos.org/job/libvirt-dbus-syntax-check/systems=libvirt-freebsd-10/71/display/redirect> ------------------------------------------ Started by upstream project "libvirt-dbus-syntax-check" build number 71 originally caused by: Started by upstream project "libvirt-dbus-build" build number 77 originally caused by: Started by upstream project "libvirt-glib-build" build number 76 originally caused by: Started by upstream project "libvirt-build" build number 98 originally caused by: Started by an SCM change [EnvInject] - Loading node environment variables. Building remotely on libvirt-freebsd-10 (libvirt) in workspace <https://ci.centos.org/job/libvirt-dbus-syntax-check/systems=libvirt-freebsd-10/ws/> [libvirt-dbus] $ /bin/sh -xe /tmp/jenkins1209217192878942578.sh + cd build + /usr/local/bin/gmake syntax-check /usr/local/bin/flake8-3.6 --show-source --ignore=E501 .. Traceback (most recent call last): File "/usr/local/lib/python3.6/site-packages/pkg_resources/__init__.py", line 573, in _build_master ws.require(__requires__) File "/usr/local/lib/python3.6/site-packages/pkg_resources/__init__.py", line 891, in require needed = self.resolve(parse_requirements(requirements)) File "/usr/local/lib/python3.6/site-packages/pkg_resources/__init__.py", line 782, in resolve raise VersionConflict(dist, req).with_context(dependent_req) pkg_resources.ContextualVersionConflict: (pyflakes 2.0.0 (/usr/local/lib/python3.6/site-packages), Requirement.parse('pyflakes<1.7.0,>=1.5.0'), {'flake8'}) During handling of the above exception, another exception occurred: Traceback (most recent call last): File "/usr/local/bin/flake8-3.6", line 6, in <module> from pkg_resources import load_entry_point File "/usr/local/lib/python3.6/site-packages/pkg_resources/__init__.py", line 3098, in <module> @_call_aside File "/usr/local/lib/python3.6/site-packages/pkg_resources/__init__.py", line 3082, in _call_aside f(*args, **kwargs) File "/usr/local/lib/python3.6/site-packages/pkg_resources/__init__.py", line 3111, in _initialize_master_working_set working_set = WorkingSet._build_master() File "/usr/local/lib/python3.6/site-packages/pkg_resources/__init__.py", line 575, in _build_master return cls._build_from_requirements(__requires__) File "/usr/local/lib/python3.6/site-packages/pkg_resources/__init__.py", line 588, in _build_from_requirements dists = ws.resolve(reqs, Environment()) File "/usr/local/lib/python3.6/site-packages/pkg_resources/__init__.py", line 777, in resolve raise DistributionNotFound(req, requirers) pkg_resources.DistributionNotFound: The 'pyflakes<1.7.0,>=1.5.0' distribution was not found and is required by flake8 gmake: *** [Makefile:906: flake8] Error 1 Build step 'Execute shell' marked build as failure

See <https://ci.centos.org/job/libvirt-dbus-syntax-check/systems=libvirt-freebsd-10/72/display/redirect> ------------------------------------------ Started by upstream project "libvirt-dbus-syntax-check" build number 72 originally caused by: Started by upstream project "libvirt-dbus-build" build number 78 originally caused by: Started by upstream project "libvirt-glib-build" build number 77 originally caused by: Started by upstream project "libvirt-build" build number 99 originally caused by: Started by an SCM change [EnvInject] - Loading node environment variables. Building remotely on libvirt-freebsd-10 (libvirt) in workspace <https://ci.centos.org/job/libvirt-dbus-syntax-check/systems=libvirt-freebsd-10/ws/> [libvirt-dbus] $ /bin/sh -xe /tmp/jenkins3400171441025235725.sh + cd build + /usr/local/bin/gmake syntax-check /usr/local/bin/flake8-3.6 --show-source --ignore=E501 .. Traceback (most recent call last): File "/usr/local/lib/python3.6/site-packages/pkg_resources/__init__.py", line 573, in _build_master ws.require(__requires__) File "/usr/local/lib/python3.6/site-packages/pkg_resources/__init__.py", line 891, in require needed = self.resolve(parse_requirements(requirements)) File "/usr/local/lib/python3.6/site-packages/pkg_resources/__init__.py", line 782, in resolve raise VersionConflict(dist, req).with_context(dependent_req) pkg_resources.ContextualVersionConflict: (pyflakes 2.0.0 (/usr/local/lib/python3.6/site-packages), Requirement.parse('pyflakes<1.7.0,>=1.5.0'), {'flake8'}) During handling of the above exception, another exception occurred: Traceback (most recent call last): File "/usr/local/bin/flake8-3.6", line 6, in <module> from pkg_resources import load_entry_point File "/usr/local/lib/python3.6/site-packages/pkg_resources/__init__.py", line 3098, in <module> @_call_aside File "/usr/local/lib/python3.6/site-packages/pkg_resources/__init__.py", line 3082, in _call_aside f(*args, **kwargs) File "/usr/local/lib/python3.6/site-packages/pkg_resources/__init__.py", line 3111, in _initialize_master_working_set working_set = WorkingSet._build_master() File "/usr/local/lib/python3.6/site-packages/pkg_resources/__init__.py", line 575, in _build_master return cls._build_from_requirements(__requires__) File "/usr/local/lib/python3.6/site-packages/pkg_resources/__init__.py", line 588, in _build_from_requirements dists = ws.resolve(reqs, Environment()) File "/usr/local/lib/python3.6/site-packages/pkg_resources/__init__.py", line 777, in resolve raise DistributionNotFound(req, requirers) pkg_resources.DistributionNotFound: The 'pyflakes<1.7.0,>=1.5.0' distribution was not found and is required by flake8 gmake: *** [Makefile:906: flake8] Error 1 Build step 'Execute shell' marked build as failure

See <https://ci.centos.org/job/libvirt-dbus-syntax-check/systems=libvirt-freebsd-10/73/display/redirect> ------------------------------------------ Started by upstream project "libvirt-dbus-syntax-check" build number 73 originally caused by: Started by upstream project "libvirt-dbus-build" build number 79 originally caused by: Started by upstream project "libvirt-glib-build" build number 78 originally caused by: Started by upstream project "libvirt-build" build number 100 originally caused by: Started by an SCM change [EnvInject] - Loading node environment variables. Building remotely on libvirt-freebsd-10 (libvirt) in workspace <https://ci.centos.org/job/libvirt-dbus-syntax-check/systems=libvirt-freebsd-10/ws/> [libvirt-dbus] $ /bin/sh -xe /tmp/jenkins8991002384268837454.sh + cd build + /usr/local/bin/gmake syntax-check /usr/local/bin/flake8-3.6 --show-source --ignore=E501 .. Traceback (most recent call last): File "/usr/local/lib/python3.6/site-packages/pkg_resources/__init__.py", line 573, in _build_master ws.require(__requires__) File "/usr/local/lib/python3.6/site-packages/pkg_resources/__init__.py", line 891, in require needed = self.resolve(parse_requirements(requirements)) File "/usr/local/lib/python3.6/site-packages/pkg_resources/__init__.py", line 782, in resolve raise VersionConflict(dist, req).with_context(dependent_req) pkg_resources.ContextualVersionConflict: (pyflakes 2.0.0 (/usr/local/lib/python3.6/site-packages), Requirement.parse('pyflakes<1.7.0,>=1.5.0'), {'flake8'}) During handling of the above exception, another exception occurred: Traceback (most recent call last): File "/usr/local/bin/flake8-3.6", line 6, in <module> from pkg_resources import load_entry_point File "/usr/local/lib/python3.6/site-packages/pkg_resources/__init__.py", line 3098, in <module> @_call_aside File "/usr/local/lib/python3.6/site-packages/pkg_resources/__init__.py", line 3082, in _call_aside f(*args, **kwargs) File "/usr/local/lib/python3.6/site-packages/pkg_resources/__init__.py", line 3111, in _initialize_master_working_set working_set = WorkingSet._build_master() File "/usr/local/lib/python3.6/site-packages/pkg_resources/__init__.py", line 575, in _build_master return cls._build_from_requirements(__requires__) File "/usr/local/lib/python3.6/site-packages/pkg_resources/__init__.py", line 588, in _build_from_requirements dists = ws.resolve(reqs, Environment()) File "/usr/local/lib/python3.6/site-packages/pkg_resources/__init__.py", line 777, in resolve raise DistributionNotFound(req, requirers) pkg_resources.DistributionNotFound: The 'pyflakes<1.7.0,>=1.5.0' distribution was not found and is required by flake8 gmake: *** [Makefile:906: flake8] Error 1 Build step 'Execute shell' marked build as failure

See <https://ci.centos.org/job/libvirt-dbus-syntax-check/systems=libvirt-freebsd-10/74/display/redirect> ------------------------------------------ Started by upstream project "libvirt-dbus-syntax-check" build number 74 originally caused by: Started by upstream project "libvirt-dbus-build" build number 80 originally caused by: Started by upstream project "libvirt-glib-build" build number 79 originally caused by: Started by upstream project "libvirt-build" build number 101 originally caused by: Started by an SCM change [EnvInject] - Loading node environment variables. Building remotely on libvirt-freebsd-10 (libvirt) in workspace <https://ci.centos.org/job/libvirt-dbus-syntax-check/systems=libvirt-freebsd-10/ws/> [libvirt-dbus] $ /bin/sh -xe /tmp/jenkins2827510452232425331.sh + cd build + /usr/local/bin/gmake syntax-check /usr/local/bin/flake8-3.6 --show-source --ignore=E501 .. Traceback (most recent call last): File "/usr/local/lib/python3.6/site-packages/pkg_resources/__init__.py", line 573, in _build_master ws.require(__requires__) File "/usr/local/lib/python3.6/site-packages/pkg_resources/__init__.py", line 891, in require needed = self.resolve(parse_requirements(requirements)) File "/usr/local/lib/python3.6/site-packages/pkg_resources/__init__.py", line 782, in resolve raise VersionConflict(dist, req).with_context(dependent_req) pkg_resources.ContextualVersionConflict: (pyflakes 2.0.0 (/usr/local/lib/python3.6/site-packages), Requirement.parse('pyflakes<1.7.0,>=1.5.0'), {'flake8'}) During handling of the above exception, another exception occurred: Traceback (most recent call last): File "/usr/local/bin/flake8-3.6", line 6, in <module> from pkg_resources import load_entry_point File "/usr/local/lib/python3.6/site-packages/pkg_resources/__init__.py", line 3098, in <module> @_call_aside File "/usr/local/lib/python3.6/site-packages/pkg_resources/__init__.py", line 3082, in _call_aside f(*args, **kwargs) File "/usr/local/lib/python3.6/site-packages/pkg_resources/__init__.py", line 3111, in _initialize_master_working_set working_set = WorkingSet._build_master() File "/usr/local/lib/python3.6/site-packages/pkg_resources/__init__.py", line 575, in _build_master return cls._build_from_requirements(__requires__) File "/usr/local/lib/python3.6/site-packages/pkg_resources/__init__.py", line 588, in _build_from_requirements dists = ws.resolve(reqs, Environment()) File "/usr/local/lib/python3.6/site-packages/pkg_resources/__init__.py", line 777, in resolve raise DistributionNotFound(req, requirers) pkg_resources.DistributionNotFound: The 'pyflakes<1.7.0,>=1.5.0' distribution was not found and is required by flake8 gmake: *** [Makefile:906: flake8] Error 1 Build step 'Execute shell' marked build as failure

See <https://ci.centos.org/job/libvirt-dbus-syntax-check/systems=libvirt-freebsd-10/75/display/redirect> ------------------------------------------ Started by upstream project "libvirt-dbus-syntax-check" build number 75 originally caused by: Started by upstream project "libvirt-dbus-build" build number 81 originally caused by: Started by upstream project "libvirt-glib-build" build number 80 originally caused by: Started by upstream project "libvirt-build" build number 102 originally caused by: Started by an SCM change [EnvInject] - Loading node environment variables. Building remotely on libvirt-freebsd-10 (libvirt) in workspace <https://ci.centos.org/job/libvirt-dbus-syntax-check/systems=libvirt-freebsd-10/ws/> [libvirt-dbus] $ /bin/sh -xe /tmp/jenkins7083111459451004345.sh + cd build + /usr/local/bin/gmake syntax-check /usr/local/bin/flake8-3.6 --show-source --ignore=E501 .. Traceback (most recent call last): File "/usr/local/lib/python3.6/site-packages/pkg_resources/__init__.py", line 573, in _build_master ws.require(__requires__) File "/usr/local/lib/python3.6/site-packages/pkg_resources/__init__.py", line 891, in require needed = self.resolve(parse_requirements(requirements)) File "/usr/local/lib/python3.6/site-packages/pkg_resources/__init__.py", line 782, in resolve raise VersionConflict(dist, req).with_context(dependent_req) pkg_resources.ContextualVersionConflict: (pyflakes 2.0.0 (/usr/local/lib/python3.6/site-packages), Requirement.parse('pyflakes<1.7.0,>=1.5.0'), {'flake8'}) During handling of the above exception, another exception occurred: Traceback (most recent call last): File "/usr/local/bin/flake8-3.6", line 6, in <module> from pkg_resources import load_entry_point File "/usr/local/lib/python3.6/site-packages/pkg_resources/__init__.py", line 3098, in <module> @_call_aside File "/usr/local/lib/python3.6/site-packages/pkg_resources/__init__.py", line 3082, in _call_aside f(*args, **kwargs) File "/usr/local/lib/python3.6/site-packages/pkg_resources/__init__.py", line 3111, in _initialize_master_working_set working_set = WorkingSet._build_master() File "/usr/local/lib/python3.6/site-packages/pkg_resources/__init__.py", line 575, in _build_master return cls._build_from_requirements(__requires__) File "/usr/local/lib/python3.6/site-packages/pkg_resources/__init__.py", line 588, in _build_from_requirements dists = ws.resolve(reqs, Environment()) File "/usr/local/lib/python3.6/site-packages/pkg_resources/__init__.py", line 777, in resolve raise DistributionNotFound(req, requirers) pkg_resources.DistributionNotFound: The 'pyflakes<1.7.0,>=1.5.0' distribution was not found and is required by flake8 gmake: *** [Makefile:906: flake8] Error 1 Build step 'Execute shell' marked build as failure

See <https://ci.centos.org/job/libvirt-dbus-syntax-check/systems=libvirt-freebsd-10/76/display/redirect> ------------------------------------------ Started by upstream project "libvirt-dbus-syntax-check" build number 76 originally caused by: Started by upstream project "libvirt-dbus-build" build number 82 originally caused by: Started by upstream project "libvirt-glib-build" build number 81 originally caused by: Started by upstream project "libvirt-build" build number 103 originally caused by: Started by an SCM change [EnvInject] - Loading node environment variables. Building remotely on libvirt-freebsd-10 (libvirt) in workspace <https://ci.centos.org/job/libvirt-dbus-syntax-check/systems=libvirt-freebsd-10/ws/> [libvirt-dbus] $ /bin/sh -xe /tmp/jenkins2531709300916781413.sh + cd build + /usr/local/bin/gmake syntax-check /usr/local/bin/flake8-3.6 --show-source --ignore=E501 .. Traceback (most recent call last): File "/usr/local/lib/python3.6/site-packages/pkg_resources/__init__.py", line 573, in _build_master ws.require(__requires__) File "/usr/local/lib/python3.6/site-packages/pkg_resources/__init__.py", line 891, in require needed = self.resolve(parse_requirements(requirements)) File "/usr/local/lib/python3.6/site-packages/pkg_resources/__init__.py", line 782, in resolve raise VersionConflict(dist, req).with_context(dependent_req) pkg_resources.ContextualVersionConflict: (pyflakes 2.0.0 (/usr/local/lib/python3.6/site-packages), Requirement.parse('pyflakes<1.7.0,>=1.5.0'), {'flake8'}) During handling of the above exception, another exception occurred: Traceback (most recent call last): File "/usr/local/bin/flake8-3.6", line 6, in <module> from pkg_resources import load_entry_point File "/usr/local/lib/python3.6/site-packages/pkg_resources/__init__.py", line 3098, in <module> @_call_aside File "/usr/local/lib/python3.6/site-packages/pkg_resources/__init__.py", line 3082, in _call_aside f(*args, **kwargs) File "/usr/local/lib/python3.6/site-packages/pkg_resources/__init__.py", line 3111, in _initialize_master_working_set working_set = WorkingSet._build_master() File "/usr/local/lib/python3.6/site-packages/pkg_resources/__init__.py", line 575, in _build_master return cls._build_from_requirements(__requires__) File "/usr/local/lib/python3.6/site-packages/pkg_resources/__init__.py", line 588, in _build_from_requirements dists = ws.resolve(reqs, Environment()) File "/usr/local/lib/python3.6/site-packages/pkg_resources/__init__.py", line 777, in resolve raise DistributionNotFound(req, requirers) pkg_resources.DistributionNotFound: The 'pyflakes<1.7.0,>=1.5.0' distribution was not found and is required by flake8 gmake: *** [Makefile:906: flake8] Error 1 Build step 'Execute shell' marked build as failure

See <https://ci.centos.org/job/libvirt-dbus-syntax-check/systems=libvirt-freebsd-10/77/display/redirect> ------------------------------------------ Started by upstream project "libvirt-dbus-syntax-check" build number 77 originally caused by: Started by upstream project "libvirt-dbus-build" build number 83 originally caused by: Started by upstream project "libvirt-glib-build" build number 82 originally caused by: Started by upstream project "libvirt-build" build number 104 originally caused by: Started by an SCM change [EnvInject] - Loading node environment variables. Building remotely on libvirt-freebsd-10 (libvirt) in workspace <https://ci.centos.org/job/libvirt-dbus-syntax-check/systems=libvirt-freebsd-10/ws/> [libvirt-dbus] $ /bin/sh -xe /tmp/jenkins8036295317471753455.sh + cd build + /usr/local/bin/gmake syntax-check /usr/local/bin/flake8-3.6 --show-source --ignore=E501 .. Traceback (most recent call last): File "/usr/local/lib/python3.6/site-packages/pkg_resources/__init__.py", line 573, in _build_master ws.require(__requires__) File "/usr/local/lib/python3.6/site-packages/pkg_resources/__init__.py", line 891, in require needed = self.resolve(parse_requirements(requirements)) File "/usr/local/lib/python3.6/site-packages/pkg_resources/__init__.py", line 782, in resolve raise VersionConflict(dist, req).with_context(dependent_req) pkg_resources.ContextualVersionConflict: (pyflakes 2.0.0 (/usr/local/lib/python3.6/site-packages), Requirement.parse('pyflakes<1.7.0,>=1.5.0'), {'flake8'}) During handling of the above exception, another exception occurred: Traceback (most recent call last): File "/usr/local/bin/flake8-3.6", line 6, in <module> from pkg_resources import load_entry_point File "/usr/local/lib/python3.6/site-packages/pkg_resources/__init__.py", line 3098, in <module> @_call_aside File "/usr/local/lib/python3.6/site-packages/pkg_resources/__init__.py", line 3082, in _call_aside f(*args, **kwargs) File "/usr/local/lib/python3.6/site-packages/pkg_resources/__init__.py", line 3111, in _initialize_master_working_set working_set = WorkingSet._build_master() File "/usr/local/lib/python3.6/site-packages/pkg_resources/__init__.py", line 575, in _build_master return cls._build_from_requirements(__requires__) File "/usr/local/lib/python3.6/site-packages/pkg_resources/__init__.py", line 588, in _build_from_requirements dists = ws.resolve(reqs, Environment()) File "/usr/local/lib/python3.6/site-packages/pkg_resources/__init__.py", line 777, in resolve raise DistributionNotFound(req, requirers) pkg_resources.DistributionNotFound: The 'pyflakes<1.7.0,>=1.5.0' distribution was not found and is required by flake8 gmake: *** [Makefile:906: flake8] Error 1 Build step 'Execute shell' marked build as failure

See <https://ci.centos.org/job/libvirt-dbus-syntax-check/systems=libvirt-freebsd-10/78/display/redirect> ------------------------------------------ Started by upstream project "libvirt-dbus-syntax-check" build number 78 originally caused by: Started by upstream project "libvirt-dbus-build" build number 84 originally caused by: Started by upstream project "libvirt-glib-build" build number 83 originally caused by: Started by upstream project "libvirt-build" build number 105 originally caused by: Started by an SCM change [EnvInject] - Loading node environment variables. Building remotely on libvirt-freebsd-10 (libvirt) in workspace <https://ci.centos.org/job/libvirt-dbus-syntax-check/systems=libvirt-freebsd-10/ws/> [libvirt-dbus] $ /bin/sh -xe /tmp/jenkins3872603252982310824.sh + cd build + /usr/local/bin/gmake syntax-check /usr/local/bin/flake8-3.6 --show-source --ignore=E501 .. Traceback (most recent call last): File "/usr/local/lib/python3.6/site-packages/pkg_resources/__init__.py", line 573, in _build_master ws.require(__requires__) File "/usr/local/lib/python3.6/site-packages/pkg_resources/__init__.py", line 891, in require needed = self.resolve(parse_requirements(requirements)) File "/usr/local/lib/python3.6/site-packages/pkg_resources/__init__.py", line 782, in resolve raise VersionConflict(dist, req).with_context(dependent_req) pkg_resources.ContextualVersionConflict: (pyflakes 2.0.0 (/usr/local/lib/python3.6/site-packages), Requirement.parse('pyflakes<1.7.0,>=1.5.0'), {'flake8'}) During handling of the above exception, another exception occurred: Traceback (most recent call last): File "/usr/local/bin/flake8-3.6", line 6, in <module> from pkg_resources import load_entry_point File "/usr/local/lib/python3.6/site-packages/pkg_resources/__init__.py", line 3098, in <module> @_call_aside File "/usr/local/lib/python3.6/site-packages/pkg_resources/__init__.py", line 3082, in _call_aside f(*args, **kwargs) File "/usr/local/lib/python3.6/site-packages/pkg_resources/__init__.py", line 3111, in _initialize_master_working_set working_set = WorkingSet._build_master() File "/usr/local/lib/python3.6/site-packages/pkg_resources/__init__.py", line 575, in _build_master return cls._build_from_requirements(__requires__) File "/usr/local/lib/python3.6/site-packages/pkg_resources/__init__.py", line 588, in _build_from_requirements dists = ws.resolve(reqs, Environment()) File "/usr/local/lib/python3.6/site-packages/pkg_resources/__init__.py", line 777, in resolve raise DistributionNotFound(req, requirers) pkg_resources.DistributionNotFound: The 'pyflakes<1.7.0,>=1.5.0' distribution was not found and is required by flake8 gmake: *** [Makefile:906: flake8] Error 1 Build step 'Execute shell' marked build as failure

See <https://ci.centos.org/job/libvirt-dbus-syntax-check/systems=libvirt-freebsd-10/79/display/redirect> ------------------------------------------ Started by upstream project "libvirt-dbus-syntax-check" build number 79 originally caused by: Started by upstream project "libvirt-dbus-build" build number 85 originally caused by: Started by upstream project "libvirt-glib-build" build number 84 originally caused by: Started by upstream project "libvirt-build" build number 106 originally caused by: Started by an SCM change [EnvInject] - Loading node environment variables. Building remotely on libvirt-freebsd-10 (libvirt) in workspace <https://ci.centos.org/job/libvirt-dbus-syntax-check/systems=libvirt-freebsd-10/ws/> [libvirt-dbus] $ /bin/sh -xe /tmp/jenkins8048625369789500916.sh + cd build + /usr/local/bin/gmake syntax-check /usr/local/bin/flake8-3.6 --show-source --ignore=E501 .. Traceback (most recent call last): File "/usr/local/lib/python3.6/site-packages/pkg_resources/__init__.py", line 573, in _build_master ws.require(__requires__) File "/usr/local/lib/python3.6/site-packages/pkg_resources/__init__.py", line 891, in require needed = self.resolve(parse_requirements(requirements)) File "/usr/local/lib/python3.6/site-packages/pkg_resources/__init__.py", line 782, in resolve raise VersionConflict(dist, req).with_context(dependent_req) pkg_resources.ContextualVersionConflict: (pyflakes 2.0.0 (/usr/local/lib/python3.6/site-packages), Requirement.parse('pyflakes<1.7.0,>=1.5.0'), {'flake8'}) During handling of the above exception, another exception occurred: Traceback (most recent call last): File "/usr/local/bin/flake8-3.6", line 6, in <module> from pkg_resources import load_entry_point File "/usr/local/lib/python3.6/site-packages/pkg_resources/__init__.py", line 3098, in <module> @_call_aside File "/usr/local/lib/python3.6/site-packages/pkg_resources/__init__.py", line 3082, in _call_aside f(*args, **kwargs) File "/usr/local/lib/python3.6/site-packages/pkg_resources/__init__.py", line 3111, in _initialize_master_working_set working_set = WorkingSet._build_master() File "/usr/local/lib/python3.6/site-packages/pkg_resources/__init__.py", line 575, in _build_master return cls._build_from_requirements(__requires__) File "/usr/local/lib/python3.6/site-packages/pkg_resources/__init__.py", line 588, in _build_from_requirements dists = ws.resolve(reqs, Environment()) File "/usr/local/lib/python3.6/site-packages/pkg_resources/__init__.py", line 777, in resolve raise DistributionNotFound(req, requirers) pkg_resources.DistributionNotFound: The 'pyflakes<1.7.0,>=1.5.0' distribution was not found and is required by flake8 gmake: *** [Makefile:906: flake8] Error 1 Build step 'Execute shell' marked build as failure

See <https://ci.centos.org/job/libvirt-dbus-syntax-check/systems=libvirt-freebsd-10/80/display/redirect> ------------------------------------------ Started by upstream project "libvirt-dbus-syntax-check" build number 80 originally caused by: Started by upstream project "libvirt-dbus-build" build number 86 originally caused by: Started by upstream project "libvirt-glib-build" build number 85 originally caused by: Started by upstream project "libvirt-build" build number 107 originally caused by: Started by an SCM change [EnvInject] - Loading node environment variables. Building remotely on libvirt-freebsd-10 (libvirt) in workspace <https://ci.centos.org/job/libvirt-dbus-syntax-check/systems=libvirt-freebsd-10/ws/> [libvirt-dbus] $ /bin/sh -xe /tmp/jenkins7016083847204581186.sh + cd build + /usr/local/bin/gmake syntax-check /usr/local/bin/flake8-3.6 --show-source --ignore=E501 .. Traceback (most recent call last): File "/usr/local/lib/python3.6/site-packages/pkg_resources/__init__.py", line 573, in _build_master ws.require(__requires__) File "/usr/local/lib/python3.6/site-packages/pkg_resources/__init__.py", line 891, in require needed = self.resolve(parse_requirements(requirements)) File "/usr/local/lib/python3.6/site-packages/pkg_resources/__init__.py", line 782, in resolve raise VersionConflict(dist, req).with_context(dependent_req) pkg_resources.ContextualVersionConflict: (pyflakes 2.0.0 (/usr/local/lib/python3.6/site-packages), Requirement.parse('pyflakes<1.7.0,>=1.5.0'), {'flake8'}) During handling of the above exception, another exception occurred: Traceback (most recent call last): File "/usr/local/bin/flake8-3.6", line 6, in <module> from pkg_resources import load_entry_point File "/usr/local/lib/python3.6/site-packages/pkg_resources/__init__.py", line 3098, in <module> @_call_aside File "/usr/local/lib/python3.6/site-packages/pkg_resources/__init__.py", line 3082, in _call_aside f(*args, **kwargs) File "/usr/local/lib/python3.6/site-packages/pkg_resources/__init__.py", line 3111, in _initialize_master_working_set working_set = WorkingSet._build_master() File "/usr/local/lib/python3.6/site-packages/pkg_resources/__init__.py", line 575, in _build_master return cls._build_from_requirements(__requires__) File "/usr/local/lib/python3.6/site-packages/pkg_resources/__init__.py", line 588, in _build_from_requirements dists = ws.resolve(reqs, Environment()) File "/usr/local/lib/python3.6/site-packages/pkg_resources/__init__.py", line 777, in resolve raise DistributionNotFound(req, requirers) pkg_resources.DistributionNotFound: The 'pyflakes<1.7.0,>=1.5.0' distribution was not found and is required by flake8 gmake: *** [Makefile:906: flake8] Error 1 Build step 'Execute shell' marked build as failure

See <https://ci.centos.org/job/libvirt-dbus-syntax-check/systems=libvirt-freebsd-10/81/display/redirect> ------------------------------------------ Started by upstream project "libvirt-dbus-syntax-check" build number 81 originally caused by: Started by upstream project "libvirt-dbus-build" build number 87 originally caused by: Started by upstream project "libvirt-glib-build" build number 86 originally caused by: Started by upstream project "libvirt-build" build number 108 originally caused by: Started by an SCM change [EnvInject] - Loading node environment variables. Building remotely on libvirt-freebsd-10 (libvirt) in workspace <https://ci.centos.org/job/libvirt-dbus-syntax-check/systems=libvirt-freebsd-10/ws/> [libvirt-dbus] $ /bin/sh -xe /tmp/jenkins4046386435667151715.sh + cd build + /usr/local/bin/gmake syntax-check /usr/local/bin/flake8-3.6 --show-source --ignore=E501 .. Traceback (most recent call last): File "/usr/local/lib/python3.6/site-packages/pkg_resources/__init__.py", line 573, in _build_master ws.require(__requires__) File "/usr/local/lib/python3.6/site-packages/pkg_resources/__init__.py", line 891, in require needed = self.resolve(parse_requirements(requirements)) File "/usr/local/lib/python3.6/site-packages/pkg_resources/__init__.py", line 782, in resolve raise VersionConflict(dist, req).with_context(dependent_req) pkg_resources.ContextualVersionConflict: (pyflakes 2.0.0 (/usr/local/lib/python3.6/site-packages), Requirement.parse('pyflakes<1.7.0,>=1.5.0'), {'flake8'}) During handling of the above exception, another exception occurred: Traceback (most recent call last): File "/usr/local/bin/flake8-3.6", line 6, in <module> from pkg_resources import load_entry_point File "/usr/local/lib/python3.6/site-packages/pkg_resources/__init__.py", line 3098, in <module> @_call_aside File "/usr/local/lib/python3.6/site-packages/pkg_resources/__init__.py", line 3082, in _call_aside f(*args, **kwargs) File "/usr/local/lib/python3.6/site-packages/pkg_resources/__init__.py", line 3111, in _initialize_master_working_set working_set = WorkingSet._build_master() File "/usr/local/lib/python3.6/site-packages/pkg_resources/__init__.py", line 575, in _build_master return cls._build_from_requirements(__requires__) File "/usr/local/lib/python3.6/site-packages/pkg_resources/__init__.py", line 588, in _build_from_requirements dists = ws.resolve(reqs, Environment()) File "/usr/local/lib/python3.6/site-packages/pkg_resources/__init__.py", line 777, in resolve raise DistributionNotFound(req, requirers) pkg_resources.DistributionNotFound: The 'pyflakes<1.7.0,>=1.5.0' distribution was not found and is required by flake8 gmake: *** [Makefile:906: flake8] Error 1 Build step 'Execute shell' marked build as failure

See <https://ci.centos.org/job/libvirt-dbus-syntax-check/systems=libvirt-freebsd-10/82/display/redirect> ------------------------------------------ Started by upstream project "libvirt-dbus-syntax-check" build number 82 originally caused by: Started by upstream project "libvirt-dbus-build" build number 88 originally caused by: Started by upstream project "libvirt-glib-build" build number 87 originally caused by: Started by upstream project "libvirt-build" build number 109 originally caused by: Started by an SCM change [EnvInject] - Loading node environment variables. Building remotely on libvirt-freebsd-10 (libvirt) in workspace <https://ci.centos.org/job/libvirt-dbus-syntax-check/systems=libvirt-freebsd-10/ws/> [libvirt-dbus] $ /bin/sh -xe /tmp/jenkins7657028486831950920.sh + cd build + /usr/local/bin/gmake syntax-check /usr/local/bin/flake8-3.6 --show-source --ignore=E501 .. Traceback (most recent call last): File "/usr/local/lib/python3.6/site-packages/pkg_resources/__init__.py", line 573, in _build_master ws.require(__requires__) File "/usr/local/lib/python3.6/site-packages/pkg_resources/__init__.py", line 891, in require needed = self.resolve(parse_requirements(requirements)) File "/usr/local/lib/python3.6/site-packages/pkg_resources/__init__.py", line 782, in resolve raise VersionConflict(dist, req).with_context(dependent_req) pkg_resources.ContextualVersionConflict: (pyflakes 2.0.0 (/usr/local/lib/python3.6/site-packages), Requirement.parse('pyflakes<1.7.0,>=1.5.0'), {'flake8'}) During handling of the above exception, another exception occurred: Traceback (most recent call last): File "/usr/local/bin/flake8-3.6", line 6, in <module> from pkg_resources import load_entry_point File "/usr/local/lib/python3.6/site-packages/pkg_resources/__init__.py", line 3098, in <module> @_call_aside File "/usr/local/lib/python3.6/site-packages/pkg_resources/__init__.py", line 3082, in _call_aside f(*args, **kwargs) File "/usr/local/lib/python3.6/site-packages/pkg_resources/__init__.py", line 3111, in _initialize_master_working_set working_set = WorkingSet._build_master() File "/usr/local/lib/python3.6/site-packages/pkg_resources/__init__.py", line 575, in _build_master return cls._build_from_requirements(__requires__) File "/usr/local/lib/python3.6/site-packages/pkg_resources/__init__.py", line 588, in _build_from_requirements dists = ws.resolve(reqs, Environment()) File "/usr/local/lib/python3.6/site-packages/pkg_resources/__init__.py", line 777, in resolve raise DistributionNotFound(req, requirers) pkg_resources.DistributionNotFound: The 'pyflakes<1.7.0,>=1.5.0' distribution was not found and is required by flake8 gmake: *** [Makefile:906: flake8] Error 1 Build step 'Execute shell' marked build as failure

See <https://ci.centos.org/job/libvirt-dbus-syntax-check/systems=libvirt-freebsd-10/83/display/redirect> ------------------------------------------ Started by upstream project "libvirt-dbus-syntax-check" build number 83 originally caused by: Started by upstream project "libvirt-dbus-build" build number 89 originally caused by: Started by upstream project "libvirt-glib-build" build number 88 originally caused by: Started by upstream project "libvirt-build" build number 110 originally caused by: Started by an SCM change [EnvInject] - Loading node environment variables. Building remotely on libvirt-freebsd-10 (libvirt) in workspace <https://ci.centos.org/job/libvirt-dbus-syntax-check/systems=libvirt-freebsd-10/ws/> [libvirt-dbus] $ /bin/sh -xe /tmp/jenkins7396335756882236796.sh + cd build + /usr/local/bin/gmake syntax-check /usr/local/bin/flake8-3.6 --show-source --ignore=E501 .. Traceback (most recent call last): File "/usr/local/lib/python3.6/site-packages/pkg_resources/__init__.py", line 573, in _build_master ws.require(__requires__) File "/usr/local/lib/python3.6/site-packages/pkg_resources/__init__.py", line 891, in require needed = self.resolve(parse_requirements(requirements)) File "/usr/local/lib/python3.6/site-packages/pkg_resources/__init__.py", line 782, in resolve raise VersionConflict(dist, req).with_context(dependent_req) pkg_resources.ContextualVersionConflict: (pyflakes 2.0.0 (/usr/local/lib/python3.6/site-packages), Requirement.parse('pyflakes<1.7.0,>=1.5.0'), {'flake8'}) During handling of the above exception, another exception occurred: Traceback (most recent call last): File "/usr/local/bin/flake8-3.6", line 6, in <module> from pkg_resources import load_entry_point File "/usr/local/lib/python3.6/site-packages/pkg_resources/__init__.py", line 3098, in <module> @_call_aside File "/usr/local/lib/python3.6/site-packages/pkg_resources/__init__.py", line 3082, in _call_aside f(*args, **kwargs) File "/usr/local/lib/python3.6/site-packages/pkg_resources/__init__.py", line 3111, in _initialize_master_working_set working_set = WorkingSet._build_master() File "/usr/local/lib/python3.6/site-packages/pkg_resources/__init__.py", line 575, in _build_master return cls._build_from_requirements(__requires__) File "/usr/local/lib/python3.6/site-packages/pkg_resources/__init__.py", line 588, in _build_from_requirements dists = ws.resolve(reqs, Environment()) File "/usr/local/lib/python3.6/site-packages/pkg_resources/__init__.py", line 777, in resolve raise DistributionNotFound(req, requirers) pkg_resources.DistributionNotFound: The 'pyflakes<1.7.0,>=1.5.0' distribution was not found and is required by flake8 gmake: *** [Makefile:906: flake8] Error 1 Build step 'Execute shell' marked build as failure

See <https://ci.centos.org/job/libvirt-dbus-syntax-check/systems=libvirt-freebsd-10/84/display/redirect> ------------------------------------------ Started by upstream project "libvirt-dbus-syntax-check" build number 84 originally caused by: Started by upstream project "libvirt-dbus-build" build number 90 originally caused by: Started by upstream project "libvirt-glib-build" build number 89 originally caused by: Started by upstream project "libvirt-build" build number 111 originally caused by: Started by an SCM change [EnvInject] - Loading node environment variables. Building remotely on libvirt-freebsd-10 (libvirt) in workspace <https://ci.centos.org/job/libvirt-dbus-syntax-check/systems=libvirt-freebsd-10/ws/> [libvirt-dbus] $ /bin/sh -xe /tmp/jenkins3469322912234080592.sh + cd build + /usr/local/bin/gmake syntax-check /usr/local/bin/flake8-3.6 --show-source --ignore=E501 .. Traceback (most recent call last): File "/usr/local/lib/python3.6/site-packages/pkg_resources/__init__.py", line 573, in _build_master ws.require(__requires__) File "/usr/local/lib/python3.6/site-packages/pkg_resources/__init__.py", line 891, in require needed = self.resolve(parse_requirements(requirements)) File "/usr/local/lib/python3.6/site-packages/pkg_resources/__init__.py", line 782, in resolve raise VersionConflict(dist, req).with_context(dependent_req) pkg_resources.ContextualVersionConflict: (pyflakes 2.0.0 (/usr/local/lib/python3.6/site-packages), Requirement.parse('pyflakes<1.7.0,>=1.5.0'), {'flake8'}) During handling of the above exception, another exception occurred: Traceback (most recent call last): File "/usr/local/bin/flake8-3.6", line 6, in <module> from pkg_resources import load_entry_point File "/usr/local/lib/python3.6/site-packages/pkg_resources/__init__.py", line 3098, in <module> @_call_aside File "/usr/local/lib/python3.6/site-packages/pkg_resources/__init__.py", line 3082, in _call_aside f(*args, **kwargs) File "/usr/local/lib/python3.6/site-packages/pkg_resources/__init__.py", line 3111, in _initialize_master_working_set working_set = WorkingSet._build_master() File "/usr/local/lib/python3.6/site-packages/pkg_resources/__init__.py", line 575, in _build_master return cls._build_from_requirements(__requires__) File "/usr/local/lib/python3.6/site-packages/pkg_resources/__init__.py", line 588, in _build_from_requirements dists = ws.resolve(reqs, Environment()) File "/usr/local/lib/python3.6/site-packages/pkg_resources/__init__.py", line 777, in resolve raise DistributionNotFound(req, requirers) pkg_resources.DistributionNotFound: The 'pyflakes<1.7.0,>=1.5.0' distribution was not found and is required by flake8 gmake: *** [Makefile:906: flake8] Error 1 Build step 'Execute shell' marked build as failure
participants (1)
-
ci@centos.org