[Libvirt-ci] Build failed in Jenkins: libvirt-master-check » libvirt-fedora-25 #696

See <https://ci.centos.org/job/libvirt-master-check/systems=libvirt-fedora-25/696/display/redirect> ------------------------------------------ [...truncated 25.52 KB...] PASS: test-getsockopt PASS: test-getsockname PASS: test-grantpt PASS: test-ignore-value PASS: test-gettimeofday PASS: test-inet_pton PASS: test-intprops PASS: test-inet_ntop PASS: test-getaddrinfo PASS: test-inttypes PASS: test-ioctl PASS: test-isatty PASS: test-isnand-nolibm PASS: test-isblank PASS: test-isnanf-nolibm PASS: test-langinfo PASS: test-isnanl-nolibm PASS: test-listen PASS: test-locale PASS: test-localeconv PASS: test-limits-h PASS: test-ldexp PASS: test-lstat PASS: test-malloca PASS: test-math PASS: test-mbrtowc1.sh PASS: test-mbrtowc2.sh PASS: test-mbrtowc3.sh PASS: test-mbrtowc4.sh PASS: test-mbrtowc5.sh SKIP: test-mbrtowc-w32-1.sh SKIP: test-mbrtowc-w32-2.sh SKIP: test-mbrtowc-w32-3.sh SKIP: test-mbrtowc-w32-4.sh SKIP: test-mbrtowc-w32-5.sh PASS: test-mbsinit.sh PASS: test-mbsrtowcs1.sh PASS: test-mbsrtowcs2.sh PASS: test-mbsrtowcs3.sh PASS: test-mbsrtowcs4.sh PASS: test-memchr PASS: test-nanosleep PASS: test-net_if PASS: test-netdb PASS: test-netinet_in PASS: test-nl_langinfo.sh PASS: test-lseek.sh PASS: test-localename PASS: test-nonblocking PASS: test-open PASS: test-openpty PASS: test-passfd PASS: test-pathmax PASS: test-perror.sh PASS: test-perror2 PASS: test-pipe PASS: test-pipe2 PASS: test-poll-h PASS: test-poll PASS: test-posix_openpt PASS: test-posix_spawn_file_actions_addclose PASS: test-posix_spawn_file_actions_adddup2 PASS: test-posix_spawn_file_actions_addopen PASS: test-posix_spawn1 PASS: test-nonblocking-pipe.sh PASS: test-posix_spawn2 PASS: test-pthread_sigmask1 PASS: test-pthread_sigmask2 SKIP: test-ptsname SKIP: test-ptsname_r PASS: test-random_r PASS: test-raise PASS: test-read PASS: test-rawmemchr PASS: test-recv PASS: test-regex PASS: test-readlink PASS: test-nonblocking-socket.sh PASS: test-sched PASS: test-select PASS: test-send PASS: test-setenv PASS: test-setlocale1.sh PASS: test-setlocale2.sh PASS: test-setsockopt PASS: test-sigaction PASS: test-signal-h PASS: test-signbit PASS: test-sigpipe.sh PASS: test-select-out.sh PASS: test-select-in.sh PASS: test-snprintf PASS: test-sockets PASS: test-spawn PASS: test-stat PASS: test-stat-time PASS: test-stdalign PASS: test-stdbool PASS: test-stddef PASS: test-stdint PASS: test-stdio PASS: test-stdlib PASS: test-strchrnul PASS: test-strerror PASS: test-strerror_r PASS: test-string PASS: test-strings PASS: test-sigprocmask PASS: test-strnlen PASS: test-symlink PASS: test-sys_select PASS: test-sys_socket PASS: test-sys_ioctl PASS: test-sys_stat PASS: test-sys_time PASS: test-sys_types PASS: test-sys_uio PASS: test-sys_wait PASS: test-sys_utsname PASS: test-termios PASS: test-thread_self PASS: test-thread_create PASS: test-time SKIP: test-ttyname_r PASS: test-uname PASS: test-init.sh PASS: test-unistd PASS: test-unlockpt PASS: test-unsetenv PASS: test-vasnprintf PASS: test-vasprintf PASS: test-vc-list-files-git.sh PASS: test-sleep PASS: test-verify SKIP: test-vc-list-files-cvs.sh PASS: test-vsnprintf PASS: test-wchar PASS: test-wcrtomb.sh SKIP: test-wcrtomb-w32-1.sh SKIP: test-wcrtomb-w32-2.sh SKIP: test-wcrtomb-w32-3.sh SKIP: test-wcrtomb-w32-4.sh SKIP: test-wcrtomb-w32-5.sh PASS: test-wctype-h PASS: test-write PASS: test-xalloc-die.sh PASS: test-usleep PASS: test-verify.sh ============================================================================ Testsuite summary for libvirt 3.9.0 ============================================================================ # TOTAL: 218 # PASS: 204 # SKIP: 14 # XFAIL: 0 # FAIL: 0 # XPASS: 0 # ERROR: 0 ============================================================================ make[5]: Leaving directory '<https://ci.centos.org/job/libvirt-master-check/systems=libvirt-fedora-25/ws/build/gnulib/tests'> make[4]: Leaving directory '<https://ci.centos.org/job/libvirt-master-check/systems=libvirt-fedora-25/ws/build/gnulib/tests'> make[3]: Leaving directory '<https://ci.centos.org/job/libvirt-master-check/systems=libvirt-fedora-25/ws/build/gnulib/tests'> make[2]: Leaving directory '<https://ci.centos.org/job/libvirt-master-check/systems=libvirt-fedora-25/ws/build/gnulib/tests'> make[1]: Leaving directory '<https://ci.centos.org/job/libvirt-master-check/systems=libvirt-fedora-25/ws/build/gnulib/tests'> Making check in tests make[1]: Entering directory '<https://ci.centos.org/job/libvirt-master-check/systems=libvirt-fedora-25/ws/build/tests'> make make[2]: Entering directory '<https://ci.centos.org/job/libvirt-master-check/systems=libvirt-fedora-25/ws/build/tests'> make[2]: Nothing to be done for 'all'. make[2]: Leaving directory '<https://ci.centos.org/job/libvirt-master-check/systems=libvirt-fedora-25/ws/build/tests'> make check-TESTS make[2]: Entering directory '<https://ci.centos.org/job/libvirt-master-check/systems=libvirt-fedora-25/ws/build/tests'> make[3]: Entering directory '<https://ci.centos.org/job/libvirt-master-check/systems=libvirt-fedora-25/ws/build/tests'> PASS: sockettest PASS: virhostcputest PASS: virbuftest PASS: seclabeltest PASS: commandtest PASS: virhashtest PASS: virconftest PASS: viratomictest PASS: utiltest PASS: shunloadtest PASS: virtimetest PASS: viruritest PASS: viralloctest PASS: virkeyfiletest PASS: virauthconfigtest PASS: virbitmaptest PASS: vircgrouptest PASS: vircryptotest PASS: virendiantest PASS: virpcitest PASS: virfilecachetest PASS: virfiletest PASS: virfirewalltest PASS: viriscsitest PASS: virkeycodetest PASS: virlockspacetest FAIL: virrotatingfiletest PASS: virlogtest FAIL: virstringtest ../../build-aux/test-driver: line 107: 10861 Bus error "$@" > $log_file 2>&1 FAIL: virschematest PASS: virshtest FAIL: sysinfotest PASS: virportallocatortest FAIL: domaincapstest FAIL: virkmodtest FAIL: vircapstest ../../build-aux/test-driver: line 129: virhostdevtest.log: Read-only file system FAIL: virhostdevtest ../../build-aux/test-driver: line 135: virhostdevtest.trs: Read-only file system ../../build-aux/test-driver: line 136: virhostdevtest.trs: Read-only file system ../../build-aux/test-driver: line 137: virhostdevtest.trs: Read-only file system ../../build-aux/test-driver: line 138: virhostdevtest.trs: Read-only file system Makefile:6383: recipe for target 'virhostdevtest.log' failed make[3]: *** [virhostdevtest.log] Error 1 make[3]: *** Waiting for unfinished jobs.... ../../build-aux/test-driver: line 129: virnetdevtest.log: Read-only file system FAIL: virnetdevtest ../../build-aux/test-driver: line 135: virnetdevtest.trs: Read-only file system ../../build-aux/test-driver: line 136: virnetdevtest.trs: Read-only file system ../../build-aux/test-driver: line 137: virnetdevtest.trs: Read-only file system ../../build-aux/test-driver: line 138: virnetdevtest.trs: Read-only file system Makefile:6390: recipe for target 'virnetdevtest.log' failed make[3]: *** [virnetdevtest.log] Error 1 ../../build-aux/test-driver: line 129: domainconftest.log: Read-only file system FAIL: domainconftest ../../build-aux/test-driver: line 135: domainconftest.trs: Read-only file system ../../build-aux/test-driver: line 136: domainconftest.trs: Read-only file system ../../build-aux/test-driver: line 137: domainconftest.trs: Read-only file system ../../build-aux/test-driver: line 138: domainconftest.trs: Read-only file system Makefile:6376: recipe for target 'domainconftest.log' failed make[3]: *** [domainconftest.log] Error 1 make[3]: Leaving directory '<https://ci.centos.org/job/libvirt-master-check/systems=libvirt-fedora-25/ws/build/tests'> Makefile:6103: recipe for target 'check-TESTS' failed make[2]: *** [check-TESTS] Error 2 make[2]: Leaving directory '<https://ci.centos.org/job/libvirt-master-check/systems=libvirt-fedora-25/ws/build/tests'> Makefile:7093: recipe for target 'check-am' failed make[1]: *** [check-am] Error 2 make[1]: Leaving directory '<https://ci.centos.org/job/libvirt-master-check/systems=libvirt-fedora-25/ws/build/tests'> Makefile:2117: recipe for target 'check-recursive' failed make: *** [check-recursive] Error 1 + cat tests/test-suite.log cat: tests/test-suite.log: No such file or directory + true + exit 1 Build step 'Execute shell' marked build as failure

participants (1)
-
ci@centos.org