[Libvirt-ci] Build failed in Jenkins: virt-manager-check » libvirt-fedora-29 #290

See <https://ci.centos.org/job/virt-manager-check/systems=libvirt-fedora-29/290/display/redirect> ------------------------------------------ [...truncated 3.59 KB...] File "<https://ci.centos.org/job/virt-manager-check/systems=libvirt-fedora-29/ws/tests/clitest.py",> line 1128, in <lambda> return lambda s: cmdtemplate(s, cmd) File "<https://ci.centos.org/job/virt-manager-check/systems=libvirt-fedora-29/ws/tests/clitest.py",> line 1127, in cmdtemplate _cmdobj.run(self) File "<https://ci.centos.org/job/virt-manager-check/systems=libvirt-fedora-29/ws/tests/clitest.py",> line 250, in run tests.fail(err) AssertionError: virt-install --disk Command was: virt-install --disk Error code : -1 Output was: Traceback (most recent call last): File "<https://ci.centos.org/job/virt-manager-check/systems=libvirt-fedora-29/ws/tests/clitest.py",> line 129, in _launch_command ret = virtinstall.main(conn=conn) File "virt-install", line 912, in main options = parse_args() File "virt-install", line 867, in parse_args cli.autocomplete(parser) File "<https://ci.centos.org/job/virt-manager-check/systems=libvirt-fedora-29/ws/virtinst/cli.py",> line 495, in autocomplete import argcomplete ModuleNotFoundError: No module named 'argcomplete' TESTSUITE: Expected command to pass, but it didn't. ====================================================================== FAIL: testCLI0325virt_install (tests.clitest.CLITests) ---------------------------------------------------------------------- Traceback (most recent call last): File "<https://ci.centos.org/job/virt-manager-check/systems=libvirt-fedora-29/ws/tests/clitest.py",> line 1128, in <lambda> return lambda s: cmdtemplate(s, cmd) File "<https://ci.centos.org/job/virt-manager-check/systems=libvirt-fedora-29/ws/tests/clitest.py",> line 1127, in cmdtemplate _cmdobj.run(self) File "<https://ci.centos.org/job/virt-manager-check/systems=libvirt-fedora-29/ws/tests/clitest.py",> line 250, in run tests.fail(err) AssertionError: virt-install --disk a Command was: virt-install --disk a Error code : -1 Output was: Traceback (most recent call last): File "<https://ci.centos.org/job/virt-manager-check/systems=libvirt-fedora-29/ws/tests/clitest.py",> line 129, in _launch_command ret = virtinstall.main(conn=conn) File "virt-install", line 912, in main options = parse_args() File "virt-install", line 867, in parse_args cli.autocomplete(parser) File "<https://ci.centos.org/job/virt-manager-check/systems=libvirt-fedora-29/ws/virtinst/cli.py",> line 495, in autocomplete import argcomplete ModuleNotFoundError: No module named 'argcomplete' TESTSUITE: Expected command to pass, but it didn't. ====================================================================== FAIL: testCLI0326virt_install (tests.clitest.CLITests) ---------------------------------------------------------------------- Traceback (most recent call last): File "<https://ci.centos.org/job/virt-manager-check/systems=libvirt-fedora-29/ws/tests/clitest.py",> line 1128, in <lambda> return lambda s: cmdtemplate(s, cmd) File "<https://ci.centos.org/job/virt-manager-check/systems=libvirt-fedora-29/ws/tests/clitest.py",> line 1127, in cmdtemplate _cmdobj.run(self) File "<https://ci.centos.org/job/virt-manager-check/systems=libvirt-fedora-29/ws/tests/clitest.py",> line 250, in run tests.fail(err) AssertionError: virt-install --disk address.u Command was: virt-install --disk address.u Error code : -1 Output was: Traceback (most recent call last): File "<https://ci.centos.org/job/virt-manager-check/systems=libvirt-fedora-29/ws/tests/clitest.py",> line 129, in _launch_command ret = virtinstall.main(conn=conn) File "virt-install", line 912, in main options = parse_args() File "virt-install", line 867, in parse_args cli.autocomplete(parser) File "<https://ci.centos.org/job/virt-manager-check/systems=libvirt-fedora-29/ws/virtinst/cli.py",> line 495, in autocomplete import argcomplete ModuleNotFoundError: No module named 'argcomplete' TESTSUITE: Expected command to pass, but it didn't. ====================================================================== FAIL: testCLI0327virt_install (tests.clitest.CLITests) ---------------------------------------------------------------------- Traceback (most recent call last): File "<https://ci.centos.org/job/virt-manager-check/systems=libvirt-fedora-29/ws/tests/clitest.py",> line 1128, in <lambda> return lambda s: cmdtemplate(s, cmd) File "<https://ci.centos.org/job/virt-manager-check/systems=libvirt-fedora-29/ws/tests/clitest.py",> line 1127, in cmdtemplate _cmdobj.run(self) File "<https://ci.centos.org/job/virt-manager-check/systems=libvirt-fedora-29/ws/tests/clitest.py",> line 250, in run tests.fail(err) AssertionError: virt-install --disk address.unit=foo,sg Command was: virt-install --disk address.unit=foo,sg Error code : -1 Output was: Traceback (most recent call last): File "<https://ci.centos.org/job/virt-manager-check/systems=libvirt-fedora-29/ws/tests/clitest.py",> line 129, in _launch_command ret = virtinstall.main(conn=conn) File "virt-install", line 912, in main options = parse_args() File "virt-install", line 867, in parse_args cli.autocomplete(parser) File "<https://ci.centos.org/job/virt-manager-check/systems=libvirt-fedora-29/ws/virtinst/cli.py",> line 495, in autocomplete import argcomplete ModuleNotFoundError: No module named 'argcomplete' TESTSUITE: Expected command to pass, but it didn't. ====================================================================== FAIL: testCLI0328virt_install (tests.clitest.CLITests) ---------------------------------------------------------------------- Traceback (most recent call last): File "<https://ci.centos.org/job/virt-manager-check/systems=libvirt-fedora-29/ws/tests/clitest.py",> line 1128, in <lambda> return lambda s: cmdtemplate(s, cmd) File "<https://ci.centos.org/job/virt-manager-check/systems=libvirt-fedora-29/ws/tests/clitest.py",> line 1127, in cmdtemplate _cmdobj.run(self) File "<https://ci.centos.org/job/virt-manager-check/systems=libvirt-fedora-29/ws/tests/clitest.py",> line 250, in run tests.fail(err) AssertionError: virt-install --test-stub Command was: virt-install --test-stub Error code : -1 Output was: Traceback (most recent call last): File "<https://ci.centos.org/job/virt-manager-check/systems=libvirt-fedora-29/ws/tests/clitest.py",> line 129, in _launch_command ret = virtinstall.main(conn=conn) File "virt-install", line 912, in main options = parse_args() File "virt-install", line 867, in parse_args cli.autocomplete(parser) File "<https://ci.centos.org/job/virt-manager-check/systems=libvirt-fedora-29/ws/virtinst/cli.py",> line 495, in autocomplete import argcomplete ModuleNotFoundError: No module named 'argcomplete' TESTSUITE: Expected command to pass, but it didn't. ====================================================================== FAIL: testCLI0329virt_clone (tests.clitest.CLITests) ---------------------------------------------------------------------- Traceback (most recent call last): File "<https://ci.centos.org/job/virt-manager-check/systems=libvirt-fedora-29/ws/tests/clitest.py",> line 1128, in <lambda> return lambda s: cmdtemplate(s, cmd) File "<https://ci.centos.org/job/virt-manager-check/systems=libvirt-fedora-29/ws/tests/clitest.py",> line 1127, in cmdtemplate _cmdobj.run(self) File "<https://ci.centos.org/job/virt-manager-check/systems=libvirt-fedora-29/ws/tests/clitest.py",> line 250, in run tests.fail(err) AssertionError: virt-clone --preserve Command was: virt-clone --preserve Error code : -1 Output was: Traceback (most recent call last): File "<https://ci.centos.org/job/virt-manager-check/systems=libvirt-fedora-29/ws/tests/clitest.py",> line 131, in _launch_command ret = virtclone.main(conn=conn) File "virt-clone", line 149, in main options = parse_args() File "virt-clone", line 141, in parse_args cli.autocomplete(parser) File "<https://ci.centos.org/job/virt-manager-check/systems=libvirt-fedora-29/ws/virtinst/cli.py",> line 495, in autocomplete import argcomplete ModuleNotFoundError: No module named 'argcomplete' TESTSUITE: Expected command to pass, but it didn't. ====================================================================== FAIL: testCLI0330virt_xml (tests.clitest.CLITests) ---------------------------------------------------------------------- Traceback (most recent call last): File "<https://ci.centos.org/job/virt-manager-check/systems=libvirt-fedora-29/ws/tests/clitest.py",> line 1128, in <lambda> return lambda s: cmdtemplate(s, cmd) File "<https://ci.centos.org/job/virt-manager-check/systems=libvirt-fedora-29/ws/tests/clitest.py",> line 1127, in cmdtemplate _cmdobj.run(self) File "<https://ci.centos.org/job/virt-manager-check/systems=libvirt-fedora-29/ws/tests/clitest.py",> line 250, in run tests.fail(err) AssertionError: virt-xml --sound mode Command was: virt-xml --sound mode Error code : -1 Output was: Traceback (most recent call last): File "<https://ci.centos.org/job/virt-manager-check/systems=libvirt-fedora-29/ws/tests/clitest.py",> line 135, in _launch_command ret = virtxml.main(conn=conn) File "virt-xml", line 407, in main options = parse_args() File "virt-xml", line 396, in parse_args cli.autocomplete(parser) File "<https://ci.centos.org/job/virt-manager-check/systems=libvirt-fedora-29/ws/virtinst/cli.py",> line 495, in autocomplete import argcomplete ModuleNotFoundError: No module named 'argcomplete' TESTSUITE: Expected command to pass, but it didn't. ====================================================================== FAIL: testCLI0331virt_convert (tests.clitest.CLITests) ---------------------------------------------------------------------- Traceback (most recent call last): File "<https://ci.centos.org/job/virt-manager-check/systems=libvirt-fedora-29/ws/tests/clitest.py",> line 1128, in <lambda> return lambda s: cmdtemplate(s, cmd) File "<https://ci.centos.org/job/virt-manager-check/systems=libvirt-fedora-29/ws/tests/clitest.py",> line 1127, in cmdtemplate _cmdobj.run(self) File "<https://ci.centos.org/job/virt-manager-check/systems=libvirt-fedora-29/ws/tests/clitest.py",> line 250, in run tests.fail(err) AssertionError: virt-convert --dest Command was: virt-convert --dest Error code : -1 Output was: Traceback (most recent call last): File "<https://ci.centos.org/job/virt-manager-check/systems=libvirt-fedora-29/ws/tests/clitest.py",> line 133, in _launch_command ret = virtconvert.main(conn=conn) File "virt-convert", line 84, in main options = parse_args() File "virt-convert", line 70, in parse_args cli.autocomplete(parser) File "<https://ci.centos.org/job/virt-manager-check/systems=libvirt-fedora-29/ws/virtinst/cli.py",> line 495, in autocomplete import argcomplete ModuleNotFoundError: No module named 'argcomplete' TESTSUITE: Expected command to pass, but it didn't. ---------------------------------------------------------------------- Ran 455 tests in 34.335s FAILED (failures=9, skipped=2) Build step 'Execute shell' marked build as failure

See <https://ci.centos.org/job/virt-manager-check/systems=libvirt-fedora-29/291/display/redirect> ------------------------------------------ [...truncated 4.89 KB...] File "<https://ci.centos.org/job/virt-manager-check/systems=libvirt-fedora-29/ws/tests/clitest.py",> line 1128, in <lambda> return lambda s: cmdtemplate(s, cmd) File "<https://ci.centos.org/job/virt-manager-check/systems=libvirt-fedora-29/ws/tests/clitest.py",> line 1127, in cmdtemplate _cmdobj.run(self) File "<https://ci.centos.org/job/virt-manager-check/systems=libvirt-fedora-29/ws/tests/clitest.py",> line 250, in run tests.fail(err) AssertionError: virt-install --disk Command was: virt-install --disk Error code : -1 Output was: Traceback (most recent call last): File "<https://ci.centos.org/job/virt-manager-check/systems=libvirt-fedora-29/ws/tests/clitest.py",> line 129, in _launch_command ret = virtinstall.main(conn=conn) File "virt-install", line 912, in main options = parse_args() File "virt-install", line 867, in parse_args cli.autocomplete(parser) File "<https://ci.centos.org/job/virt-manager-check/systems=libvirt-fedora-29/ws/virtinst/cli.py",> line 495, in autocomplete import argcomplete ModuleNotFoundError: No module named 'argcomplete' TESTSUITE: Expected command to pass, but it didn't. ====================================================================== FAIL: testCLI0325virt_install (tests.clitest.CLITests) ---------------------------------------------------------------------- Traceback (most recent call last): File "<https://ci.centos.org/job/virt-manager-check/systems=libvirt-fedora-29/ws/tests/clitest.py",> line 1128, in <lambda> return lambda s: cmdtemplate(s, cmd) File "<https://ci.centos.org/job/virt-manager-check/systems=libvirt-fedora-29/ws/tests/clitest.py",> line 1127, in cmdtemplate _cmdobj.run(self) File "<https://ci.centos.org/job/virt-manager-check/systems=libvirt-fedora-29/ws/tests/clitest.py",> line 250, in run tests.fail(err) AssertionError: virt-install --disk a Command was: virt-install --disk a Error code : -1 Output was: Traceback (most recent call last): File "<https://ci.centos.org/job/virt-manager-check/systems=libvirt-fedora-29/ws/tests/clitest.py",> line 129, in _launch_command ret = virtinstall.main(conn=conn) File "virt-install", line 912, in main options = parse_args() File "virt-install", line 867, in parse_args cli.autocomplete(parser) File "<https://ci.centos.org/job/virt-manager-check/systems=libvirt-fedora-29/ws/virtinst/cli.py",> line 495, in autocomplete import argcomplete ModuleNotFoundError: No module named 'argcomplete' TESTSUITE: Expected command to pass, but it didn't. ====================================================================== FAIL: testCLI0326virt_install (tests.clitest.CLITests) ---------------------------------------------------------------------- Traceback (most recent call last): File "<https://ci.centos.org/job/virt-manager-check/systems=libvirt-fedora-29/ws/tests/clitest.py",> line 1128, in <lambda> return lambda s: cmdtemplate(s, cmd) File "<https://ci.centos.org/job/virt-manager-check/systems=libvirt-fedora-29/ws/tests/clitest.py",> line 1127, in cmdtemplate _cmdobj.run(self) File "<https://ci.centos.org/job/virt-manager-check/systems=libvirt-fedora-29/ws/tests/clitest.py",> line 250, in run tests.fail(err) AssertionError: virt-install --disk address.u Command was: virt-install --disk address.u Error code : -1 Output was: Traceback (most recent call last): File "<https://ci.centos.org/job/virt-manager-check/systems=libvirt-fedora-29/ws/tests/clitest.py",> line 129, in _launch_command ret = virtinstall.main(conn=conn) File "virt-install", line 912, in main options = parse_args() File "virt-install", line 867, in parse_args cli.autocomplete(parser) File "<https://ci.centos.org/job/virt-manager-check/systems=libvirt-fedora-29/ws/virtinst/cli.py",> line 495, in autocomplete import argcomplete ModuleNotFoundError: No module named 'argcomplete' TESTSUITE: Expected command to pass, but it didn't. ====================================================================== FAIL: testCLI0327virt_install (tests.clitest.CLITests) ---------------------------------------------------------------------- Traceback (most recent call last): File "<https://ci.centos.org/job/virt-manager-check/systems=libvirt-fedora-29/ws/tests/clitest.py",> line 1128, in <lambda> return lambda s: cmdtemplate(s, cmd) File "<https://ci.centos.org/job/virt-manager-check/systems=libvirt-fedora-29/ws/tests/clitest.py",> line 1127, in cmdtemplate _cmdobj.run(self) File "<https://ci.centos.org/job/virt-manager-check/systems=libvirt-fedora-29/ws/tests/clitest.py",> line 250, in run tests.fail(err) AssertionError: virt-install --disk address.unit=foo,sg Command was: virt-install --disk address.unit=foo,sg Error code : -1 Output was: Traceback (most recent call last): File "<https://ci.centos.org/job/virt-manager-check/systems=libvirt-fedora-29/ws/tests/clitest.py",> line 129, in _launch_command ret = virtinstall.main(conn=conn) File "virt-install", line 912, in main options = parse_args() File "virt-install", line 867, in parse_args cli.autocomplete(parser) File "<https://ci.centos.org/job/virt-manager-check/systems=libvirt-fedora-29/ws/virtinst/cli.py",> line 495, in autocomplete import argcomplete ModuleNotFoundError: No module named 'argcomplete' TESTSUITE: Expected command to pass, but it didn't. ====================================================================== FAIL: testCLI0328virt_install (tests.clitest.CLITests) ---------------------------------------------------------------------- Traceback (most recent call last): File "<https://ci.centos.org/job/virt-manager-check/systems=libvirt-fedora-29/ws/tests/clitest.py",> line 1128, in <lambda> return lambda s: cmdtemplate(s, cmd) File "<https://ci.centos.org/job/virt-manager-check/systems=libvirt-fedora-29/ws/tests/clitest.py",> line 1127, in cmdtemplate _cmdobj.run(self) File "<https://ci.centos.org/job/virt-manager-check/systems=libvirt-fedora-29/ws/tests/clitest.py",> line 250, in run tests.fail(err) AssertionError: virt-install --test-stub Command was: virt-install --test-stub Error code : -1 Output was: Traceback (most recent call last): File "<https://ci.centos.org/job/virt-manager-check/systems=libvirt-fedora-29/ws/tests/clitest.py",> line 129, in _launch_command ret = virtinstall.main(conn=conn) File "virt-install", line 912, in main options = parse_args() File "virt-install", line 867, in parse_args cli.autocomplete(parser) File "<https://ci.centos.org/job/virt-manager-check/systems=libvirt-fedora-29/ws/virtinst/cli.py",> line 495, in autocomplete import argcomplete ModuleNotFoundError: No module named 'argcomplete' TESTSUITE: Expected command to pass, but it didn't. ====================================================================== FAIL: testCLI0329virt_clone (tests.clitest.CLITests) ---------------------------------------------------------------------- Traceback (most recent call last): File "<https://ci.centos.org/job/virt-manager-check/systems=libvirt-fedora-29/ws/tests/clitest.py",> line 1128, in <lambda> return lambda s: cmdtemplate(s, cmd) File "<https://ci.centos.org/job/virt-manager-check/systems=libvirt-fedora-29/ws/tests/clitest.py",> line 1127, in cmdtemplate _cmdobj.run(self) File "<https://ci.centos.org/job/virt-manager-check/systems=libvirt-fedora-29/ws/tests/clitest.py",> line 250, in run tests.fail(err) AssertionError: virt-clone --preserve Command was: virt-clone --preserve Error code : -1 Output was: Traceback (most recent call last): File "<https://ci.centos.org/job/virt-manager-check/systems=libvirt-fedora-29/ws/tests/clitest.py",> line 131, in _launch_command ret = virtclone.main(conn=conn) File "virt-clone", line 149, in main options = parse_args() File "virt-clone", line 141, in parse_args cli.autocomplete(parser) File "<https://ci.centos.org/job/virt-manager-check/systems=libvirt-fedora-29/ws/virtinst/cli.py",> line 495, in autocomplete import argcomplete ModuleNotFoundError: No module named 'argcomplete' TESTSUITE: Expected command to pass, but it didn't. ====================================================================== FAIL: testCLI0330virt_xml (tests.clitest.CLITests) ---------------------------------------------------------------------- Traceback (most recent call last): File "<https://ci.centos.org/job/virt-manager-check/systems=libvirt-fedora-29/ws/tests/clitest.py",> line 1128, in <lambda> return lambda s: cmdtemplate(s, cmd) File "<https://ci.centos.org/job/virt-manager-check/systems=libvirt-fedora-29/ws/tests/clitest.py",> line 1127, in cmdtemplate _cmdobj.run(self) File "<https://ci.centos.org/job/virt-manager-check/systems=libvirt-fedora-29/ws/tests/clitest.py",> line 250, in run tests.fail(err) AssertionError: virt-xml --sound mode Command was: virt-xml --sound mode Error code : -1 Output was: Traceback (most recent call last): File "<https://ci.centos.org/job/virt-manager-check/systems=libvirt-fedora-29/ws/tests/clitest.py",> line 135, in _launch_command ret = virtxml.main(conn=conn) File "virt-xml", line 407, in main options = parse_args() File "virt-xml", line 396, in parse_args cli.autocomplete(parser) File "<https://ci.centos.org/job/virt-manager-check/systems=libvirt-fedora-29/ws/virtinst/cli.py",> line 495, in autocomplete import argcomplete ModuleNotFoundError: No module named 'argcomplete' TESTSUITE: Expected command to pass, but it didn't. ====================================================================== FAIL: testCLI0331virt_convert (tests.clitest.CLITests) ---------------------------------------------------------------------- Traceback (most recent call last): File "<https://ci.centos.org/job/virt-manager-check/systems=libvirt-fedora-29/ws/tests/clitest.py",> line 1128, in <lambda> return lambda s: cmdtemplate(s, cmd) File "<https://ci.centos.org/job/virt-manager-check/systems=libvirt-fedora-29/ws/tests/clitest.py",> line 1127, in cmdtemplate _cmdobj.run(self) File "<https://ci.centos.org/job/virt-manager-check/systems=libvirt-fedora-29/ws/tests/clitest.py",> line 250, in run tests.fail(err) AssertionError: virt-convert --dest Command was: virt-convert --dest Error code : -1 Output was: Traceback (most recent call last): File "<https://ci.centos.org/job/virt-manager-check/systems=libvirt-fedora-29/ws/tests/clitest.py",> line 133, in _launch_command ret = virtconvert.main(conn=conn) File "virt-convert", line 84, in main options = parse_args() File "virt-convert", line 70, in parse_args cli.autocomplete(parser) File "<https://ci.centos.org/job/virt-manager-check/systems=libvirt-fedora-29/ws/virtinst/cli.py",> line 495, in autocomplete import argcomplete ModuleNotFoundError: No module named 'argcomplete' TESTSUITE: Expected command to pass, but it didn't. ---------------------------------------------------------------------- Ran 455 tests in 153.467s FAILED (failures=9, skipped=2) Build step 'Execute shell' marked build as failure

See <https://ci.centos.org/job/virt-manager-check/systems=libvirt-fedora-29/292/display/redirect> ------------------------------------------ [...truncated 4.89 KB...] File "<https://ci.centos.org/job/virt-manager-check/systems=libvirt-fedora-29/ws/tests/clitest.py",> line 1128, in <lambda> return lambda s: cmdtemplate(s, cmd) File "<https://ci.centos.org/job/virt-manager-check/systems=libvirt-fedora-29/ws/tests/clitest.py",> line 1127, in cmdtemplate _cmdobj.run(self) File "<https://ci.centos.org/job/virt-manager-check/systems=libvirt-fedora-29/ws/tests/clitest.py",> line 250, in run tests.fail(err) AssertionError: virt-install --disk Command was: virt-install --disk Error code : -1 Output was: Traceback (most recent call last): File "<https://ci.centos.org/job/virt-manager-check/systems=libvirt-fedora-29/ws/tests/clitest.py",> line 129, in _launch_command ret = virtinstall.main(conn=conn) File "virt-install", line 912, in main options = parse_args() File "virt-install", line 867, in parse_args cli.autocomplete(parser) File "<https://ci.centos.org/job/virt-manager-check/systems=libvirt-fedora-29/ws/virtinst/cli.py",> line 495, in autocomplete import argcomplete ModuleNotFoundError: No module named 'argcomplete' TESTSUITE: Expected command to pass, but it didn't. ====================================================================== FAIL: testCLI0325virt_install (tests.clitest.CLITests) ---------------------------------------------------------------------- Traceback (most recent call last): File "<https://ci.centos.org/job/virt-manager-check/systems=libvirt-fedora-29/ws/tests/clitest.py",> line 1128, in <lambda> return lambda s: cmdtemplate(s, cmd) File "<https://ci.centos.org/job/virt-manager-check/systems=libvirt-fedora-29/ws/tests/clitest.py",> line 1127, in cmdtemplate _cmdobj.run(self) File "<https://ci.centos.org/job/virt-manager-check/systems=libvirt-fedora-29/ws/tests/clitest.py",> line 250, in run tests.fail(err) AssertionError: virt-install --disk a Command was: virt-install --disk a Error code : -1 Output was: Traceback (most recent call last): File "<https://ci.centos.org/job/virt-manager-check/systems=libvirt-fedora-29/ws/tests/clitest.py",> line 129, in _launch_command ret = virtinstall.main(conn=conn) File "virt-install", line 912, in main options = parse_args() File "virt-install", line 867, in parse_args cli.autocomplete(parser) File "<https://ci.centos.org/job/virt-manager-check/systems=libvirt-fedora-29/ws/virtinst/cli.py",> line 495, in autocomplete import argcomplete ModuleNotFoundError: No module named 'argcomplete' TESTSUITE: Expected command to pass, but it didn't. ====================================================================== FAIL: testCLI0326virt_install (tests.clitest.CLITests) ---------------------------------------------------------------------- Traceback (most recent call last): File "<https://ci.centos.org/job/virt-manager-check/systems=libvirt-fedora-29/ws/tests/clitest.py",> line 1128, in <lambda> return lambda s: cmdtemplate(s, cmd) File "<https://ci.centos.org/job/virt-manager-check/systems=libvirt-fedora-29/ws/tests/clitest.py",> line 1127, in cmdtemplate _cmdobj.run(self) File "<https://ci.centos.org/job/virt-manager-check/systems=libvirt-fedora-29/ws/tests/clitest.py",> line 250, in run tests.fail(err) AssertionError: virt-install --disk address.u Command was: virt-install --disk address.u Error code : -1 Output was: Traceback (most recent call last): File "<https://ci.centos.org/job/virt-manager-check/systems=libvirt-fedora-29/ws/tests/clitest.py",> line 129, in _launch_command ret = virtinstall.main(conn=conn) File "virt-install", line 912, in main options = parse_args() File "virt-install", line 867, in parse_args cli.autocomplete(parser) File "<https://ci.centos.org/job/virt-manager-check/systems=libvirt-fedora-29/ws/virtinst/cli.py",> line 495, in autocomplete import argcomplete ModuleNotFoundError: No module named 'argcomplete' TESTSUITE: Expected command to pass, but it didn't. ====================================================================== FAIL: testCLI0327virt_install (tests.clitest.CLITests) ---------------------------------------------------------------------- Traceback (most recent call last): File "<https://ci.centos.org/job/virt-manager-check/systems=libvirt-fedora-29/ws/tests/clitest.py",> line 1128, in <lambda> return lambda s: cmdtemplate(s, cmd) File "<https://ci.centos.org/job/virt-manager-check/systems=libvirt-fedora-29/ws/tests/clitest.py",> line 1127, in cmdtemplate _cmdobj.run(self) File "<https://ci.centos.org/job/virt-manager-check/systems=libvirt-fedora-29/ws/tests/clitest.py",> line 250, in run tests.fail(err) AssertionError: virt-install --disk address.unit=foo,sg Command was: virt-install --disk address.unit=foo,sg Error code : -1 Output was: Traceback (most recent call last): File "<https://ci.centos.org/job/virt-manager-check/systems=libvirt-fedora-29/ws/tests/clitest.py",> line 129, in _launch_command ret = virtinstall.main(conn=conn) File "virt-install", line 912, in main options = parse_args() File "virt-install", line 867, in parse_args cli.autocomplete(parser) File "<https://ci.centos.org/job/virt-manager-check/systems=libvirt-fedora-29/ws/virtinst/cli.py",> line 495, in autocomplete import argcomplete ModuleNotFoundError: No module named 'argcomplete' TESTSUITE: Expected command to pass, but it didn't. ====================================================================== FAIL: testCLI0328virt_install (tests.clitest.CLITests) ---------------------------------------------------------------------- Traceback (most recent call last): File "<https://ci.centos.org/job/virt-manager-check/systems=libvirt-fedora-29/ws/tests/clitest.py",> line 1128, in <lambda> return lambda s: cmdtemplate(s, cmd) File "<https://ci.centos.org/job/virt-manager-check/systems=libvirt-fedora-29/ws/tests/clitest.py",> line 1127, in cmdtemplate _cmdobj.run(self) File "<https://ci.centos.org/job/virt-manager-check/systems=libvirt-fedora-29/ws/tests/clitest.py",> line 250, in run tests.fail(err) AssertionError: virt-install --test-stub Command was: virt-install --test-stub Error code : -1 Output was: Traceback (most recent call last): File "<https://ci.centos.org/job/virt-manager-check/systems=libvirt-fedora-29/ws/tests/clitest.py",> line 129, in _launch_command ret = virtinstall.main(conn=conn) File "virt-install", line 912, in main options = parse_args() File "virt-install", line 867, in parse_args cli.autocomplete(parser) File "<https://ci.centos.org/job/virt-manager-check/systems=libvirt-fedora-29/ws/virtinst/cli.py",> line 495, in autocomplete import argcomplete ModuleNotFoundError: No module named 'argcomplete' TESTSUITE: Expected command to pass, but it didn't. ====================================================================== FAIL: testCLI0329virt_clone (tests.clitest.CLITests) ---------------------------------------------------------------------- Traceback (most recent call last): File "<https://ci.centos.org/job/virt-manager-check/systems=libvirt-fedora-29/ws/tests/clitest.py",> line 1128, in <lambda> return lambda s: cmdtemplate(s, cmd) File "<https://ci.centos.org/job/virt-manager-check/systems=libvirt-fedora-29/ws/tests/clitest.py",> line 1127, in cmdtemplate _cmdobj.run(self) File "<https://ci.centos.org/job/virt-manager-check/systems=libvirt-fedora-29/ws/tests/clitest.py",> line 250, in run tests.fail(err) AssertionError: virt-clone --preserve Command was: virt-clone --preserve Error code : -1 Output was: Traceback (most recent call last): File "<https://ci.centos.org/job/virt-manager-check/systems=libvirt-fedora-29/ws/tests/clitest.py",> line 131, in _launch_command ret = virtclone.main(conn=conn) File "virt-clone", line 149, in main options = parse_args() File "virt-clone", line 141, in parse_args cli.autocomplete(parser) File "<https://ci.centos.org/job/virt-manager-check/systems=libvirt-fedora-29/ws/virtinst/cli.py",> line 495, in autocomplete import argcomplete ModuleNotFoundError: No module named 'argcomplete' TESTSUITE: Expected command to pass, but it didn't. ====================================================================== FAIL: testCLI0330virt_xml (tests.clitest.CLITests) ---------------------------------------------------------------------- Traceback (most recent call last): File "<https://ci.centos.org/job/virt-manager-check/systems=libvirt-fedora-29/ws/tests/clitest.py",> line 1128, in <lambda> return lambda s: cmdtemplate(s, cmd) File "<https://ci.centos.org/job/virt-manager-check/systems=libvirt-fedora-29/ws/tests/clitest.py",> line 1127, in cmdtemplate _cmdobj.run(self) File "<https://ci.centos.org/job/virt-manager-check/systems=libvirt-fedora-29/ws/tests/clitest.py",> line 250, in run tests.fail(err) AssertionError: virt-xml --sound mode Command was: virt-xml --sound mode Error code : -1 Output was: Traceback (most recent call last): File "<https://ci.centos.org/job/virt-manager-check/systems=libvirt-fedora-29/ws/tests/clitest.py",> line 135, in _launch_command ret = virtxml.main(conn=conn) File "virt-xml", line 407, in main options = parse_args() File "virt-xml", line 396, in parse_args cli.autocomplete(parser) File "<https://ci.centos.org/job/virt-manager-check/systems=libvirt-fedora-29/ws/virtinst/cli.py",> line 495, in autocomplete import argcomplete ModuleNotFoundError: No module named 'argcomplete' TESTSUITE: Expected command to pass, but it didn't. ====================================================================== FAIL: testCLI0331virt_convert (tests.clitest.CLITests) ---------------------------------------------------------------------- Traceback (most recent call last): File "<https://ci.centos.org/job/virt-manager-check/systems=libvirt-fedora-29/ws/tests/clitest.py",> line 1128, in <lambda> return lambda s: cmdtemplate(s, cmd) File "<https://ci.centos.org/job/virt-manager-check/systems=libvirt-fedora-29/ws/tests/clitest.py",> line 1127, in cmdtemplate _cmdobj.run(self) File "<https://ci.centos.org/job/virt-manager-check/systems=libvirt-fedora-29/ws/tests/clitest.py",> line 250, in run tests.fail(err) AssertionError: virt-convert --dest Command was: virt-convert --dest Error code : -1 Output was: Traceback (most recent call last): File "<https://ci.centos.org/job/virt-manager-check/systems=libvirt-fedora-29/ws/tests/clitest.py",> line 133, in _launch_command ret = virtconvert.main(conn=conn) File "virt-convert", line 84, in main options = parse_args() File "virt-convert", line 70, in parse_args cli.autocomplete(parser) File "<https://ci.centos.org/job/virt-manager-check/systems=libvirt-fedora-29/ws/virtinst/cli.py",> line 495, in autocomplete import argcomplete ModuleNotFoundError: No module named 'argcomplete' TESTSUITE: Expected command to pass, but it didn't. ---------------------------------------------------------------------- Ran 455 tests in 38.544s FAILED (failures=9, skipped=2) Build step 'Execute shell' marked build as failure

participants (1)
-
ci@centos.org