Build failed in Jenkins: libvirt-check » libvirt-freebsd-12 #946

See <https://ci.centos.org/job/libvirt-check/systems=libvirt-freebsd-12/946/display/redirect> ------------------------------------------ [...truncated 3.53 KB...] gmake[5]: Leaving directory '/usr<https://ci.centos.org/job/libvirt-check/systems=libvirt-freebsd-12/ws/build/include/libvirt'> Making all in src gmake[5]: Entering directory '/usr<https://ci.centos.org/job/libvirt-check/systems=libvirt-freebsd-12/ws/build/src'> /usr/local/bin/gmake all-am gmake[6]: Entering directory '/usr<https://ci.centos.org/job/libvirt-check/systems=libvirt-freebsd-12/ws/build/src'> gmake[6]: Nothing to be done for 'all-am'. gmake[6]: Leaving directory '/usr<https://ci.centos.org/job/libvirt-check/systems=libvirt-freebsd-12/ws/build/src'> gmake[5]: Leaving directory '/usr<https://ci.centos.org/job/libvirt-check/systems=libvirt-freebsd-12/ws/build/src'> Making all in tools gmake[5]: Entering directory '/usr<https://ci.centos.org/job/libvirt-check/systems=libvirt-freebsd-12/ws/build/tools'> /usr/local/bin/gmake all-am gmake[6]: Entering directory '/usr<https://ci.centos.org/job/libvirt-check/systems=libvirt-freebsd-12/ws/build/tools'> gmake[6]: Nothing to be done for 'all-am'. gmake[6]: Leaving directory '/usr<https://ci.centos.org/job/libvirt-check/systems=libvirt-freebsd-12/ws/build/tools'> gmake[5]: Leaving directory '/usr<https://ci.centos.org/job/libvirt-check/systems=libvirt-freebsd-12/ws/build/tools'> Making all in docs gmake[5]: Entering directory '/usr<https://ci.centos.org/job/libvirt-check/systems=libvirt-freebsd-12/ws/build/docs'> gmake[5]: Leaving directory '/usr<https://ci.centos.org/job/libvirt-check/systems=libvirt-freebsd-12/ws/build/docs'> Making all in tests gmake[5]: Entering directory '/usr<https://ci.centos.org/job/libvirt-check/systems=libvirt-freebsd-12/ws/build/tests'> gmake[5]: Nothing to be done for 'all'. gmake[5]: Leaving directory '/usr<https://ci.centos.org/job/libvirt-check/systems=libvirt-freebsd-12/ws/build/tests'> Making all in po gmake[5]: Entering directory '/usr<https://ci.centos.org/job/libvirt-check/systems=libvirt-freebsd-12/ws/build/po'> cat: POTFILES: No such file or directory gmake[5]: Nothing to be done for 'all'. gmake[5]: Leaving directory '/usr<https://ci.centos.org/job/libvirt-check/systems=libvirt-freebsd-12/ws/build/po'> Making all in examples gmake[5]: Entering directory '/usr<https://ci.centos.org/job/libvirt-check/systems=libvirt-freebsd-12/ws/build/examples'> gmake[5]: Nothing to be done for 'all'. gmake[5]: Leaving directory '/usr<https://ci.centos.org/job/libvirt-check/systems=libvirt-freebsd-12/ws/build/examples'> gmake[4]: Leaving directory '/usr<https://ci.centos.org/job/libvirt-check/systems=libvirt-freebsd-12/ws/build'> gmake[3]: Leaving directory '/usr<https://ci.centos.org/job/libvirt-check/systems=libvirt-freebsd-12/ws/build'> gmake[2]: Leaving directory '/usr<https://ci.centos.org/job/libvirt-check/systems=libvirt-freebsd-12/ws/build'> Making check in gnulib/lib gmake[2]: Entering directory '/usr<https://ci.centos.org/job/libvirt-check/systems=libvirt-freebsd-12/ws/build/gnulib/lib'> /usr/local/bin/gmake check-am gmake[3]: Entering directory '/usr<https://ci.centos.org/job/libvirt-check/systems=libvirt-freebsd-12/ws/build/gnulib/lib'> gmake[3]: Nothing to be done for 'check-am'. gmake[3]: Leaving directory '/usr<https://ci.centos.org/job/libvirt-check/systems=libvirt-freebsd-12/ws/build/gnulib/lib'> gmake[2]: Leaving directory '/usr<https://ci.centos.org/job/libvirt-check/systems=libvirt-freebsd-12/ws/build/gnulib/lib'> Making check in include/libvirt gmake[2]: Entering directory '/usr<https://ci.centos.org/job/libvirt-check/systems=libvirt-freebsd-12/ws/build/include/libvirt'> gmake[2]: Nothing to be done for 'check'. gmake[2]: Leaving directory '/usr<https://ci.centos.org/job/libvirt-check/systems=libvirt-freebsd-12/ws/build/include/libvirt'> Making check in src gmake[2]: Entering directory '/usr<https://ci.centos.org/job/libvirt-check/systems=libvirt-freebsd-12/ws/build/src'> /usr/local/bin/gmake check-am gmake[3]: Entering directory '/usr<https://ci.centos.org/job/libvirt-check/systems=libvirt-freebsd-12/ws/build/src'> /usr/local/bin/gmake check-local gmake[4]: Entering directory '/usr<https://ci.centos.org/job/libvirt-check/systems=libvirt-freebsd-12/ws/build/src'> GEN ../../src/remote_protocol-struct GEN ../../src/lxc_protocol-struct GEN ../../src/qemu_protocol-struct WARNING: skipping pdwtags test with Clang WARNING: skipping pdwtags test with Clang GEN ../../src/virnetprotocol-struct GEN ../../src/virkeepaliveprotocol-struct WARNING: skipping pdwtags test with Clang GEN ../../src/lock_protocol-struct WARNING: skipping pdwtags test with Clang GEN ../../src/admin_protocol-struct WARNING: skipping pdwtags test with Clang GEN check-symsorting WARNING: skipping pdwtags test with Clang GEN check-drivername GEN check-driverimpls GEN check-aclrules WARNING: skipping pdwtags test with Clang GEN check-aclperms GEN check-admin-symsorting GEN check-admin-drivername GEN check-augeas gmake[4]: Leaving directory '/usr<https://ci.centos.org/job/libvirt-check/systems=libvirt-freebsd-12/ws/build/src'> gmake[3]: Leaving directory '/usr<https://ci.centos.org/job/libvirt-check/systems=libvirt-freebsd-12/ws/build/src'> gmake[2]: Leaving directory '/usr<https://ci.centos.org/job/libvirt-check/systems=libvirt-freebsd-12/ws/build/src'> Making check in tools gmake[2]: Entering directory '/usr<https://ci.centos.org/job/libvirt-check/systems=libvirt-freebsd-12/ws/build/tools'> /usr/local/bin/gmake check-am gmake[3]: Entering directory '/usr<https://ci.centos.org/job/libvirt-check/systems=libvirt-freebsd-12/ws/build/tools'> gmake[3]: Nothing to be done for 'check-am'. gmake[3]: Leaving directory '/usr<https://ci.centos.org/job/libvirt-check/systems=libvirt-freebsd-12/ws/build/tools'> gmake[2]: Leaving directory '/usr<https://ci.centos.org/job/libvirt-check/systems=libvirt-freebsd-12/ws/build/tools'> Making check in docs gmake[2]: Entering directory '/usr<https://ci.centos.org/job/libvirt-check/systems=libvirt-freebsd-12/ws/build/docs'> /usr/local/bin/gmake check-local gmake[3]: Entering directory '/usr<https://ci.centos.org/job/libvirt-check/systems=libvirt-freebsd-12/ws/build/docs'> /usr/local/bin/xmllint --nonet --noout html/*.html gmake[3]: Leaving directory '/usr<https://ci.centos.org/job/libvirt-check/systems=libvirt-freebsd-12/ws/build/docs'> gmake[2]: Leaving directory '/usr<https://ci.centos.org/job/libvirt-check/systems=libvirt-freebsd-12/ws/build/docs'> Making check in tests gmake[2]: Entering directory '/usr<https://ci.centos.org/job/libvirt-check/systems=libvirt-freebsd-12/ws/build/tests'> /usr/local/bin/gmake gmake[3]: Entering directory '/usr<https://ci.centos.org/job/libvirt-check/systems=libvirt-freebsd-12/ws/build/tests'> gmake[3]: Nothing to be done for 'all'. gmake[3]: Leaving directory '/usr<https://ci.centos.org/job/libvirt-check/systems=libvirt-freebsd-12/ws/build/tests'> /usr/local/bin/gmake check-TESTS gmake[3]: Entering directory '/usr<https://ci.centos.org/job/libvirt-check/systems=libvirt-freebsd-12/ws/build/tests'> gmake[4]: Entering directory '/usr<https://ci.centos.org/job/libvirt-check/systems=libvirt-freebsd-12/ws/build/tests'> PASS: sockettest SKIP: virhostcputest PASS: virbuftest PASS: seclabeltest PASS: virhashtest PASS: virconftest PASS: utiltest SKIP: shunloadtest PASS: virtimetest PASS: viruritest PASS: virkeyfiletest PASS: viralloctest PASS: virauthconfigtest PASS: virbitmaptest SKIP: vircgrouptest PASS: vircryptotest SKIP: virpcitest PASS: virendiantest PASS: commandtest PASS: virfilecachetest PASS: virfiletest PASS: viriscsitest SKIP: virfirewalltest PASS: virkeycodetest PASS: virlogtest PASS: virlockspacetest PASS: virrotatingfiletest PASS: virstringtest SKIP: virportallocatortest PASS: sysinfotest SKIP: virkmodtest PASS: vircapstest PASS: domaincapstest PASS: domainconftest SKIP: virhostdevtest SKIP: virnetdevtest PASS: virtypedparamtest PASS: vshtabletest PASS: virerrortest PASS: virnetmessagetest PASS: virnetsockettest SKIP: virnetdaemontest SKIP: virnetserverclienttest SKIP: virnettlscontexttest SKIP: virnettlssessiontest PASS: virschematest PASS: fdstreamtest PASS: virdbustest SKIP: virsystemdtest PASS: virpolkittest PASS: qemuxml2xmltest PASS: qemudomaincheckpointxml2xmltest PASS: qemudomainsnapshotxml2xmltest FAIL: qemumonitorjsontest FAIL: qemuhotplugtest PASS: qemuagenttest PASS: qemuxml2argvtest PASS: qemucapabilitiestest PASS: qemucaps2xmltest PASS: qemucommandutiltest FAIL: qemublocktest PASS: qemumemlocktest PASS: qemumigparamstest PASS: qemufirmwaretest PASS: qemuvhostusertest PASS: esxutilstest PASS: vboxsnapshotxmltest PASS: vmx2xmltest PASS: xml2vmxtest PASS: vmwarevertest PASS: bhyvexml2argvtest PASS: bhyvexml2xmltest PASS: bhyveargv2xmltest PASS: virjsontest PASS: networkxml2xmlupdatetest PASS: virnetworkportxml2xmltest PASS: qemusecuritytest PASS: networkxml2xmltest SKIP: networkxml2firewalltest PASS: networkxml2conftest PASS: virnwfilterbindingxml2xmltest PASS: nwfilterxml2xmltest PASS: storagepoolxml2argvtest PASS: storagevolxml2argvtest PASS: storagepoolxml2xmltest PASS: virstorageutiltest PASS: storagepoolcapstest PASS: nsstest PASS: storagevolxml2xmltest PASS: nssguesttest PASS: interfacexml2xmltest PASS: nodedevxml2xmltest PASS: metadatatest PASS: secretxml2xmltest PASS: genericxml2xmltest PASS: eventtest PASS: virdrivermoduletest PASS: virdriverconnvalidatetest PASS: objecteventtest PASS: virmacmaptest PASS: virnetdevopenvswitchtest PASS: libvirtd-fail PASS: libvirtd-pool PASS: cputest PASS: virsh-define-dev-segfault PASS: virsh-int-overflow PASS: virsh-cpuset SKIP: virsh-optparse PASS: virsh-read-non-seekable PASS: virsh-schedinfo PASS: virsh-read-bufsiz PASS: virsh-self-test PASS: virt-admin-self-test PASS: virsh-checkpoint PASS: virsh-snapshot PASS: virsh-start PASS: virsh-undefine PASS: virsh-uriprecedence PASS: virsh-vcpupin PASS: virshtest ============================================================================ Testsuite summary for libvirt 6.1.0 ============================================================================ # TOTAL: 120 # PASS: 101 # SKIP: 16 # XFAIL: 0 # FAIL: 3 # XPASS: 0 # ERROR: 0 ============================================================================ See tests/test-suite.log Please report to libvir-list@redhat.com ============================================================================ gmake[4]: *** [Makefile:5134: test-suite.log] Error 1 gmake[4]: Leaving directory '/usr<https://ci.centos.org/job/libvirt-check/systems=libvirt-freebsd-12/ws/build/tests'> gmake[3]: *** [Makefile:5242: check-TESTS] Error 2 gmake[3]: Leaving directory '/usr<https://ci.centos.org/job/libvirt-check/systems=libvirt-freebsd-12/ws/build/tests'> gmake[2]: *** [Makefile:6296: check-am] Error 2 gmake[2]: Leaving directory '/usr<https://ci.centos.org/job/libvirt-check/systems=libvirt-freebsd-12/ws/build/tests'> gmake[1]: *** [Makefile:1082: check-recursive] Error 1 gmake[1]: Leaving directory '/usr<https://ci.centos.org/job/libvirt-check/systems=libvirt-freebsd-12/ws/build'> gmake: *** [Makefile:1377: check] Error 2 + find -name test-suite.log + xargs cat find: illegal option -- n usage: find [-H | -L | -P] [-EXdsx] [-f path] path ... [expression] find [-H | -L | -P] [-EXdsx] -f path [path ...] [expression] + exit 1 Build step 'Execute shell' marked build as failure

See <https://ci.centos.org/job/libvirt-check/systems=libvirt-freebsd-12/947/display/redirect> ------------------------------------------ [...truncated 3.53 KB...] gmake[5]: Leaving directory '/usr<https://ci.centos.org/job/libvirt-check/systems=libvirt-freebsd-12/ws/build/include/libvirt'> Making all in src gmake[5]: Entering directory '/usr<https://ci.centos.org/job/libvirt-check/systems=libvirt-freebsd-12/ws/build/src'> /usr/local/bin/gmake all-am gmake[6]: Entering directory '/usr<https://ci.centos.org/job/libvirt-check/systems=libvirt-freebsd-12/ws/build/src'> gmake[6]: Nothing to be done for 'all-am'. gmake[6]: Leaving directory '/usr<https://ci.centos.org/job/libvirt-check/systems=libvirt-freebsd-12/ws/build/src'> gmake[5]: Leaving directory '/usr<https://ci.centos.org/job/libvirt-check/systems=libvirt-freebsd-12/ws/build/src'> Making all in tools gmake[5]: Entering directory '/usr<https://ci.centos.org/job/libvirt-check/systems=libvirt-freebsd-12/ws/build/tools'> /usr/local/bin/gmake all-am gmake[6]: Entering directory '/usr<https://ci.centos.org/job/libvirt-check/systems=libvirt-freebsd-12/ws/build/tools'> gmake[6]: Nothing to be done for 'all-am'. gmake[6]: Leaving directory '/usr<https://ci.centos.org/job/libvirt-check/systems=libvirt-freebsd-12/ws/build/tools'> gmake[5]: Leaving directory '/usr<https://ci.centos.org/job/libvirt-check/systems=libvirt-freebsd-12/ws/build/tools'> Making all in docs gmake[5]: Entering directory '/usr<https://ci.centos.org/job/libvirt-check/systems=libvirt-freebsd-12/ws/build/docs'> gmake[5]: Leaving directory '/usr<https://ci.centos.org/job/libvirt-check/systems=libvirt-freebsd-12/ws/build/docs'> Making all in tests gmake[5]: Entering directory '/usr<https://ci.centos.org/job/libvirt-check/systems=libvirt-freebsd-12/ws/build/tests'> gmake[5]: Nothing to be done for 'all'. gmake[5]: Leaving directory '/usr<https://ci.centos.org/job/libvirt-check/systems=libvirt-freebsd-12/ws/build/tests'> Making all in po gmake[5]: Entering directory '/usr<https://ci.centos.org/job/libvirt-check/systems=libvirt-freebsd-12/ws/build/po'> cat: POTFILES: No such file or directory gmake[5]: Nothing to be done for 'all'. gmake[5]: Leaving directory '/usr<https://ci.centos.org/job/libvirt-check/systems=libvirt-freebsd-12/ws/build/po'> Making all in examples gmake[5]: Entering directory '/usr<https://ci.centos.org/job/libvirt-check/systems=libvirt-freebsd-12/ws/build/examples'> gmake[5]: Nothing to be done for 'all'. gmake[5]: Leaving directory '/usr<https://ci.centos.org/job/libvirt-check/systems=libvirt-freebsd-12/ws/build/examples'> gmake[4]: Leaving directory '/usr<https://ci.centos.org/job/libvirt-check/systems=libvirt-freebsd-12/ws/build'> gmake[3]: Leaving directory '/usr<https://ci.centos.org/job/libvirt-check/systems=libvirt-freebsd-12/ws/build'> gmake[2]: Leaving directory '/usr<https://ci.centos.org/job/libvirt-check/systems=libvirt-freebsd-12/ws/build'> Making check in gnulib/lib gmake[2]: Entering directory '/usr<https://ci.centos.org/job/libvirt-check/systems=libvirt-freebsd-12/ws/build/gnulib/lib'> /usr/local/bin/gmake check-am gmake[3]: Entering directory '/usr<https://ci.centos.org/job/libvirt-check/systems=libvirt-freebsd-12/ws/build/gnulib/lib'> gmake[3]: Nothing to be done for 'check-am'. gmake[3]: Leaving directory '/usr<https://ci.centos.org/job/libvirt-check/systems=libvirt-freebsd-12/ws/build/gnulib/lib'> gmake[2]: Leaving directory '/usr<https://ci.centos.org/job/libvirt-check/systems=libvirt-freebsd-12/ws/build/gnulib/lib'> Making check in include/libvirt gmake[2]: Entering directory '/usr<https://ci.centos.org/job/libvirt-check/systems=libvirt-freebsd-12/ws/build/include/libvirt'> gmake[2]: Nothing to be done for 'check'. gmake[2]: Leaving directory '/usr<https://ci.centos.org/job/libvirt-check/systems=libvirt-freebsd-12/ws/build/include/libvirt'> Making check in src gmake[2]: Entering directory '/usr<https://ci.centos.org/job/libvirt-check/systems=libvirt-freebsd-12/ws/build/src'> /usr/local/bin/gmake check-am gmake[3]: Entering directory '/usr<https://ci.centos.org/job/libvirt-check/systems=libvirt-freebsd-12/ws/build/src'> /usr/local/bin/gmake check-local gmake[4]: Entering directory '/usr<https://ci.centos.org/job/libvirt-check/systems=libvirt-freebsd-12/ws/build/src'> GEN ../../src/remote_protocol-struct GEN ../../src/lxc_protocol-struct GEN ../../src/qemu_protocol-struct WARNING: skipping pdwtags test with Clang GEN ../../src/virnetprotocol-struct WARNING: skipping pdwtags test with Clang WARNING: skipping pdwtags test with Clang GEN ../../src/lock_protocol-struct GEN ../../src/virkeepaliveprotocol-struct WARNING: skipping pdwtags test with Clang WARNING: skipping pdwtags test with Clang GEN ../../src/admin_protocol-struct GEN check-symsorting WARNING: skipping pdwtags test with Clang GEN check-drivername GEN check-driverimpls WARNING: skipping pdwtags test with Clang GEN check-aclrules GEN check-aclperms GEN check-admin-symsorting GEN check-admin-drivername GEN check-augeas gmake[4]: Leaving directory '/usr<https://ci.centos.org/job/libvirt-check/systems=libvirt-freebsd-12/ws/build/src'> gmake[3]: Leaving directory '/usr<https://ci.centos.org/job/libvirt-check/systems=libvirt-freebsd-12/ws/build/src'> gmake[2]: Leaving directory '/usr<https://ci.centos.org/job/libvirt-check/systems=libvirt-freebsd-12/ws/build/src'> Making check in tools gmake[2]: Entering directory '/usr<https://ci.centos.org/job/libvirt-check/systems=libvirt-freebsd-12/ws/build/tools'> /usr/local/bin/gmake check-am gmake[3]: Entering directory '/usr<https://ci.centos.org/job/libvirt-check/systems=libvirt-freebsd-12/ws/build/tools'> gmake[3]: Nothing to be done for 'check-am'. gmake[3]: Leaving directory '/usr<https://ci.centos.org/job/libvirt-check/systems=libvirt-freebsd-12/ws/build/tools'> gmake[2]: Leaving directory '/usr<https://ci.centos.org/job/libvirt-check/systems=libvirt-freebsd-12/ws/build/tools'> Making check in docs gmake[2]: Entering directory '/usr<https://ci.centos.org/job/libvirt-check/systems=libvirt-freebsd-12/ws/build/docs'> /usr/local/bin/gmake check-local gmake[3]: Entering directory '/usr<https://ci.centos.org/job/libvirt-check/systems=libvirt-freebsd-12/ws/build/docs'> /usr/local/bin/xmllint --nonet --noout html/*.html gmake[3]: Leaving directory '/usr<https://ci.centos.org/job/libvirt-check/systems=libvirt-freebsd-12/ws/build/docs'> gmake[2]: Leaving directory '/usr<https://ci.centos.org/job/libvirt-check/systems=libvirt-freebsd-12/ws/build/docs'> Making check in tests gmake[2]: Entering directory '/usr<https://ci.centos.org/job/libvirt-check/systems=libvirt-freebsd-12/ws/build/tests'> /usr/local/bin/gmake gmake[3]: Entering directory '/usr<https://ci.centos.org/job/libvirt-check/systems=libvirt-freebsd-12/ws/build/tests'> gmake[3]: Nothing to be done for 'all'. gmake[3]: Leaving directory '/usr<https://ci.centos.org/job/libvirt-check/systems=libvirt-freebsd-12/ws/build/tests'> /usr/local/bin/gmake check-TESTS gmake[3]: Entering directory '/usr<https://ci.centos.org/job/libvirt-check/systems=libvirt-freebsd-12/ws/build/tests'> gmake[4]: Entering directory '/usr<https://ci.centos.org/job/libvirt-check/systems=libvirt-freebsd-12/ws/build/tests'> SKIP: virhostcputest PASS: sockettest PASS: virbuftest PASS: seclabeltest PASS: virhashtest PASS: virconftest PASS: utiltest SKIP: shunloadtest PASS: virtimetest PASS: viruritest PASS: virkeyfiletest PASS: viralloctest PASS: virauthconfigtest PASS: virbitmaptest SKIP: vircgrouptest PASS: vircryptotest SKIP: virpcitest PASS: virendiantest PASS: commandtest PASS: virfiletest PASS: virfilecachetest PASS: viriscsitest SKIP: virfirewalltest PASS: virkeycodetest PASS: virlockspacetest PASS: virlogtest PASS: virrotatingfiletest PASS: virstringtest SKIP: virportallocatortest PASS: sysinfotest SKIP: virkmodtest PASS: vircapstest PASS: domaincapstest PASS: domainconftest SKIP: virhostdevtest SKIP: virnetdevtest PASS: virtypedparamtest PASS: vshtabletest PASS: virerrortest PASS: virnetmessagetest PASS: virnetsockettest SKIP: virnetdaemontest SKIP: virnetserverclienttest SKIP: virnettlscontexttest SKIP: virnettlssessiontest PASS: fdstreamtest PASS: virdbustest SKIP: virsystemdtest PASS: virpolkittest PASS: virschematest PASS: qemuxml2argvtest PASS: qemudomaincheckpointxml2xmltest PASS: qemudomainsnapshotxml2xmltest FAIL: qemumonitorjsontest FAIL: qemuhotplugtest PASS: qemuagenttest PASS: qemuxml2xmltest PASS: qemucaps2xmltest PASS: qemumemlocktest PASS: qemucommandutiltest FAIL: qemublocktest PASS: qemumigparamstest PASS: qemusecuritytest PASS: qemufirmwaretest PASS: qemuvhostusertest PASS: esxutilstest PASS: vboxsnapshotxmltest PASS: qemucapabilitiestest PASS: vmx2xmltest PASS: vmwarevertest PASS: xml2vmxtest PASS: bhyvexml2argvtest PASS: bhyvexml2xmltest PASS: virjsontest PASS: bhyveargv2xmltest PASS: virnetworkportxml2xmltest PASS: networkxml2xmltest PASS: networkxml2xmlupdatetest SKIP: networkxml2firewalltest PASS: networkxml2conftest PASS: virnwfilterbindingxml2xmltest PASS: storagevolxml2argvtest PASS: nwfilterxml2xmltest PASS: virstorageutiltest PASS: storagepoolxml2argvtest PASS: storagepoolxml2xmltest PASS: storagepoolcapstest PASS: nsstest PASS: nssguesttest PASS: storagevolxml2xmltest PASS: nodedevxml2xmltest PASS: interfacexml2xmltest PASS: metadatatest PASS: secretxml2xmltest PASS: genericxml2xmltest PASS: eventtest PASS: virdrivermoduletest PASS: virdriverconnvalidatetest PASS: objecteventtest PASS: virmacmaptest PASS: virnetdevopenvswitchtest PASS: libvirtd-fail PASS: libvirtd-pool PASS: virsh-cpuset PASS: virsh-define-dev-segfault PASS: virsh-int-overflow SKIP: virsh-optparse PASS: virsh-read-bufsiz PASS: virsh-read-non-seekable PASS: virsh-schedinfo PASS: virsh-self-test PASS: virt-admin-self-test PASS: virsh-checkpoint PASS: virsh-snapshot PASS: virsh-start PASS: virsh-undefine PASS: cputest PASS: virsh-uriprecedence PASS: virsh-vcpupin PASS: virshtest ============================================================================ Testsuite summary for libvirt 6.1.0 ============================================================================ # TOTAL: 120 # PASS: 101 # SKIP: 16 # XFAIL: 0 # FAIL: 3 # XPASS: 0 # ERROR: 0 ============================================================================ See tests/test-suite.log Please report to libvir-list@redhat.com ============================================================================ gmake[4]: *** [Makefile:5134: test-suite.log] Error 1 gmake[4]: Leaving directory '/usr<https://ci.centos.org/job/libvirt-check/systems=libvirt-freebsd-12/ws/build/tests'> gmake[3]: *** [Makefile:5242: check-TESTS] Error 2 gmake[3]: Leaving directory '/usr<https://ci.centos.org/job/libvirt-check/systems=libvirt-freebsd-12/ws/build/tests'> gmake[2]: *** [Makefile:6296: check-am] Error 2 gmake[2]: Leaving directory '/usr<https://ci.centos.org/job/libvirt-check/systems=libvirt-freebsd-12/ws/build/tests'> gmake[1]: *** [Makefile:1082: check-recursive] Error 1 gmake[1]: Leaving directory '/usr<https://ci.centos.org/job/libvirt-check/systems=libvirt-freebsd-12/ws/build'> gmake: *** [Makefile:1377: check] Error 2 + find -name test-suite.log + xargs cat find: illegal option -- n usage: find [-H | -L | -P] [-EXdsx] [-f path] path ... [expression] find [-H | -L | -P] [-EXdsx] -f path [path ...] [expression] + exit 1 Build step 'Execute shell' marked build as failure

See <https://ci.centos.org/job/libvirt-check/systems=libvirt-freebsd-12/948/display/redirect> ------------------------------------------ [...truncated 3.53 KB...] gmake[5]: Leaving directory '/usr<https://ci.centos.org/job/libvirt-check/systems=libvirt-freebsd-12/ws/build/include/libvirt'> Making all in src gmake[5]: Entering directory '/usr<https://ci.centos.org/job/libvirt-check/systems=libvirt-freebsd-12/ws/build/src'> /usr/local/bin/gmake all-am gmake[6]: Entering directory '/usr<https://ci.centos.org/job/libvirt-check/systems=libvirt-freebsd-12/ws/build/src'> gmake[6]: Nothing to be done for 'all-am'. gmake[6]: Leaving directory '/usr<https://ci.centos.org/job/libvirt-check/systems=libvirt-freebsd-12/ws/build/src'> gmake[5]: Leaving directory '/usr<https://ci.centos.org/job/libvirt-check/systems=libvirt-freebsd-12/ws/build/src'> Making all in tools gmake[5]: Entering directory '/usr<https://ci.centos.org/job/libvirt-check/systems=libvirt-freebsd-12/ws/build/tools'> /usr/local/bin/gmake all-am gmake[6]: Entering directory '/usr<https://ci.centos.org/job/libvirt-check/systems=libvirt-freebsd-12/ws/build/tools'> gmake[6]: Nothing to be done for 'all-am'. gmake[6]: Leaving directory '/usr<https://ci.centos.org/job/libvirt-check/systems=libvirt-freebsd-12/ws/build/tools'> gmake[5]: Leaving directory '/usr<https://ci.centos.org/job/libvirt-check/systems=libvirt-freebsd-12/ws/build/tools'> Making all in docs gmake[5]: Entering directory '/usr<https://ci.centos.org/job/libvirt-check/systems=libvirt-freebsd-12/ws/build/docs'> gmake[5]: Leaving directory '/usr<https://ci.centos.org/job/libvirt-check/systems=libvirt-freebsd-12/ws/build/docs'> Making all in tests gmake[5]: Entering directory '/usr<https://ci.centos.org/job/libvirt-check/systems=libvirt-freebsd-12/ws/build/tests'> gmake[5]: Nothing to be done for 'all'. gmake[5]: Leaving directory '/usr<https://ci.centos.org/job/libvirt-check/systems=libvirt-freebsd-12/ws/build/tests'> Making all in po gmake[5]: Entering directory '/usr<https://ci.centos.org/job/libvirt-check/systems=libvirt-freebsd-12/ws/build/po'> cat: POTFILES: No such file or directory gmake[5]: Nothing to be done for 'all'. gmake[5]: Leaving directory '/usr<https://ci.centos.org/job/libvirt-check/systems=libvirt-freebsd-12/ws/build/po'> Making all in examples gmake[5]: Entering directory '/usr<https://ci.centos.org/job/libvirt-check/systems=libvirt-freebsd-12/ws/build/examples'> gmake[5]: Nothing to be done for 'all'. gmake[5]: Leaving directory '/usr<https://ci.centos.org/job/libvirt-check/systems=libvirt-freebsd-12/ws/build/examples'> gmake[4]: Leaving directory '/usr<https://ci.centos.org/job/libvirt-check/systems=libvirt-freebsd-12/ws/build'> gmake[3]: Leaving directory '/usr<https://ci.centos.org/job/libvirt-check/systems=libvirt-freebsd-12/ws/build'> gmake[2]: Leaving directory '/usr<https://ci.centos.org/job/libvirt-check/systems=libvirt-freebsd-12/ws/build'> Making check in gnulib/lib gmake[2]: Entering directory '/usr<https://ci.centos.org/job/libvirt-check/systems=libvirt-freebsd-12/ws/build/gnulib/lib'> /usr/local/bin/gmake check-am gmake[3]: Entering directory '/usr<https://ci.centos.org/job/libvirt-check/systems=libvirt-freebsd-12/ws/build/gnulib/lib'> gmake[3]: Nothing to be done for 'check-am'. gmake[3]: Leaving directory '/usr<https://ci.centos.org/job/libvirt-check/systems=libvirt-freebsd-12/ws/build/gnulib/lib'> gmake[2]: Leaving directory '/usr<https://ci.centos.org/job/libvirt-check/systems=libvirt-freebsd-12/ws/build/gnulib/lib'> Making check in include/libvirt gmake[2]: Entering directory '/usr<https://ci.centos.org/job/libvirt-check/systems=libvirt-freebsd-12/ws/build/include/libvirt'> gmake[2]: Nothing to be done for 'check'. gmake[2]: Leaving directory '/usr<https://ci.centos.org/job/libvirt-check/systems=libvirt-freebsd-12/ws/build/include/libvirt'> Making check in src gmake[2]: Entering directory '/usr<https://ci.centos.org/job/libvirt-check/systems=libvirt-freebsd-12/ws/build/src'> /usr/local/bin/gmake check-am gmake[3]: Entering directory '/usr<https://ci.centos.org/job/libvirt-check/systems=libvirt-freebsd-12/ws/build/src'> /usr/local/bin/gmake check-local gmake[4]: Entering directory '/usr<https://ci.centos.org/job/libvirt-check/systems=libvirt-freebsd-12/ws/build/src'> GEN ../../src/lxc_protocol-struct GEN ../../src/remote_protocol-struct GEN ../../src/qemu_protocol-struct WARNING: skipping pdwtags test with Clang GEN ../../src/virnetprotocol-struct WARNING: skipping pdwtags test with Clang GEN ../../src/virkeepaliveprotocol-struct WARNING: skipping pdwtags test with Clang GEN ../../src/lock_protocol-struct WARNING: skipping pdwtags test with Clang GEN ../../src/admin_protocol-struct WARNING: skipping pdwtags test with Clang GEN check-symsorting WARNING: skipping pdwtags test with Clang GEN check-drivername GEN check-driverimpls WARNING: skipping pdwtags test with Clang GEN check-aclrules GEN check-aclperms GEN check-admin-symsorting GEN check-admin-drivername GEN check-augeas gmake[4]: Leaving directory '/usr<https://ci.centos.org/job/libvirt-check/systems=libvirt-freebsd-12/ws/build/src'> gmake[3]: Leaving directory '/usr<https://ci.centos.org/job/libvirt-check/systems=libvirt-freebsd-12/ws/build/src'> gmake[2]: Leaving directory '/usr<https://ci.centos.org/job/libvirt-check/systems=libvirt-freebsd-12/ws/build/src'> Making check in tools gmake[2]: Entering directory '/usr<https://ci.centos.org/job/libvirt-check/systems=libvirt-freebsd-12/ws/build/tools'> /usr/local/bin/gmake check-am gmake[3]: Entering directory '/usr<https://ci.centos.org/job/libvirt-check/systems=libvirt-freebsd-12/ws/build/tools'> gmake[3]: Nothing to be done for 'check-am'. gmake[3]: Leaving directory '/usr<https://ci.centos.org/job/libvirt-check/systems=libvirt-freebsd-12/ws/build/tools'> gmake[2]: Leaving directory '/usr<https://ci.centos.org/job/libvirt-check/systems=libvirt-freebsd-12/ws/build/tools'> Making check in docs gmake[2]: Entering directory '/usr<https://ci.centos.org/job/libvirt-check/systems=libvirt-freebsd-12/ws/build/docs'> /usr/local/bin/gmake check-local gmake[3]: Entering directory '/usr<https://ci.centos.org/job/libvirt-check/systems=libvirt-freebsd-12/ws/build/docs'> /usr/local/bin/xmllint --nonet --noout html/*.html gmake[3]: Leaving directory '/usr<https://ci.centos.org/job/libvirt-check/systems=libvirt-freebsd-12/ws/build/docs'> gmake[2]: Leaving directory '/usr<https://ci.centos.org/job/libvirt-check/systems=libvirt-freebsd-12/ws/build/docs'> Making check in tests gmake[2]: Entering directory '/usr<https://ci.centos.org/job/libvirt-check/systems=libvirt-freebsd-12/ws/build/tests'> /usr/local/bin/gmake gmake[3]: Entering directory '/usr<https://ci.centos.org/job/libvirt-check/systems=libvirt-freebsd-12/ws/build/tests'> gmake[3]: Nothing to be done for 'all'. gmake[3]: Leaving directory '/usr<https://ci.centos.org/job/libvirt-check/systems=libvirt-freebsd-12/ws/build/tests'> /usr/local/bin/gmake check-TESTS gmake[3]: Entering directory '/usr<https://ci.centos.org/job/libvirt-check/systems=libvirt-freebsd-12/ws/build/tests'> gmake[4]: Entering directory '/usr<https://ci.centos.org/job/libvirt-check/systems=libvirt-freebsd-12/ws/build/tests'> SKIP: virhostcputest PASS: sockettest PASS: virbuftest PASS: seclabeltest PASS: virhashtest PASS: virconftest PASS: utiltest SKIP: shunloadtest PASS: virtimetest PASS: viruritest PASS: virkeyfiletest PASS: viralloctest PASS: virauthconfigtest PASS: virbitmaptest PASS: commandtest SKIP: vircgrouptest SKIP: virpcitest PASS: vircryptotest PASS: virfiletest PASS: virendiantest PASS: virfilecachetest SKIP: virfirewalltest PASS: viriscsitest PASS: virkeycodetest PASS: virlockspacetest PASS: virlogtest PASS: virrotatingfiletest PASS: virstringtest SKIP: virportallocatortest PASS: sysinfotest SKIP: virkmodtest PASS: vircapstest PASS: domaincapstest PASS: domainconftest SKIP: virhostdevtest SKIP: virnetdevtest PASS: virtypedparamtest PASS: virschematest PASS: vshtabletest PASS: virnetmessagetest PASS: virerrortest SKIP: virnetdaemontest SKIP: virnetserverclienttest SKIP: virnettlscontexttest SKIP: virnettlssessiontest PASS: fdstreamtest PASS: virnetsockettest SKIP: virsystemdtest PASS: virdbustest PASS: virpolkittest PASS: qemuxml2xmltest PASS: qemudomaincheckpointxml2xmltest PASS: qemudomainsnapshotxml2xmltest FAIL: qemumonitorjsontest FAIL: qemuhotplugtest PASS: qemuagenttest PASS: qemucapabilitiestest PASS: qemuxml2argvtest PASS: qemucaps2xmltest PASS: qemucommandutiltest FAIL: qemublocktest PASS: qemumigparamstest PASS: qemumemlocktest PASS: qemufirmwaretest PASS: qemuvhostusertest PASS: esxutilstest PASS: vboxsnapshotxmltest PASS: vmx2xmltest PASS: xml2vmxtest PASS: vmwarevertest PASS: bhyvexml2argvtest PASS: qemusecuritytest PASS: bhyvexml2xmltest PASS: bhyveargv2xmltest PASS: virjsontest PASS: virnetworkportxml2xmltest PASS: networkxml2xmlupdatetest PASS: networkxml2xmltest PASS: networkxml2conftest SKIP: networkxml2firewalltest PASS: nwfilterxml2xmltest PASS: virnwfilterbindingxml2xmltest PASS: storagevolxml2argvtest PASS: virstorageutiltest PASS: storagepoolxml2argvtest PASS: storagepoolxml2xmltest PASS: storagepoolcapstest PASS: nsstest PASS: nssguesttest PASS: storagevolxml2xmltest PASS: nodedevxml2xmltest PASS: interfacexml2xmltest PASS: metadatatest PASS: secretxml2xmltest PASS: genericxml2xmltest PASS: eventtest PASS: virdrivermoduletest PASS: virdriverconnvalidatetest PASS: objecteventtest PASS: virmacmaptest PASS: virnetdevopenvswitchtest PASS: libvirtd-fail PASS: libvirtd-pool PASS: cputest PASS: virsh-define-dev-segfault PASS: virsh-cpuset PASS: virsh-int-overflow SKIP: virsh-optparse PASS: virsh-read-non-seekable PASS: virsh-read-bufsiz PASS: virsh-self-test PASS: virsh-schedinfo PASS: virt-admin-self-test PASS: virsh-checkpoint PASS: virsh-start PASS: virsh-snapshot PASS: virsh-undefine PASS: virsh-uriprecedence PASS: virsh-vcpupin PASS: virshtest ============================================================================ Testsuite summary for libvirt 6.1.0 ============================================================================ # TOTAL: 120 # PASS: 101 # SKIP: 16 # XFAIL: 0 # FAIL: 3 # XPASS: 0 # ERROR: 0 ============================================================================ See tests/test-suite.log Please report to libvir-list@redhat.com ============================================================================ gmake[4]: *** [Makefile:5134: test-suite.log] Error 1 gmake[4]: Leaving directory '/usr<https://ci.centos.org/job/libvirt-check/systems=libvirt-freebsd-12/ws/build/tests'> gmake[3]: *** [Makefile:5242: check-TESTS] Error 2 gmake[3]: Leaving directory '/usr<https://ci.centos.org/job/libvirt-check/systems=libvirt-freebsd-12/ws/build/tests'> gmake[2]: *** [Makefile:6296: check-am] Error 2 gmake[2]: Leaving directory '/usr<https://ci.centos.org/job/libvirt-check/systems=libvirt-freebsd-12/ws/build/tests'> gmake[1]: *** [Makefile:1082: check-recursive] Error 1 gmake[1]: Leaving directory '/usr<https://ci.centos.org/job/libvirt-check/systems=libvirt-freebsd-12/ws/build'> gmake: *** [Makefile:1377: check] Error 2 + find -name test-suite.log + xargs cat find: illegal option -- n usage: find [-H | -L | -P] [-EXdsx] [-f path] path ... [expression] find [-H | -L | -P] [-EXdsx] -f path [path ...] [expression] + exit 1 Build step 'Execute shell' marked build as failure

See <https://ci.centos.org/job/libvirt-check/systems=libvirt-freebsd-12/949/display/redirect> ------------------------------------------ [...truncated 3.53 KB...] gmake[5]: Leaving directory '/usr<https://ci.centos.org/job/libvirt-check/systems=libvirt-freebsd-12/ws/build/include/libvirt'> Making all in src gmake[5]: Entering directory '/usr<https://ci.centos.org/job/libvirt-check/systems=libvirt-freebsd-12/ws/build/src'> /usr/local/bin/gmake all-am gmake[6]: Entering directory '/usr<https://ci.centos.org/job/libvirt-check/systems=libvirt-freebsd-12/ws/build/src'> gmake[6]: Nothing to be done for 'all-am'. gmake[6]: Leaving directory '/usr<https://ci.centos.org/job/libvirt-check/systems=libvirt-freebsd-12/ws/build/src'> gmake[5]: Leaving directory '/usr<https://ci.centos.org/job/libvirt-check/systems=libvirt-freebsd-12/ws/build/src'> Making all in tools gmake[5]: Entering directory '/usr<https://ci.centos.org/job/libvirt-check/systems=libvirt-freebsd-12/ws/build/tools'> /usr/local/bin/gmake all-am gmake[6]: Entering directory '/usr<https://ci.centos.org/job/libvirt-check/systems=libvirt-freebsd-12/ws/build/tools'> gmake[6]: Nothing to be done for 'all-am'. gmake[6]: Leaving directory '/usr<https://ci.centos.org/job/libvirt-check/systems=libvirt-freebsd-12/ws/build/tools'> gmake[5]: Leaving directory '/usr<https://ci.centos.org/job/libvirt-check/systems=libvirt-freebsd-12/ws/build/tools'> Making all in docs gmake[5]: Entering directory '/usr<https://ci.centos.org/job/libvirt-check/systems=libvirt-freebsd-12/ws/build/docs'> gmake[5]: Leaving directory '/usr<https://ci.centos.org/job/libvirt-check/systems=libvirt-freebsd-12/ws/build/docs'> Making all in tests gmake[5]: Entering directory '/usr<https://ci.centos.org/job/libvirt-check/systems=libvirt-freebsd-12/ws/build/tests'> gmake[5]: Nothing to be done for 'all'. gmake[5]: Leaving directory '/usr<https://ci.centos.org/job/libvirt-check/systems=libvirt-freebsd-12/ws/build/tests'> Making all in po gmake[5]: Entering directory '/usr<https://ci.centos.org/job/libvirt-check/systems=libvirt-freebsd-12/ws/build/po'> cat: POTFILES: No such file or directory gmake[5]: Nothing to be done for 'all'. gmake[5]: Leaving directory '/usr<https://ci.centos.org/job/libvirt-check/systems=libvirt-freebsd-12/ws/build/po'> Making all in examples gmake[5]: Entering directory '/usr<https://ci.centos.org/job/libvirt-check/systems=libvirt-freebsd-12/ws/build/examples'> gmake[5]: Nothing to be done for 'all'. gmake[5]: Leaving directory '/usr<https://ci.centos.org/job/libvirt-check/systems=libvirt-freebsd-12/ws/build/examples'> gmake[4]: Leaving directory '/usr<https://ci.centos.org/job/libvirt-check/systems=libvirt-freebsd-12/ws/build'> gmake[3]: Leaving directory '/usr<https://ci.centos.org/job/libvirt-check/systems=libvirt-freebsd-12/ws/build'> gmake[2]: Leaving directory '/usr<https://ci.centos.org/job/libvirt-check/systems=libvirt-freebsd-12/ws/build'> Making check in gnulib/lib gmake[2]: Entering directory '/usr<https://ci.centos.org/job/libvirt-check/systems=libvirt-freebsd-12/ws/build/gnulib/lib'> /usr/local/bin/gmake check-am gmake[3]: Entering directory '/usr<https://ci.centos.org/job/libvirt-check/systems=libvirt-freebsd-12/ws/build/gnulib/lib'> gmake[3]: Nothing to be done for 'check-am'. gmake[3]: Leaving directory '/usr<https://ci.centos.org/job/libvirt-check/systems=libvirt-freebsd-12/ws/build/gnulib/lib'> gmake[2]: Leaving directory '/usr<https://ci.centos.org/job/libvirt-check/systems=libvirt-freebsd-12/ws/build/gnulib/lib'> Making check in include/libvirt gmake[2]: Entering directory '/usr<https://ci.centos.org/job/libvirt-check/systems=libvirt-freebsd-12/ws/build/include/libvirt'> gmake[2]: Nothing to be done for 'check'. gmake[2]: Leaving directory '/usr<https://ci.centos.org/job/libvirt-check/systems=libvirt-freebsd-12/ws/build/include/libvirt'> Making check in src gmake[2]: Entering directory '/usr<https://ci.centos.org/job/libvirt-check/systems=libvirt-freebsd-12/ws/build/src'> /usr/local/bin/gmake check-am gmake[3]: Entering directory '/usr<https://ci.centos.org/job/libvirt-check/systems=libvirt-freebsd-12/ws/build/src'> /usr/local/bin/gmake check-local gmake[4]: Entering directory '/usr<https://ci.centos.org/job/libvirt-check/systems=libvirt-freebsd-12/ws/build/src'> GEN ../../src/remote_protocol-struct GEN ../../src/qemu_protocol-struct GEN ../../src/lxc_protocol-struct WARNING: skipping pdwtags test with Clang GEN ../../src/virnetprotocol-struct WARNING: skipping pdwtags test with Clang GEN ../../src/virkeepaliveprotocol-struct WARNING: skipping pdwtags test with Clang WARNING: skipping pdwtags test with Clang GEN ../../src/lock_protocol-struct GEN ../../src/admin_protocol-struct WARNING: skipping pdwtags test with Clang GEN check-symsorting WARNING: skipping pdwtags test with Clang WARNING: skipping pdwtags test with Clang GEN check-driverimpls GEN check-drivername GEN check-aclrules GEN check-aclperms GEN check-admin-symsorting GEN check-admin-drivername GEN check-augeas gmake[4]: Leaving directory '/usr<https://ci.centos.org/job/libvirt-check/systems=libvirt-freebsd-12/ws/build/src'> gmake[3]: Leaving directory '/usr<https://ci.centos.org/job/libvirt-check/systems=libvirt-freebsd-12/ws/build/src'> gmake[2]: Leaving directory '/usr<https://ci.centos.org/job/libvirt-check/systems=libvirt-freebsd-12/ws/build/src'> Making check in tools gmake[2]: Entering directory '/usr<https://ci.centos.org/job/libvirt-check/systems=libvirt-freebsd-12/ws/build/tools'> /usr/local/bin/gmake check-am gmake[3]: Entering directory '/usr<https://ci.centos.org/job/libvirt-check/systems=libvirt-freebsd-12/ws/build/tools'> gmake[3]: Nothing to be done for 'check-am'. gmake[3]: Leaving directory '/usr<https://ci.centos.org/job/libvirt-check/systems=libvirt-freebsd-12/ws/build/tools'> gmake[2]: Leaving directory '/usr<https://ci.centos.org/job/libvirt-check/systems=libvirt-freebsd-12/ws/build/tools'> Making check in docs gmake[2]: Entering directory '/usr<https://ci.centos.org/job/libvirt-check/systems=libvirt-freebsd-12/ws/build/docs'> /usr/local/bin/gmake check-local gmake[3]: Entering directory '/usr<https://ci.centos.org/job/libvirt-check/systems=libvirt-freebsd-12/ws/build/docs'> /usr/local/bin/xmllint --nonet --noout html/*.html gmake[3]: Leaving directory '/usr<https://ci.centos.org/job/libvirt-check/systems=libvirt-freebsd-12/ws/build/docs'> gmake[2]: Leaving directory '/usr<https://ci.centos.org/job/libvirt-check/systems=libvirt-freebsd-12/ws/build/docs'> Making check in tests gmake[2]: Entering directory '/usr<https://ci.centos.org/job/libvirt-check/systems=libvirt-freebsd-12/ws/build/tests'> /usr/local/bin/gmake gmake[3]: Entering directory '/usr<https://ci.centos.org/job/libvirt-check/systems=libvirt-freebsd-12/ws/build/tests'> gmake[3]: Nothing to be done for 'all'. gmake[3]: Leaving directory '/usr<https://ci.centos.org/job/libvirt-check/systems=libvirt-freebsd-12/ws/build/tests'> /usr/local/bin/gmake check-TESTS gmake[3]: Entering directory '/usr<https://ci.centos.org/job/libvirt-check/systems=libvirt-freebsd-12/ws/build/tests'> gmake[4]: Entering directory '/usr<https://ci.centos.org/job/libvirt-check/systems=libvirt-freebsd-12/ws/build/tests'> SKIP: virhostcputest PASS: virbuftest PASS: sockettest PASS: seclabeltest PASS: virhashtest PASS: virconftest PASS: utiltest SKIP: shunloadtest PASS: virtimetest PASS: viruritest PASS: virkeyfiletest PASS: viralloctest PASS: virauthconfigtest PASS: virbitmaptest SKIP: vircgrouptest PASS: vircryptotest SKIP: virpcitest PASS: commandtest PASS: virendiantest PASS: virfiletest SKIP: virfirewalltest PASS: virfilecachetest PASS: virkeycodetest PASS: viriscsitest PASS: virlockspacetest PASS: virlogtest PASS: virrotatingfiletest PASS: virstringtest SKIP: virportallocatortest PASS: sysinfotest SKIP: virkmodtest PASS: vircapstest PASS: domaincapstest PASS: domainconftest SKIP: virhostdevtest SKIP: virnetdevtest PASS: virtypedparamtest PASS: vshtabletest PASS: virerrortest PASS: virnetmessagetest PASS: virnetsockettest SKIP: virnetdaemontest SKIP: virnetserverclienttest SKIP: virnettlscontexttest SKIP: virnettlssessiontest PASS: fdstreamtest PASS: virdbustest SKIP: virsystemdtest PASS: virpolkittest PASS: virschematest PASS: qemuxml2xmltest PASS: qemuxml2argvtest PASS: qemudomainsnapshotxml2xmltest PASS: qemudomaincheckpointxml2xmltest FAIL: qemuhotplugtest FAIL: qemumonitorjsontest PASS: qemuagenttest PASS: qemucaps2xmltest PASS: qemumemlocktest PASS: qemucommandutiltest FAIL: qemublocktest PASS: qemumigparamstest PASS: qemusecuritytest PASS: qemufirmwaretest PASS: qemuvhostusertest PASS: esxutilstest PASS: vboxsnapshotxmltest PASS: vmx2xmltest PASS: xml2vmxtest PASS: vmwarevertest PASS: qemucapabilitiestest PASS: bhyvexml2argvtest PASS: bhyvexml2xmltest PASS: virjsontest PASS: bhyveargv2xmltest PASS: virnetworkportxml2xmltest PASS: networkxml2xmltest PASS: networkxml2xmlupdatetest SKIP: networkxml2firewalltest PASS: networkxml2conftest PASS: virnwfilterbindingxml2xmltest PASS: storagevolxml2argvtest PASS: storagepoolxml2argvtest PASS: nwfilterxml2xmltest PASS: virstorageutiltest PASS: storagepoolcapstest PASS: storagepoolxml2xmltest PASS: nssguesttest PASS: nsstest PASS: nodedevxml2xmltest PASS: storagevolxml2xmltest PASS: interfacexml2xmltest PASS: metadatatest PASS: secretxml2xmltest PASS: genericxml2xmltest PASS: eventtest PASS: virdrivermoduletest PASS: virdriverconnvalidatetest PASS: objecteventtest PASS: virmacmaptest PASS: virnetdevopenvswitchtest PASS: libvirtd-fail PASS: libvirtd-pool PASS: virsh-cpuset PASS: virsh-define-dev-segfault PASS: virsh-int-overflow SKIP: virsh-optparse PASS: virsh-read-bufsiz PASS: virsh-read-non-seekable PASS: virsh-schedinfo PASS: virsh-self-test PASS: virt-admin-self-test PASS: virsh-checkpoint PASS: virsh-snapshot PASS: virsh-start PASS: virsh-undefine PASS: cputest PASS: virsh-uriprecedence PASS: virsh-vcpupin PASS: virshtest ============================================================================ Testsuite summary for libvirt 6.1.0 ============================================================================ # TOTAL: 120 # PASS: 101 # SKIP: 16 # XFAIL: 0 # FAIL: 3 # XPASS: 0 # ERROR: 0 ============================================================================ See tests/test-suite.log Please report to libvir-list@redhat.com ============================================================================ gmake[4]: *** [Makefile:5134: test-suite.log] Error 1 gmake[4]: Leaving directory '/usr<https://ci.centos.org/job/libvirt-check/systems=libvirt-freebsd-12/ws/build/tests'> gmake[3]: *** [Makefile:5242: check-TESTS] Error 2 gmake[3]: Leaving directory '/usr<https://ci.centos.org/job/libvirt-check/systems=libvirt-freebsd-12/ws/build/tests'> gmake[2]: *** [Makefile:6296: check-am] Error 2 gmake[2]: Leaving directory '/usr<https://ci.centos.org/job/libvirt-check/systems=libvirt-freebsd-12/ws/build/tests'> gmake[1]: *** [Makefile:1082: check-recursive] Error 1 gmake[1]: Leaving directory '/usr<https://ci.centos.org/job/libvirt-check/systems=libvirt-freebsd-12/ws/build'> gmake: *** [Makefile:1377: check] Error 2 + xargs cat + find -name test-suite.log find: illegal option -- n usage: find [-H | -L | -P] [-EXdsx] [-f path] path ... [expression] find [-H | -L | -P] [-EXdsx] -f path [path ...] [expression] + exit 1 Build step 'Execute shell' marked build as failure

See <https://ci.centos.org/job/libvirt-check/systems=libvirt-freebsd-12/950/display/redirect> ------------------------------------------ [...truncated 3.53 KB...] gmake[5]: Leaving directory '/usr<https://ci.centos.org/job/libvirt-check/systems=libvirt-freebsd-12/ws/build/include/libvirt'> Making all in src gmake[5]: Entering directory '/usr<https://ci.centos.org/job/libvirt-check/systems=libvirt-freebsd-12/ws/build/src'> /usr/local/bin/gmake all-am gmake[6]: Entering directory '/usr<https://ci.centos.org/job/libvirt-check/systems=libvirt-freebsd-12/ws/build/src'> gmake[6]: Nothing to be done for 'all-am'. gmake[6]: Leaving directory '/usr<https://ci.centos.org/job/libvirt-check/systems=libvirt-freebsd-12/ws/build/src'> gmake[5]: Leaving directory '/usr<https://ci.centos.org/job/libvirt-check/systems=libvirt-freebsd-12/ws/build/src'> Making all in tools gmake[5]: Entering directory '/usr<https://ci.centos.org/job/libvirt-check/systems=libvirt-freebsd-12/ws/build/tools'> /usr/local/bin/gmake all-am gmake[6]: Entering directory '/usr<https://ci.centos.org/job/libvirt-check/systems=libvirt-freebsd-12/ws/build/tools'> gmake[6]: Nothing to be done for 'all-am'. gmake[6]: Leaving directory '/usr<https://ci.centos.org/job/libvirt-check/systems=libvirt-freebsd-12/ws/build/tools'> gmake[5]: Leaving directory '/usr<https://ci.centos.org/job/libvirt-check/systems=libvirt-freebsd-12/ws/build/tools'> Making all in docs gmake[5]: Entering directory '/usr<https://ci.centos.org/job/libvirt-check/systems=libvirt-freebsd-12/ws/build/docs'> gmake[5]: Leaving directory '/usr<https://ci.centos.org/job/libvirt-check/systems=libvirt-freebsd-12/ws/build/docs'> Making all in tests gmake[5]: Entering directory '/usr<https://ci.centos.org/job/libvirt-check/systems=libvirt-freebsd-12/ws/build/tests'> gmake[5]: Nothing to be done for 'all'. gmake[5]: Leaving directory '/usr<https://ci.centos.org/job/libvirt-check/systems=libvirt-freebsd-12/ws/build/tests'> Making all in po gmake[5]: Entering directory '/usr<https://ci.centos.org/job/libvirt-check/systems=libvirt-freebsd-12/ws/build/po'> cat: POTFILES: No such file or directory gmake[5]: Nothing to be done for 'all'. gmake[5]: Leaving directory '/usr<https://ci.centos.org/job/libvirt-check/systems=libvirt-freebsd-12/ws/build/po'> Making all in examples gmake[5]: Entering directory '/usr<https://ci.centos.org/job/libvirt-check/systems=libvirt-freebsd-12/ws/build/examples'> gmake[5]: Nothing to be done for 'all'. gmake[5]: Leaving directory '/usr<https://ci.centos.org/job/libvirt-check/systems=libvirt-freebsd-12/ws/build/examples'> gmake[4]: Leaving directory '/usr<https://ci.centos.org/job/libvirt-check/systems=libvirt-freebsd-12/ws/build'> gmake[3]: Leaving directory '/usr<https://ci.centos.org/job/libvirt-check/systems=libvirt-freebsd-12/ws/build'> gmake[2]: Leaving directory '/usr<https://ci.centos.org/job/libvirt-check/systems=libvirt-freebsd-12/ws/build'> Making check in gnulib/lib gmake[2]: Entering directory '/usr<https://ci.centos.org/job/libvirt-check/systems=libvirt-freebsd-12/ws/build/gnulib/lib'> /usr/local/bin/gmake check-am gmake[3]: Entering directory '/usr<https://ci.centos.org/job/libvirt-check/systems=libvirt-freebsd-12/ws/build/gnulib/lib'> gmake[3]: Nothing to be done for 'check-am'. gmake[3]: Leaving directory '/usr<https://ci.centos.org/job/libvirt-check/systems=libvirt-freebsd-12/ws/build/gnulib/lib'> gmake[2]: Leaving directory '/usr<https://ci.centos.org/job/libvirt-check/systems=libvirt-freebsd-12/ws/build/gnulib/lib'> Making check in include/libvirt gmake[2]: Entering directory '/usr<https://ci.centos.org/job/libvirt-check/systems=libvirt-freebsd-12/ws/build/include/libvirt'> gmake[2]: Nothing to be done for 'check'. gmake[2]: Leaving directory '/usr<https://ci.centos.org/job/libvirt-check/systems=libvirt-freebsd-12/ws/build/include/libvirt'> Making check in src gmake[2]: Entering directory '/usr<https://ci.centos.org/job/libvirt-check/systems=libvirt-freebsd-12/ws/build/src'> /usr/local/bin/gmake check-am gmake[3]: Entering directory '/usr<https://ci.centos.org/job/libvirt-check/systems=libvirt-freebsd-12/ws/build/src'> /usr/local/bin/gmake check-local gmake[4]: Entering directory '/usr<https://ci.centos.org/job/libvirt-check/systems=libvirt-freebsd-12/ws/build/src'> GEN ../../src/remote_protocol-struct GEN ../../src/lxc_protocol-struct GEN ../../src/qemu_protocol-struct WARNING: skipping pdwtags test with Clang GEN ../../src/virnetprotocol-struct WARNING: skipping pdwtags test with Clang GEN ../../src/virkeepaliveprotocol-struct WARNING: skipping pdwtags test with Clang GEN ../../src/lock_protocol-struct WARNING: skipping pdwtags test with Clang GEN ../../src/admin_protocol-struct WARNING: skipping pdwtags test with Clang GEN check-symsorting WARNING: skipping pdwtags test with Clang GEN check-drivername WARNING: skipping pdwtags test with Clang GEN check-driverimpls GEN check-aclrules GEN check-aclperms GEN check-admin-symsorting GEN check-admin-drivername GEN check-augeas gmake[4]: Leaving directory '/usr<https://ci.centos.org/job/libvirt-check/systems=libvirt-freebsd-12/ws/build/src'> gmake[3]: Leaving directory '/usr<https://ci.centos.org/job/libvirt-check/systems=libvirt-freebsd-12/ws/build/src'> gmake[2]: Leaving directory '/usr<https://ci.centos.org/job/libvirt-check/systems=libvirt-freebsd-12/ws/build/src'> Making check in tools gmake[2]: Entering directory '/usr<https://ci.centos.org/job/libvirt-check/systems=libvirt-freebsd-12/ws/build/tools'> /usr/local/bin/gmake check-am gmake[3]: Entering directory '/usr<https://ci.centos.org/job/libvirt-check/systems=libvirt-freebsd-12/ws/build/tools'> gmake[3]: Nothing to be done for 'check-am'. gmake[3]: Leaving directory '/usr<https://ci.centos.org/job/libvirt-check/systems=libvirt-freebsd-12/ws/build/tools'> gmake[2]: Leaving directory '/usr<https://ci.centos.org/job/libvirt-check/systems=libvirt-freebsd-12/ws/build/tools'> Making check in docs gmake[2]: Entering directory '/usr<https://ci.centos.org/job/libvirt-check/systems=libvirt-freebsd-12/ws/build/docs'> /usr/local/bin/gmake check-local gmake[3]: Entering directory '/usr<https://ci.centos.org/job/libvirt-check/systems=libvirt-freebsd-12/ws/build/docs'> /usr/local/bin/xmllint --nonet --noout html/*.html gmake[3]: Leaving directory '/usr<https://ci.centos.org/job/libvirt-check/systems=libvirt-freebsd-12/ws/build/docs'> gmake[2]: Leaving directory '/usr<https://ci.centos.org/job/libvirt-check/systems=libvirt-freebsd-12/ws/build/docs'> Making check in tests gmake[2]: Entering directory '/usr<https://ci.centos.org/job/libvirt-check/systems=libvirt-freebsd-12/ws/build/tests'> /usr/local/bin/gmake gmake[3]: Entering directory '/usr<https://ci.centos.org/job/libvirt-check/systems=libvirt-freebsd-12/ws/build/tests'> gmake[3]: Nothing to be done for 'all'. gmake[3]: Leaving directory '/usr<https://ci.centos.org/job/libvirt-check/systems=libvirt-freebsd-12/ws/build/tests'> /usr/local/bin/gmake check-TESTS gmake[3]: Entering directory '/usr<https://ci.centos.org/job/libvirt-check/systems=libvirt-freebsd-12/ws/build/tests'> gmake[4]: Entering directory '/usr<https://ci.centos.org/job/libvirt-check/systems=libvirt-freebsd-12/ws/build/tests'> PASS: sockettest SKIP: virhostcputest PASS: virbuftest PASS: seclabeltest PASS: virhashtest PASS: virconftest PASS: utiltest SKIP: shunloadtest PASS: virtimetest PASS: viruritest PASS: virkeyfiletest PASS: viralloctest PASS: virauthconfigtest PASS: virbitmaptest SKIP: vircgrouptest PASS: vircryptotest PASS: commandtest SKIP: virpcitest PASS: virfiletest PASS: virendiantest SKIP: virfirewalltest PASS: virfilecachetest PASS: virkeycodetest PASS: viriscsitest PASS: virlockspacetest PASS: virlogtest PASS: virrotatingfiletest PASS: virstringtest SKIP: virportallocatortest PASS: sysinfotest SKIP: virkmodtest PASS: vircapstest PASS: domaincapstest PASS: domainconftest SKIP: virhostdevtest SKIP: virnetdevtest PASS: virtypedparamtest PASS: vshtabletest PASS: virerrortest PASS: virnetmessagetest PASS: virnetsockettest SKIP: virnetdaemontest SKIP: virnetserverclienttest SKIP: virnettlscontexttest PASS: virschematest SKIP: virnettlssessiontest PASS: fdstreamtest SKIP: virsystemdtest PASS: virdbustest PASS: virpolkittest PASS: qemuxml2xmltest PASS: qemudomaincheckpointxml2xmltest PASS: qemudomainsnapshotxml2xmltest FAIL: qemumonitorjsontest FAIL: qemuhotplugtest PASS: qemuagenttest PASS: qemuxml2argvtest PASS: qemucaps2xmltest PASS: qemumemlocktest PASS: qemucommandutiltest PASS: qemucapabilitiestest FAIL: qemublocktest PASS: qemumigparamstest PASS: qemufirmwaretest PASS: qemuvhostusertest PASS: esxutilstest PASS: vboxsnapshotxmltest PASS: vmx2xmltest PASS: qemusecuritytest PASS: xml2vmxtest PASS: bhyvexml2argvtest PASS: vmwarevertest PASS: bhyveargv2xmltest PASS: virjsontest PASS: bhyvexml2xmltest PASS: virnetworkportxml2xmltest PASS: networkxml2xmlupdatetest PASS: networkxml2conftest PASS: networkxml2xmltest PASS: nwfilterxml2xmltest SKIP: networkxml2firewalltest PASS: storagevolxml2argvtest PASS: storagepoolxml2argvtest PASS: virnwfilterbindingxml2xmltest PASS: storagepoolxml2xmltest PASS: storagepoolcapstest PASS: virstorageutiltest PASS: nssguesttest PASS: nsstest PASS: storagevolxml2xmltest PASS: nodedevxml2xmltest PASS: interfacexml2xmltest PASS: metadatatest PASS: secretxml2xmltest PASS: genericxml2xmltest PASS: eventtest PASS: virdrivermoduletest PASS: virdriverconnvalidatetest PASS: objecteventtest PASS: virmacmaptest PASS: virnetdevopenvswitchtest PASS: libvirtd-fail PASS: libvirtd-pool PASS: cputest PASS: virsh-cpuset PASS: virsh-define-dev-segfault PASS: virsh-int-overflow SKIP: virsh-optparse PASS: virsh-read-bufsiz PASS: virsh-read-non-seekable PASS: virsh-schedinfo PASS: virt-admin-self-test PASS: virsh-self-test PASS: virsh-checkpoint PASS: virsh-start PASS: virsh-snapshot PASS: virsh-undefine PASS: virsh-uriprecedence PASS: virsh-vcpupin PASS: virshtest ============================================================================ Testsuite summary for libvirt 6.1.0 ============================================================================ # TOTAL: 120 # PASS: 101 # SKIP: 16 # XFAIL: 0 # FAIL: 3 # XPASS: 0 # ERROR: 0 ============================================================================ See tests/test-suite.log Please report to libvir-list@redhat.com ============================================================================ gmake[4]: *** [Makefile:5134: test-suite.log] Error 1 gmake[4]: Leaving directory '/usr<https://ci.centos.org/job/libvirt-check/systems=libvirt-freebsd-12/ws/build/tests'> gmake[3]: *** [Makefile:5242: check-TESTS] Error 2 gmake[3]: Leaving directory '/usr<https://ci.centos.org/job/libvirt-check/systems=libvirt-freebsd-12/ws/build/tests'> gmake[2]: *** [Makefile:6296: check-am] Error 2 gmake[2]: Leaving directory '/usr<https://ci.centos.org/job/libvirt-check/systems=libvirt-freebsd-12/ws/build/tests'> gmake[1]: *** [Makefile:1082: check-recursive] Error 1 gmake[1]: Leaving directory '/usr<https://ci.centos.org/job/libvirt-check/systems=libvirt-freebsd-12/ws/build'> gmake: *** [Makefile:1377: check] Error 2 + find -name test-suite.log + xargs cat find: illegal option -- n usage: find [-H | -L | -P] [-EXdsx] [-f path] path ... [expression] find [-H | -L | -P] [-EXdsx] -f path [path ...] [expression] + exit 1 Build step 'Execute shell' marked build as failure

See <https://ci.centos.org/job/libvirt-check/systems=libvirt-freebsd-12/951/display/redirect> ------------------------------------------ [...truncated 3.53 KB...] gmake[5]: Leaving directory '/usr<https://ci.centos.org/job/libvirt-check/systems=libvirt-freebsd-12/ws/build/include/libvirt'> Making all in src gmake[5]: Entering directory '/usr<https://ci.centos.org/job/libvirt-check/systems=libvirt-freebsd-12/ws/build/src'> /usr/local/bin/gmake all-am gmake[6]: Entering directory '/usr<https://ci.centos.org/job/libvirt-check/systems=libvirt-freebsd-12/ws/build/src'> gmake[6]: Nothing to be done for 'all-am'. gmake[6]: Leaving directory '/usr<https://ci.centos.org/job/libvirt-check/systems=libvirt-freebsd-12/ws/build/src'> gmake[5]: Leaving directory '/usr<https://ci.centos.org/job/libvirt-check/systems=libvirt-freebsd-12/ws/build/src'> Making all in tools gmake[5]: Entering directory '/usr<https://ci.centos.org/job/libvirt-check/systems=libvirt-freebsd-12/ws/build/tools'> /usr/local/bin/gmake all-am gmake[6]: Entering directory '/usr<https://ci.centos.org/job/libvirt-check/systems=libvirt-freebsd-12/ws/build/tools'> gmake[6]: Nothing to be done for 'all-am'. gmake[6]: Leaving directory '/usr<https://ci.centos.org/job/libvirt-check/systems=libvirt-freebsd-12/ws/build/tools'> gmake[5]: Leaving directory '/usr<https://ci.centos.org/job/libvirt-check/systems=libvirt-freebsd-12/ws/build/tools'> Making all in docs gmake[5]: Entering directory '/usr<https://ci.centos.org/job/libvirt-check/systems=libvirt-freebsd-12/ws/build/docs'> gmake[5]: Leaving directory '/usr<https://ci.centos.org/job/libvirt-check/systems=libvirt-freebsd-12/ws/build/docs'> Making all in tests gmake[5]: Entering directory '/usr<https://ci.centos.org/job/libvirt-check/systems=libvirt-freebsd-12/ws/build/tests'> gmake[5]: Nothing to be done for 'all'. gmake[5]: Leaving directory '/usr<https://ci.centos.org/job/libvirt-check/systems=libvirt-freebsd-12/ws/build/tests'> Making all in po gmake[5]: Entering directory '/usr<https://ci.centos.org/job/libvirt-check/systems=libvirt-freebsd-12/ws/build/po'> cat: POTFILES: No such file or directory gmake[5]: Nothing to be done for 'all'. gmake[5]: Leaving directory '/usr<https://ci.centos.org/job/libvirt-check/systems=libvirt-freebsd-12/ws/build/po'> Making all in examples gmake[5]: Entering directory '/usr<https://ci.centos.org/job/libvirt-check/systems=libvirt-freebsd-12/ws/build/examples'> gmake[5]: Nothing to be done for 'all'. gmake[5]: Leaving directory '/usr<https://ci.centos.org/job/libvirt-check/systems=libvirt-freebsd-12/ws/build/examples'> gmake[4]: Leaving directory '/usr<https://ci.centos.org/job/libvirt-check/systems=libvirt-freebsd-12/ws/build'> gmake[3]: Leaving directory '/usr<https://ci.centos.org/job/libvirt-check/systems=libvirt-freebsd-12/ws/build'> gmake[2]: Leaving directory '/usr<https://ci.centos.org/job/libvirt-check/systems=libvirt-freebsd-12/ws/build'> Making check in gnulib/lib gmake[2]: Entering directory '/usr<https://ci.centos.org/job/libvirt-check/systems=libvirt-freebsd-12/ws/build/gnulib/lib'> /usr/local/bin/gmake check-am gmake[3]: Entering directory '/usr<https://ci.centos.org/job/libvirt-check/systems=libvirt-freebsd-12/ws/build/gnulib/lib'> gmake[3]: Nothing to be done for 'check-am'. gmake[3]: Leaving directory '/usr<https://ci.centos.org/job/libvirt-check/systems=libvirt-freebsd-12/ws/build/gnulib/lib'> gmake[2]: Leaving directory '/usr<https://ci.centos.org/job/libvirt-check/systems=libvirt-freebsd-12/ws/build/gnulib/lib'> Making check in include/libvirt gmake[2]: Entering directory '/usr<https://ci.centos.org/job/libvirt-check/systems=libvirt-freebsd-12/ws/build/include/libvirt'> gmake[2]: Nothing to be done for 'check'. gmake[2]: Leaving directory '/usr<https://ci.centos.org/job/libvirt-check/systems=libvirt-freebsd-12/ws/build/include/libvirt'> Making check in src gmake[2]: Entering directory '/usr<https://ci.centos.org/job/libvirt-check/systems=libvirt-freebsd-12/ws/build/src'> /usr/local/bin/gmake check-am gmake[3]: Entering directory '/usr<https://ci.centos.org/job/libvirt-check/systems=libvirt-freebsd-12/ws/build/src'> /usr/local/bin/gmake check-local gmake[4]: Entering directory '/usr<https://ci.centos.org/job/libvirt-check/systems=libvirt-freebsd-12/ws/build/src'> GEN ../../src/remote_protocol-struct GEN ../../src/lxc_protocol-struct GEN ../../src/qemu_protocol-struct WARNING: skipping pdwtags test with Clang GEN ../../src/virnetprotocol-struct WARNING: skipping pdwtags test with Clang GEN ../../src/virkeepaliveprotocol-struct WARNING: skipping pdwtags test with Clang GEN ../../src/lock_protocol-struct WARNING: skipping pdwtags test with Clang WARNING: skipping pdwtags test with Clang GEN check-symsorting GEN ../../src/admin_protocol-struct GEN check-drivername WARNING: skipping pdwtags test with Clang GEN check-driverimpls WARNING: skipping pdwtags test with Clang GEN check-aclrules GEN check-aclperms GEN check-admin-symsorting GEN check-admin-drivername GEN check-augeas gmake[4]: Leaving directory '/usr<https://ci.centos.org/job/libvirt-check/systems=libvirt-freebsd-12/ws/build/src'> gmake[3]: Leaving directory '/usr<https://ci.centos.org/job/libvirt-check/systems=libvirt-freebsd-12/ws/build/src'> gmake[2]: Leaving directory '/usr<https://ci.centos.org/job/libvirt-check/systems=libvirt-freebsd-12/ws/build/src'> Making check in tools gmake[2]: Entering directory '/usr<https://ci.centos.org/job/libvirt-check/systems=libvirt-freebsd-12/ws/build/tools'> /usr/local/bin/gmake check-am gmake[3]: Entering directory '/usr<https://ci.centos.org/job/libvirt-check/systems=libvirt-freebsd-12/ws/build/tools'> gmake[3]: Nothing to be done for 'check-am'. gmake[3]: Leaving directory '/usr<https://ci.centos.org/job/libvirt-check/systems=libvirt-freebsd-12/ws/build/tools'> gmake[2]: Leaving directory '/usr<https://ci.centos.org/job/libvirt-check/systems=libvirt-freebsd-12/ws/build/tools'> Making check in docs gmake[2]: Entering directory '/usr<https://ci.centos.org/job/libvirt-check/systems=libvirt-freebsd-12/ws/build/docs'> /usr/local/bin/gmake check-local gmake[3]: Entering directory '/usr<https://ci.centos.org/job/libvirt-check/systems=libvirt-freebsd-12/ws/build/docs'> /usr/local/bin/xmllint --nonet --noout html/*.html gmake[3]: Leaving directory '/usr<https://ci.centos.org/job/libvirt-check/systems=libvirt-freebsd-12/ws/build/docs'> gmake[2]: Leaving directory '/usr<https://ci.centos.org/job/libvirt-check/systems=libvirt-freebsd-12/ws/build/docs'> Making check in tests gmake[2]: Entering directory '/usr<https://ci.centos.org/job/libvirt-check/systems=libvirt-freebsd-12/ws/build/tests'> /usr/local/bin/gmake gmake[3]: Entering directory '/usr<https://ci.centos.org/job/libvirt-check/systems=libvirt-freebsd-12/ws/build/tests'> gmake[3]: Nothing to be done for 'all'. gmake[3]: Leaving directory '/usr<https://ci.centos.org/job/libvirt-check/systems=libvirt-freebsd-12/ws/build/tests'> /usr/local/bin/gmake check-TESTS gmake[3]: Entering directory '/usr<https://ci.centos.org/job/libvirt-check/systems=libvirt-freebsd-12/ws/build/tests'> gmake[4]: Entering directory '/usr<https://ci.centos.org/job/libvirt-check/systems=libvirt-freebsd-12/ws/build/tests'> PASS: sockettest SKIP: virhostcputest PASS: virbuftest PASS: seclabeltest PASS: virhashtest PASS: virconftest PASS: utiltest SKIP: shunloadtest PASS: virtimetest PASS: viruritest PASS: virkeyfiletest PASS: viralloctest PASS: virauthconfigtest PASS: virbitmaptest SKIP: vircgrouptest PASS: vircryptotest SKIP: virpcitest PASS: virendiantest PASS: virfiletest PASS: virfilecachetest PASS: commandtest SKIP: virfirewalltest PASS: viriscsitest PASS: virkeycodetest PASS: virlockspacetest PASS: virlogtest PASS: virrotatingfiletest PASS: virstringtest SKIP: virportallocatortest PASS: sysinfotest SKIP: virkmodtest PASS: vircapstest PASS: domaincapstest PASS: domainconftest SKIP: virhostdevtest SKIP: virnetdevtest PASS: virtypedparamtest PASS: vshtabletest PASS: virerrortest PASS: virnetmessagetest PASS: virnetsockettest SKIP: virnetdaemontest SKIP: virnetserverclienttest SKIP: virnettlscontexttest SKIP: virnettlssessiontest PASS: fdstreamtest PASS: virdbustest PASS: virschematest SKIP: virsystemdtest PASS: virpolkittest PASS: qemuxml2xmltest PASS: qemudomaincheckpointxml2xmltest PASS: qemudomainsnapshotxml2xmltest FAIL: qemumonitorjsontest FAIL: qemuhotplugtest PASS: qemuagenttest PASS: qemucapabilitiestest PASS: qemucaps2xmltest PASS: qemumemlocktest PASS: qemucommandutiltest FAIL: qemublocktest PASS: qemuxml2argvtest PASS: qemumigparamstest PASS: qemufirmwaretest PASS: qemuvhostusertest PASS: esxutilstest PASS: vboxsnapshotxmltest PASS: vmx2xmltest PASS: xml2vmxtest PASS: vmwarevertest PASS: qemusecuritytest PASS: bhyvexml2xmltest PASS: bhyvexml2argvtest PASS: virjsontest PASS: bhyveargv2xmltest PASS: virnetworkportxml2xmltest PASS: networkxml2xmlupdatetest PASS: networkxml2xmltest PASS: networkxml2conftest SKIP: networkxml2firewalltest PASS: nwfilterxml2xmltest PASS: virnwfilterbindingxml2xmltest PASS: storagepoolxml2argvtest PASS: virstorageutiltest PASS: storagevolxml2argvtest PASS: storagepoolxml2xmltest PASS: nsstest PASS: storagepoolcapstest PASS: nssguesttest PASS: nodedevxml2xmltest PASS: storagevolxml2xmltest PASS: interfacexml2xmltest PASS: metadatatest PASS: secretxml2xmltest PASS: genericxml2xmltest PASS: eventtest PASS: virdrivermoduletest PASS: virdriverconnvalidatetest PASS: objecteventtest PASS: virmacmaptest PASS: virnetdevopenvswitchtest PASS: libvirtd-fail PASS: libvirtd-pool PASS: virsh-cpuset PASS: cputest PASS: virsh-define-dev-segfault PASS: virsh-int-overflow SKIP: virsh-optparse PASS: virsh-read-non-seekable PASS: virsh-schedinfo PASS: virsh-read-bufsiz PASS: virt-admin-self-test PASS: virsh-self-test PASS: virsh-checkpoint PASS: virsh-start PASS: virsh-snapshot PASS: virsh-undefine PASS: virsh-uriprecedence PASS: virsh-vcpupin PASS: virshtest ============================================================================ Testsuite summary for libvirt 6.1.0 ============================================================================ # TOTAL: 120 # PASS: 101 # SKIP: 16 # XFAIL: 0 # FAIL: 3 # XPASS: 0 # ERROR: 0 ============================================================================ See tests/test-suite.log Please report to libvir-list@redhat.com ============================================================================ gmake[4]: *** [Makefile:5134: test-suite.log] Error 1 gmake[4]: Leaving directory '/usr<https://ci.centos.org/job/libvirt-check/systems=libvirt-freebsd-12/ws/build/tests'> gmake[3]: *** [Makefile:5242: check-TESTS] Error 2 gmake[3]: Leaving directory '/usr<https://ci.centos.org/job/libvirt-check/systems=libvirt-freebsd-12/ws/build/tests'> gmake[2]: *** [Makefile:6296: check-am] Error 2 gmake[2]: Leaving directory '/usr<https://ci.centos.org/job/libvirt-check/systems=libvirt-freebsd-12/ws/build/tests'> gmake[1]: *** [Makefile:1082: check-recursive] Error 1 gmake[1]: Leaving directory '/usr<https://ci.centos.org/job/libvirt-check/systems=libvirt-freebsd-12/ws/build'> gmake: *** [Makefile:1377: check] Error 2 + find -name test-suite.log + xargs cat find: illegal option -- n usage: find [-H | -L | -P] [-EXdsx] [-f path] path ... [expression] find [-H | -L | -P] [-EXdsx] -f path [path ...] [expression] + exit 1 Build step 'Execute shell' marked build as failure

participants (1)
-
ci@centos.org