[Libvirt-ci] Build failed in Jenkins: osinfo-db-tools-check » libvirt-centos-7 #43

See <https://ci.centos.org/job/osinfo-db-tools-check/systems=libvirt-centos-7/43/display/redirect> ------------------------------------------ [...truncated 4.00 KB...] 24.01 po_check 23.85 prohibit_S_IS_definition 23.81 prohibit_argmatch_without_use 24.11 prohibit_HAVE_MBRTOWC 23.94 prohibit_assert_without_use 23.81 prohibit_atoi_atof 23.83 prohibit_backup_files 24.19 prohibit_c_ctype_without_use 24.20 prohibit_canonicalize_without_use 24.14 prohibit_cloexec_without_use 24.45 prohibit_close_stream_without_use 24.43 prohibit_cvs_keyword 24.46 prohibit_double_semicolon 24.55 prohibit_defined_have_decl_tests 24.63 prohibit_dirent_without_use 24.71 prohibit_doubled_word 24.69 prohibit_empty_lines_at_EOF 24.69 prohibit_error_without_use 24.72 prohibit_getopt_without_use 24.86 prohibit_gnu_make_extensions 25.06 prohibit_hash_pjw_without_use 25.16 prohibit_hash_without_use 25.14 prohibit_have_config_h 25.28 prohibit_intprops_without_use 25.26 prohibit_inttostr_without_use 25.28 prohibit_long_options_without_use 25.24 prohibit_magic_number_exit 25.36 prohibit_ignore_value_without_use 25.19 prohibit_openat_without_use 25.12 prohibit_posixver_without_use 25.13 prohibit_quote_without_use 25.25 prohibit_path_max_allocation 25.15 prohibit_reversed_compare_failure 25.21 prohibit_quotearg_without_use 25.35 prohibit_root_dev_ino_without_use 25.44 prohibit_safe_read_without_use 25.41 prohibit_same_without_use 25.53 prohibit_signal_without_use --- stderr --- autoconf: error: no input file Can't open ../gnulib/lib/intprops.h: No such file or directory. ------- Full log written to <https://ci.centos.org/job/osinfo-db-tools-check/systems=libvirt-centos-7/ws/build/meson-logs/testlog.txt> FAILED: meson-test /usr/local/bin/meson test --no-rebuild --print-errorlogs ninja: build stopped: subcommand failed. + cat meson-logs/testlog.txt Log of Meson test suite run on 2019-11-29T15:35:14.481276 Inherited environment: BUILD_URL='https://ci.centos.org/job/osinfo-db-tools-check/systems=libvirt-centos-7/43/' HOSTNAME='libvirt-centos-7' SHELL='/usr/bin/bash' HUDSON_SERVER_COOKIE='f4d3a7a925dabf8a' HISTSIZE='1000' MAKEFLAGS='-j3' BUILD_TAG='jenkins-osinfo-db-tools-check-systems=libvirt-centos-7-43' PERL5LIB='/home/jenkins/build/libvirt/lib/perl5/x86_64-linux-thread-multi' NINJA='/usr/bin/ninja-build' ROOT_BUILD_CAUSE='SCMTRIGGER' JOB_URL='https://ci.centos.org/job/osinfo-db-tools-check/systems=libvirt-centos-7/' WORKSPACE='<https://ci.centos.org/job/osinfo-db-tools-check/systems=libvirt-centos-7/ws/'> RUN_CHANGES_DISPLAY_URL='https://ci.centos.org/job/osinfo-db-tools-check/systems=libvirt-centos-7/43/...' USER='jenkins' LD_LIBRARY_PATH='/home/jenkins/build/libvirt/lib64:/home/jenkins/build/libvirt/lib' BUILD_CAUSE_UPSTREAMTRIGGER='true' JENKINS_HOME='/var/lib/jenkins' PATH='/home/jenkins/build/libvirt/bin:/home/jenkins/.ccache/bin:/usr/local/sbin:/usr/local/bin:/usr/sbin:/usr/bin' ROOT_BUILD_CAUSE_SCMTRIGGER='true' MAIL='/var/spool/mail/jenkins' RUN_DISPLAY_URL='https://ci.centos.org/job/osinfo-db-tools-check/systems=libvirt-centos-7/43/...' _='/usr/local/bin/meson' C_INCLUDE_PATH='/home/jenkins/build/libvirt/include' PWD='<https://ci.centos.org/job/osinfo-db-tools-check/systems=libvirt-centos-7/ws/build'> HUDSON_URL='https://ci.centos.org/' LANG='en_US.UTF-8' JOB_NAME='osinfo-db-tools-check/systems=libvirt-centos-7' BUILD_DISPLAY_NAME='#43' JENKINS_URL='https://ci.centos.org/' BUILD_ID='43' BUILD_CAUSE='UPSTREAMTRIGGER' HISTCONTROL='ignoredups' JOB_BASE_NAME='systems=libvirt-centos-7' SHLVL='3' HOME='/home/jenkins' OSINFO_SYSTEM_DIR='/home/jenkins/build/libvirt/share/osinfo' MAKE='/usr/bin/gmake' JENKINS_SERVER_COOKIE='f4d3a7a925dabf8a' EXECUTOR_NUMBER='2' systems='libvirt-centos-7' NODE_LABELS='libvirt libvirt-centos-7' LOGNAME='jenkins' PYTHONPATH='/home/jenkins/build/libvirt/lib64/python2.7/site-packages' XDG_DATA_DIRS='/home/jenkins/build/libvirt/share:/usr/share:/usr/local/share' HUDSON_HOME='/var/lib/jenkins' NODE_NAME='libvirt-centos-7' PKG_CONFIG_PATH='/home/jenkins/build/libvirt/lib64/pkgconfig:/home/jenkins/build/libvirt/lib/pkgconfig' LESSOPEN='||/usr/bin/lesspipe.sh %s' JOB_DISPLAY_URL='https://ci.centos.org/job/osinfo-db-tools-check/systems=libvirt-centos-7/dis...' BUILD_NUMBER='43' HUDSON_COOKIE='e8c8e27e-d66c-4e78-b251-b846a82075bb' GI_TYPELIB_PATH='/home/jenkins/build/libvirt/lib64/girepository-1.0:/home/jenkins/build/libvirt/lib/girepository-1.0' VIRT_PREFIX='/home/jenkins/build/libvirt' PYTHON='/usr/bin/python2' 1/4 osinfo-db-tools:style / syntax-check TIMEOUT 30.09 s --- command --- MESON_SOURCE_ROOT='<https://ci.centos.org/job/osinfo-db-tools-check/systems=libvirt-centos-7/ws/'> <https://ci.centos.org/job/osinfo-db-tools-check/systems=libvirt-centos-7/ws/build-aux/syntax-check> --- stdout --- GFDL_version Wundef_boolean avoid_if_before_free bindtextdomain cast_of_argument_to_free cast_of_x_alloc_return_value changelog const_long_option copyright_check error_message_period error_message_warn_fatal m4_quote_check makefile_TAB_only_indentation makefile_at_at_check makefile_path_separator_check obsolete_symbols po_check prohibit_HAVE_MBRTOWC prohibit_S_IS_definition prohibit_argmatch_without_use prohibit_assert_without_use prohibit_atoi_atof prohibit_backup_files prohibit_c_ctype_without_use prohibit_canonicalize_without_use prohibit_cloexec_without_use prohibit_close_stream_without_use prohibit_cvs_keyword prohibit_defined_have_decl_tests prohibit_dirent_without_use prohibit_double_semicolon prohibit_doubled_word prohibit_empty_lines_at_EOF prohibit_error_without_use prohibit_getopt_without_use prohibit_gnu_make_extensions prohibit_hash_pjw_without_use prohibit_hash_without_use prohibit_have_config_h prohibit_ignore_value_without_use prohibit_intprops_without_use prohibit_inttostr_without_use prohibit_long_options_without_use prohibit_magic_number_exit prohibit_openat_without_use prohibit_path_max_allocation prohibit_posixver_without_use prohibit_quote_without_use prohibit_quotearg_without_use prohibit_reversed_compare_failure prohibit_root_dev_ino_without_use prohibit_safe_read_without_use prohibit_same_without_use prohibit_signal_without_use prohibit_stat_st_blocks prohibit_stddef_without_use prohibit_stdio--_without_use prohibit_stdio-safer_without_use prohibit_strcmp prohibit_strings_without_use prohibit_strncpy prohibit_test_double_equal prohibit_test_minus_ao prohibit_undesirable_word_seq prohibit_verify_without_use prohibit_xalloc_without_use prohibit_xfreopen_without_use proper_name_utf8_requires_ICONV redundant_const require_test_exit_idiom space_tab texinfo_acronym tight_scope trailing_blank unmarked_diagnostics useless_cpp_parens vulnerable_makefile_CVE-2009-4029 vulnerable_makefile_CVE-2012-3386 build-aux/maint.mk: skipping sc_tight_scope 22.27 GFDL_version 22.48 Wundef_boolean 22.73 avoid_if_before_free 22.66 bindtextdomain 22.85 cast_of_argument_to_free 23.03 cast_of_x_alloc_return_value 23.16 changelog 23.16 const_long_option 23.34 error_message_warn_fatal 23.43 error_message_period 23.37 copyright_check 23.48 m4_quote_check 23.59 makefile_TAB_only_indentation 23.67 makefile_path_separator_check 23.69 makefile_at_at_check 23.94 obsolete_symbols 24.01 po_check 23.85 prohibit_S_IS_definition 23.81 prohibit_argmatch_without_use 24.11 prohibit_HAVE_MBRTOWC 23.94 prohibit_assert_without_use 23.81 prohibit_atoi_atof 23.83 prohibit_backup_files 24.19 prohibit_c_ctype_without_use 24.20 prohibit_canonicalize_without_use 24.14 prohibit_cloexec_without_use 24.45 prohibit_close_stream_without_use 24.43 prohibit_cvs_keyword 24.46 prohibit_double_semicolon 24.55 prohibit_defined_have_decl_tests 24.63 prohibit_dirent_without_use 24.71 prohibit_doubled_word 24.69 prohibit_empty_lines_at_EOF 24.69 prohibit_error_without_use 24.72 prohibit_getopt_without_use 24.86 prohibit_gnu_make_extensions 25.06 prohibit_hash_pjw_without_use 25.16 prohibit_hash_without_use 25.14 prohibit_have_config_h 25.28 prohibit_intprops_without_use 25.26 prohibit_inttostr_without_use 25.28 prohibit_long_options_without_use 25.24 prohibit_magic_number_exit 25.36 prohibit_ignore_value_without_use 25.19 prohibit_openat_without_use 25.12 prohibit_posixver_without_use 25.13 prohibit_quote_without_use 25.25 prohibit_path_max_allocation 25.15 prohibit_reversed_compare_failure 25.21 prohibit_quotearg_without_use 25.35 prohibit_root_dev_ino_without_use 25.44 prohibit_safe_read_without_use 25.41 prohibit_same_without_use 25.53 prohibit_signal_without_use --- stderr --- autoconf: error: no input file Can't open ../gnulib/lib/intprops.h: No such file or directory. ------- 2/4 osinfo-db-tools:unit / export-import OK 20.56 s --- command --- abs_top_builddir='<https://ci.centos.org/job/osinfo-db-tools-check/systems=libvirt-centos-7/ws/build'> sysconfdir='/home/jenkins/build/libvirt/etc' datadir='/home/jenkins/build/libvirt/share' abs_top_srcdir='<https://ci.centos.org/job/osinfo-db-tools-check/systems=libvirt-centos-7/ws/'> <https://ci.centos.org/job/osinfo-db-tools-check/systems=libvirt-centos-7/ws/tests/test_osinfo_db_export_import.py> --- stdout --- ============================= test session starts ============================== platform linux -- Python 3.6.8, pytest-2.9.2, py-1.4.32, pluggy-0.3.1 rootdir: <https://ci.centos.org/job/osinfo-db-tools-check/systems=libvirt-centos-7/ws/tests,> inifile: collected 10 items ../tests/test_osinfo_db_export_import.py ........ss ===================== 8 passed, 2 skipped in 10.36 seconds ===================== ------- 3/4 osinfo-db-tools:unit / path OK 7.69 s --- command --- abs_top_builddir='<https://ci.centos.org/job/osinfo-db-tools-check/systems=libvirt-centos-7/ws/build'> sysconfdir='/home/jenkins/build/libvirt/etc' datadir='/home/jenkins/build/libvirt/share' abs_top_srcdir='<https://ci.centos.org/job/osinfo-db-tools-check/systems=libvirt-centos-7/ws/'> <https://ci.centos.org/job/osinfo-db-tools-check/systems=libvirt-centos-7/ws/tests/test_osinfo_db_path.py> --- stdout --- ============================= test session starts ============================== platform linux -- Python 3.6.8, pytest-2.9.2, py-1.4.32, pluggy-0.3.1 rootdir: <https://ci.centos.org/job/osinfo-db-tools-check/systems=libvirt-centos-7/ws/tests,> inifile: collected 5 items ../tests/test_osinfo_db_path.py ..... =========================== 5 passed in 0.64 seconds =========================== ------- 4/4 osinfo-db-tools:unit / validate OK 5.64 s --- command --- abs_top_builddir='<https://ci.centos.org/job/osinfo-db-tools-check/systems=libvirt-centos-7/ws/build'> sysconfdir='/home/jenkins/build/libvirt/etc' datadir='/home/jenkins/build/libvirt/share' abs_top_srcdir='<https://ci.centos.org/job/osinfo-db-tools-check/systems=libvirt-centos-7/ws/'> <https://ci.centos.org/job/osinfo-db-tools-check/systems=libvirt-centos-7/ws/tests/test_osinfo_db_validate.py> --- stdout --- ============================= test session starts ============================== platform linux -- Python 3.6.8, pytest-2.9.2, py-1.4.32, pluggy-0.3.1 rootdir: <https://ci.centos.org/job/osinfo-db-tools-check/systems=libvirt-centos-7/ws/tests,> inifile: collected 6 items ../tests/test_osinfo_db_validate.py ...... =========================== 6 passed in 1.42 seconds =========================== ------- Ok: 3 Expected Fail: 0 Fail: 1 Unexpected Pass: 0 Skipped: 0 Timeout: 1 + exit 1 Build step 'Execute shell' marked build as failure

participants (1)
-
ci@centos.org