[Libvirt-ci] Build failed in Jenkins: libvirt-go-check » libvirt-fedora-28 #257

See <https://ci.centos.org/job/libvirt-go-check/systems=libvirt-fedora-28/257/display/redirect> ------------------------------------------ Started by upstream project "libvirt-go-check" build number 257 originally caused by: Started by upstream project "libvirt-go-build" build number 261 originally caused by: Started by upstream project "libvirt-build" build number 323 originally caused by: Started by an SCM change [EnvInject] - Loading node environment variables. Building remotely on libvirt-fedora-28 (libvirt) in workspace <https://ci.centos.org/job/libvirt-go-check/systems=libvirt-fedora-28/ws/> [libvirt-go] $ /bin/sh -xe /tmp/jenkins1399268416220956987.sh + export 'TEST_ARGS=-tags api' + TEST_ARGS='-tags api' + go test -tags api Missing enum 'VIR_DOMAIN_SAVE_IMAGE_XML_SECURE' Missing enum 'VIR_DOMAIN_SNAPSHOT_XML_SECURE' --- FAIL: TestAPICoverage (1.28s) panic: Missing symbols found [recovered] panic: Missing symbols found goroutine 18 [running]: testing.tRunner.func1(0xc4200b60f0) /usr/lib/golang/src/testing/testing.go:742 +0x29d panic(0x5c3ba0, 0x6277b0) /usr/lib/golang/src/runtime/panic.go:502 +0x229 _<https://ci.centos.org/job/libvirt-go-check/systems=libvirt-fedora-28/ws/.TestAPICoverage(0xc4200b60f0)> <https://ci.centos.org/job/libvirt-go-check/systems=libvirt-fedora-28/ws/api_test.go>:501 +0x548 testing.tRunner(0xc4200b60f0, 0x612868) /usr/lib/golang/src/testing/testing.go:777 +0xd0 created by testing.(*T).Run /usr/lib/golang/src/testing/testing.go:824 +0x2e0 exit status 2 FAIL _<https://ci.centos.org/job/libvirt-go-check/systems=libvirt-fedora-28/ws/> 1.643s Build step 'Execute shell' marked build as failure

See <https://ci.centos.org/job/libvirt-go-check/systems=libvirt-fedora-28/258/display/redirect> ------------------------------------------ Started by upstream project "libvirt-go-check" build number 258 originally caused by: Started by upstream project "libvirt-go-build" build number 262 originally caused by: Started by upstream project "libvirt-build" build number 324 originally caused by: Started by an SCM change [EnvInject] - Loading node environment variables. Building remotely on libvirt-fedora-28 (libvirt) in workspace <https://ci.centos.org/job/libvirt-go-check/systems=libvirt-fedora-28/ws/> [libvirt-go] $ /bin/sh -xe /tmp/jenkins3608882607713944275.sh + export 'TEST_ARGS=-tags api' + TEST_ARGS='-tags api' + go test -tags api Missing enum 'VIR_DOMAIN_SAVE_IMAGE_XML_SECURE' Missing enum 'VIR_DOMAIN_SNAPSHOT_XML_SECURE' --- FAIL: TestAPICoverage (0.16s) panic: Missing symbols found [recovered] panic: Missing symbols found goroutine 4 [running]: testing.tRunner.func1(0xc4200c80f0) /usr/lib/golang/src/testing/testing.go:742 +0x29d panic(0x5c3ba0, 0x6277b0) /usr/lib/golang/src/runtime/panic.go:502 +0x229 _<https://ci.centos.org/job/libvirt-go-check/systems=libvirt-fedora-28/ws/.TestAPICoverage(0xc4200c80f0)> <https://ci.centos.org/job/libvirt-go-check/systems=libvirt-fedora-28/ws/api_test.go>:501 +0x548 testing.tRunner(0xc4200c80f0, 0x612868) /usr/lib/golang/src/testing/testing.go:777 +0xd0 created by testing.(*T).Run /usr/lib/golang/src/testing/testing.go:824 +0x2e0 exit status 2 FAIL _<https://ci.centos.org/job/libvirt-go-check/systems=libvirt-fedora-28/ws/> 0.206s Build step 'Execute shell' marked build as failure

See <https://ci.centos.org/job/libvirt-go-check/systems=libvirt-fedora-28/259/display/redirect> ------------------------------------------ Started by upstream project "libvirt-go-check" build number 259 originally caused by: Started by upstream project "libvirt-go-build" build number 263 originally caused by: Started by upstream project "libvirt-build" build number 325 originally caused by: Started by an SCM change [EnvInject] - Loading node environment variables. Building remotely on libvirt-fedora-28 (libvirt) in workspace <https://ci.centos.org/job/libvirt-go-check/systems=libvirt-fedora-28/ws/> [libvirt-go] $ /bin/sh -xe /tmp/jenkins2707935676169933051.sh + export 'TEST_ARGS=-tags api' + TEST_ARGS='-tags api' + go test -tags api Missing enum 'VIR_DOMAIN_SAVE_IMAGE_XML_SECURE' Missing enum 'VIR_DOMAIN_SNAPSHOT_XML_SECURE' --- FAIL: TestAPICoverage (0.66s) panic: Missing symbols found [recovered] panic: Missing symbols found goroutine 19 [running]: testing.tRunner.func1(0xc4200c60f0) /usr/lib/golang/src/testing/testing.go:742 +0x29d panic(0x5c3ba0, 0x6277b0) /usr/lib/golang/src/runtime/panic.go:502 +0x229 _<https://ci.centos.org/job/libvirt-go-check/systems=libvirt-fedora-28/ws/.TestAPICoverage(0xc4200c60f0)> <https://ci.centos.org/job/libvirt-go-check/systems=libvirt-fedora-28/ws/api_test.go>:501 +0x548 testing.tRunner(0xc4200c60f0, 0x612868) /usr/lib/golang/src/testing/testing.go:777 +0xd0 created by testing.(*T).Run /usr/lib/golang/src/testing/testing.go:824 +0x2e0 exit status 2 FAIL _<https://ci.centos.org/job/libvirt-go-check/systems=libvirt-fedora-28/ws/> 0.909s Build step 'Execute shell' marked build as failure

See <https://ci.centos.org/job/libvirt-go-check/systems=libvirt-fedora-28/260/display/redirect> ------------------------------------------ Started by upstream project "libvirt-go-check" build number 260 originally caused by: Started by upstream project "libvirt-go-build" build number 264 originally caused by: Started by upstream project "libvirt-build" build number 326 originally caused by: Started by an SCM change Started by an SCM change Started by an SCM change Started by an SCM change Started by an SCM change [EnvInject] - Loading node environment variables. Building remotely on libvirt-fedora-28 (libvirt) in workspace <https://ci.centos.org/job/libvirt-go-check/systems=libvirt-fedora-28/ws/> [libvirt-go] $ /bin/sh -xe /tmp/jenkins3972671315967896521.sh + export 'TEST_ARGS=-tags api' + TEST_ARGS='-tags api' + go test -tags api Missing enum 'VIR_DOMAIN_SAVE_IMAGE_XML_SECURE' Missing enum 'VIR_DOMAIN_SNAPSHOT_XML_SECURE' --- FAIL: TestAPICoverage (0.84s) panic: Missing symbols found [recovered] panic: Missing symbols found goroutine 5 [running]: testing.tRunner.func1(0xc4200aa0f0) /usr/lib/golang/src/testing/testing.go:742 +0x29d panic(0x5c3ba0, 0x6277b0) /usr/lib/golang/src/runtime/panic.go:502 +0x229 _<https://ci.centos.org/job/libvirt-go-check/systems=libvirt-fedora-28/ws/.TestAPICoverage(0xc4200aa0f0)> <https://ci.centos.org/job/libvirt-go-check/systems=libvirt-fedora-28/ws/api_test.go>:501 +0x548 testing.tRunner(0xc4200aa0f0, 0x612868) /usr/lib/golang/src/testing/testing.go:777 +0xd0 created by testing.(*T).Run /usr/lib/golang/src/testing/testing.go:824 +0x2e0 exit status 2 FAIL _<https://ci.centos.org/job/libvirt-go-check/systems=libvirt-fedora-28/ws/> 1.001s Build step 'Execute shell' marked build as failure

See <https://ci.centos.org/job/libvirt-go-check/systems=libvirt-fedora-28/261/display/redirect> ------------------------------------------ Started by upstream project "libvirt-go-check" build number 261 originally caused by: Started by upstream project "libvirt-go-build" build number 265 originally caused by: Started by upstream project "libvirt-build" build number 327 originally caused by: Started by an SCM change [EnvInject] - Loading node environment variables. Building remotely on libvirt-fedora-28 (libvirt) in workspace <https://ci.centos.org/job/libvirt-go-check/systems=libvirt-fedora-28/ws/> [libvirt-go] $ /bin/sh -xe /tmp/jenkins1232979266801925293.sh + export 'TEST_ARGS=-tags api' + TEST_ARGS='-tags api' + go test -tags api Missing enum 'VIR_DOMAIN_SAVE_IMAGE_XML_SECURE' Missing enum 'VIR_DOMAIN_SNAPSHOT_XML_SECURE' --- FAIL: TestAPICoverage (1.17s) panic: Missing symbols found [recovered] panic: Missing symbols found goroutine 5 [running]: testing.tRunner.func1(0xc4200aa0f0) /usr/lib/golang/src/testing/testing.go:742 +0x29d panic(0x5c3ba0, 0x6277b0) /usr/lib/golang/src/runtime/panic.go:502 +0x229 _<https://ci.centos.org/job/libvirt-go-check/systems=libvirt-fedora-28/ws/.TestAPICoverage(0xc4200aa0f0)> <https://ci.centos.org/job/libvirt-go-check/systems=libvirt-fedora-28/ws/api_test.go>:501 +0x548 testing.tRunner(0xc4200aa0f0, 0x612868) /usr/lib/golang/src/testing/testing.go:777 +0xd0 created by testing.(*T).Run /usr/lib/golang/src/testing/testing.go:824 +0x2e0 exit status 2 FAIL _<https://ci.centos.org/job/libvirt-go-check/systems=libvirt-fedora-28/ws/> 1.384s Build step 'Execute shell' marked build as failure

See <https://ci.centos.org/job/libvirt-go-check/systems=libvirt-fedora-28/262/display/redirect> ------------------------------------------ Started by upstream project "libvirt-go-check" build number 262 originally caused by: Started by upstream project "libvirt-go-build" build number 266 originally caused by: Started by upstream project "libvirt-build" build number 328 originally caused by: Started by an SCM change Started by an SCM change Started by an SCM change Started by an SCM change [EnvInject] - Loading node environment variables. Building remotely on libvirt-fedora-28 (libvirt) in workspace <https://ci.centos.org/job/libvirt-go-check/systems=libvirt-fedora-28/ws/> [libvirt-go] $ /bin/sh -xe /tmp/jenkins777554676768577980.sh + export 'TEST_ARGS=-tags api' + TEST_ARGS='-tags api' + go test -tags api Missing enum 'VIR_DOMAIN_SAVE_IMAGE_XML_SECURE' Missing enum 'VIR_DOMAIN_SNAPSHOT_XML_SECURE' --- FAIL: TestAPICoverage (1.02s) panic: Missing symbols found [recovered] panic: Missing symbols found goroutine 5 [running]: testing.tRunner.func1(0xc4200aa0f0) /usr/lib/golang/src/testing/testing.go:742 +0x29d panic(0x5c3ba0, 0x6277b0) /usr/lib/golang/src/runtime/panic.go:502 +0x229 _<https://ci.centos.org/job/libvirt-go-check/systems=libvirt-fedora-28/ws/.TestAPICoverage(0xc4200aa0f0)> <https://ci.centos.org/job/libvirt-go-check/systems=libvirt-fedora-28/ws/api_test.go>:501 +0x548 testing.tRunner(0xc4200aa0f0, 0x612868) /usr/lib/golang/src/testing/testing.go:777 +0xd0 created by testing.(*T).Run /usr/lib/golang/src/testing/testing.go:824 +0x2e0 exit status 2 FAIL _<https://ci.centos.org/job/libvirt-go-check/systems=libvirt-fedora-28/ws/> 1.339s Build step 'Execute shell' marked build as failure

See <https://ci.centos.org/job/libvirt-go-check/systems=libvirt-fedora-28/263/display/redirect> ------------------------------------------ Started by upstream project "libvirt-go-check" build number 263 originally caused by: Started by upstream project "libvirt-go-build" build number 267 originally caused by: Started by upstream project "libvirt-build" build number 330 originally caused by: Started by an SCM change [EnvInject] - Loading node environment variables. Building remotely on libvirt-fedora-28 (libvirt) in workspace <https://ci.centos.org/job/libvirt-go-check/systems=libvirt-fedora-28/ws/> [libvirt-go] $ /bin/sh -xe /tmp/jenkins1690199797881015994.sh + export 'TEST_ARGS=-tags api' + TEST_ARGS='-tags api' + go test -tags api Missing enum 'VIR_DOMAIN_SAVE_IMAGE_XML_SECURE' Missing enum 'VIR_DOMAIN_SNAPSHOT_XML_SECURE' --- FAIL: TestAPICoverage (0.46s) panic: Missing symbols found [recovered] panic: Missing symbols found goroutine 5 [running]: testing.tRunner.func1(0xc4200aa0f0) /usr/lib/golang/src/testing/testing.go:742 +0x29d panic(0x5c3ba0, 0x6277b0) /usr/lib/golang/src/runtime/panic.go:502 +0x229 _<https://ci.centos.org/job/libvirt-go-check/systems=libvirt-fedora-28/ws/.TestAPICoverage(0xc4200aa0f0)> <https://ci.centos.org/job/libvirt-go-check/systems=libvirt-fedora-28/ws/api_test.go>:501 +0x548 testing.tRunner(0xc4200aa0f0, 0x612868) /usr/lib/golang/src/testing/testing.go:777 +0xd0 created by testing.(*T).Run /usr/lib/golang/src/testing/testing.go:824 +0x2e0 exit status 2 FAIL _<https://ci.centos.org/job/libvirt-go-check/systems=libvirt-fedora-28/ws/> 0.589s Build step 'Execute shell' marked build as failure

See <https://ci.centos.org/job/libvirt-go-check/systems=libvirt-fedora-28/264/display/redirect> ------------------------------------------ Started by upstream project "libvirt-go-check" build number 264 originally caused by: Started by upstream project "libvirt-go-build" build number 268 originally caused by: Started by upstream project "libvirt-build" build number 331 originally caused by: Started by an SCM change Started by an SCM change Started by an SCM change [EnvInject] - Loading node environment variables. Building remotely on libvirt-fedora-28 (libvirt) in workspace <https://ci.centos.org/job/libvirt-go-check/systems=libvirt-fedora-28/ws/> [libvirt-go] $ /bin/sh -xe /tmp/jenkins8440635199513474419.sh + export 'TEST_ARGS=-tags api' + TEST_ARGS='-tags api' + go test -tags api Missing enum 'VIR_DOMAIN_SAVE_IMAGE_XML_SECURE' Missing enum 'VIR_DOMAIN_SNAPSHOT_XML_SECURE' --- FAIL: TestAPICoverage (0.69s) panic: Missing symbols found [recovered] panic: Missing symbols found goroutine 5 [running]: testing.tRunner.func1(0xc4200aa0f0) /usr/lib/golang/src/testing/testing.go:742 +0x29d panic(0x5c3ba0, 0x6277b0) /usr/lib/golang/src/runtime/panic.go:502 +0x229 _<https://ci.centos.org/job/libvirt-go-check/systems=libvirt-fedora-28/ws/.TestAPICoverage(0xc4200aa0f0)> <https://ci.centos.org/job/libvirt-go-check/systems=libvirt-fedora-28/ws/api_test.go>:501 +0x548 testing.tRunner(0xc4200aa0f0, 0x612868) /usr/lib/golang/src/testing/testing.go:777 +0xd0 created by testing.(*T).Run /usr/lib/golang/src/testing/testing.go:824 +0x2e0 exit status 2 FAIL _<https://ci.centos.org/job/libvirt-go-check/systems=libvirt-fedora-28/ws/> 0.804s Build step 'Execute shell' marked build as failure

See <https://ci.centos.org/job/libvirt-go-check/systems=libvirt-fedora-28/265/display/redirect> ------------------------------------------ Started by upstream project "libvirt-go-check" build number 265 originally caused by: Started by upstream project "libvirt-go-build" build number 269 originally caused by: Started by upstream project "libvirt-build" build number 332 originally caused by: Started by an SCM change [EnvInject] - Loading node environment variables. Building remotely on libvirt-fedora-28 (libvirt) in workspace <https://ci.centos.org/job/libvirt-go-check/systems=libvirt-fedora-28/ws/> [libvirt-go] $ /bin/sh -xe /tmp/jenkins4723598226861667130.sh + export 'TEST_ARGS=-tags api' + TEST_ARGS='-tags api' + go test -tags api Missing enum 'VIR_DOMAIN_SAVE_IMAGE_XML_SECURE' Missing enum 'VIR_DOMAIN_SNAPSHOT_XML_SECURE' --- FAIL: TestAPICoverage (1.28s) panic: Missing symbols found [recovered] panic: Missing symbols found goroutine 19 [running]: testing.tRunner.func1(0xc4200c60f0) /usr/lib/golang/src/testing/testing.go:742 +0x29d panic(0x5c3ba0, 0x6277b0) /usr/lib/golang/src/runtime/panic.go:502 +0x229 _<https://ci.centos.org/job/libvirt-go-check/systems=libvirt-fedora-28/ws/.TestAPICoverage(0xc4200c60f0)> <https://ci.centos.org/job/libvirt-go-check/systems=libvirt-fedora-28/ws/api_test.go>:501 +0x548 testing.tRunner(0xc4200c60f0, 0x612868) /usr/lib/golang/src/testing/testing.go:777 +0xd0 created by testing.(*T).Run /usr/lib/golang/src/testing/testing.go:824 +0x2e0 exit status 2 FAIL _<https://ci.centos.org/job/libvirt-go-check/systems=libvirt-fedora-28/ws/> 1.498s Build step 'Execute shell' marked build as failure

See <https://ci.centos.org/job/libvirt-go-check/systems=libvirt-fedora-28/266/display/redirect> ------------------------------------------ Started by upstream project "libvirt-go-check" build number 266 originally caused by: Started by upstream project "libvirt-go-build" build number 270 originally caused by: Started by upstream project "libvirt-build" build number 333 originally caused by: Started by an SCM change [EnvInject] - Loading node environment variables. Building remotely on libvirt-fedora-28 (libvirt) in workspace <https://ci.centos.org/job/libvirt-go-check/systems=libvirt-fedora-28/ws/> [libvirt-go] $ /bin/sh -xe /tmp/jenkins3019293033158333963.sh + export 'TEST_ARGS=-tags api' + TEST_ARGS='-tags api' + go test -tags api Missing enum 'VIR_DOMAIN_SAVE_IMAGE_XML_SECURE' Missing enum 'VIR_DOMAIN_SNAPSHOT_XML_SECURE' --- FAIL: TestAPICoverage (0.67s) panic: Missing symbols found [recovered] panic: Missing symbols found goroutine 19 [running]: testing.tRunner.func1(0xc4200c60f0) /usr/lib/golang/src/testing/testing.go:742 +0x29d panic(0x5c3ba0, 0x6277b0) /usr/lib/golang/src/runtime/panic.go:502 +0x229 _<https://ci.centos.org/job/libvirt-go-check/systems=libvirt-fedora-28/ws/.TestAPICoverage(0xc4200c60f0)> <https://ci.centos.org/job/libvirt-go-check/systems=libvirt-fedora-28/ws/api_test.go>:501 +0x548 testing.tRunner(0xc4200c60f0, 0x612868) /usr/lib/golang/src/testing/testing.go:777 +0xd0 created by testing.(*T).Run /usr/lib/golang/src/testing/testing.go:824 +0x2e0 exit status 2 FAIL _<https://ci.centos.org/job/libvirt-go-check/systems=libvirt-fedora-28/ws/> 0.870s Build step 'Execute shell' marked build as failure

See <https://ci.centos.org/job/libvirt-go-check/systems=libvirt-fedora-28/267/display/redirect> ------------------------------------------ Started by upstream project "libvirt-go-check" build number 267 originally caused by: Started by upstream project "libvirt-go-build" build number 271 originally caused by: Started by upstream project "libvirt-build" build number 334 originally caused by: Started by an SCM change [EnvInject] - Loading node environment variables. Building remotely on libvirt-fedora-28 (libvirt) in workspace <https://ci.centos.org/job/libvirt-go-check/systems=libvirt-fedora-28/ws/> [libvirt-go] $ /bin/sh -xe /tmp/jenkins7146671593555638468.sh + export 'TEST_ARGS=-tags api' + TEST_ARGS='-tags api' + go test -tags api Missing enum 'VIR_DOMAIN_SAVE_IMAGE_XML_SECURE' Missing enum 'VIR_DOMAIN_SNAPSHOT_XML_SECURE' --- FAIL: TestAPICoverage (0.58s) panic: Missing symbols found [recovered] panic: Missing symbols found goroutine 19 [running]: testing.tRunner.func1(0xc4200c60f0) /usr/lib/golang/src/testing/testing.go:742 +0x29d panic(0x5c3ba0, 0x6277b0) /usr/lib/golang/src/runtime/panic.go:502 +0x229 _<https://ci.centos.org/job/libvirt-go-check/systems=libvirt-fedora-28/ws/.TestAPICoverage(0xc4200c60f0)> <https://ci.centos.org/job/libvirt-go-check/systems=libvirt-fedora-28/ws/api_test.go>:501 +0x548 testing.tRunner(0xc4200c60f0, 0x612868) /usr/lib/golang/src/testing/testing.go:777 +0xd0 created by testing.(*T).Run /usr/lib/golang/src/testing/testing.go:824 +0x2e0 exit status 2 FAIL _<https://ci.centos.org/job/libvirt-go-check/systems=libvirt-fedora-28/ws/> 0.882s Build step 'Execute shell' marked build as failure

participants (1)
-
ci@centos.org