Build failed in Jenkins: libvirt-go-xml-check » libvirt-freebsd-11 #959

See <https://ci.centos.org/job/libvirt-go-xml-check/systems=libvirt-freebsd-11/959/display/redirect> ------------------------------------------ Started by upstream project "libvirt-go-xml-check" build number 959 originally caused by: Started by upstream project "libvirt-go-xml-build" build number 962 originally caused by: Started by upstream project "libvirt-build" build number 1127 originally caused by: Started by an SCM change Started by an SCM change Running as SYSTEM [EnvInject] - Loading node environment variables. Building remotely on libvirt-freebsd-11 (libvirt) in workspace <https://ci.centos.org/job/libvirt-go-xml-check/systems=libvirt-freebsd-11/ws/> [libvirt-go-xml] $ /bin/sh -xe /tmp/jenkins5891542463244287702.sh + export 'TEST_ARGS=-tags xmlroundtrip' + go test -tags xmlroundtrip --- FAIL: TestRoundTrip (8.14s) xml_test.go:374: testdata/libvirt/tests/qemuxml2argvdata/virtio-rng-builtin.xml: /domain[0]/devices[0]/rng[0]/backend[0]: element in expected XML missing in actual XML FAIL exit status 1 FAIL _/usr<https://ci.centos.org/job/libvirt-go-xml-check/systems=libvirt-freebsd-11/ws/> 8.451s Build step 'Execute shell' marked build as failure

See <https://ci.centos.org/job/libvirt-go-xml-check/systems=libvirt-freebsd-11/960/display/redirect> ------------------------------------------ Started by upstream project "libvirt-go-xml-check" build number 960 originally caused by: Started by upstream project "libvirt-go-xml-build" build number 963 originally caused by: Started by upstream project "libvirt-build" build number 1128 originally caused by: Started by an SCM change Running as SYSTEM [EnvInject] - Loading node environment variables. Building remotely on libvirt-freebsd-11 (libvirt) in workspace <https://ci.centos.org/job/libvirt-go-xml-check/systems=libvirt-freebsd-11/ws/> [libvirt-go-xml] $ /bin/sh -xe /tmp/jenkins2709781031625453584.sh + export 'TEST_ARGS=-tags xmlroundtrip' + go test -tags xmlroundtrip --- FAIL: TestRoundTrip (23.09s) xml_test.go:374: testdata/libvirt/tests/qemuxml2argvdata/virtio-rng-builtin.xml: /domain[0]/devices[0]/rng[0]/backend[0]: element in expected XML missing in actual XML FAIL exit status 1 FAIL _/usr<https://ci.centos.org/job/libvirt-go-xml-check/systems=libvirt-freebsd-11/ws/> 23.290s Build step 'Execute shell' marked build as failure

See <https://ci.centos.org/job/libvirt-go-xml-check/systems=libvirt-freebsd-11/961/display/redirect> ------------------------------------------ Started by upstream project "libvirt-go-xml-check" build number 961 originally caused by: Started by upstream project "libvirt-go-xml-build" build number 964 originally caused by: Started by upstream project "libvirt-build" build number 1131 originally caused by: Started by an SCM change Running as SYSTEM [EnvInject] - Loading node environment variables. Building remotely on libvirt-freebsd-11 (libvirt) in workspace <https://ci.centos.org/job/libvirt-go-xml-check/systems=libvirt-freebsd-11/ws/> [libvirt-go-xml] $ /bin/sh -xe /tmp/jenkins15893692661918113450.sh + export 'TEST_ARGS=-tags xmlroundtrip' + go test -tags xmlroundtrip --- FAIL: TestRoundTrip (37.08s) xml_test.go:374: testdata/libvirt/tests/qemuxml2argvdata/virtio-rng-builtin.xml: /domain[0]/devices[0]/rng[0]/backend[0]: element in expected XML missing in actual XML FAIL exit status 1 FAIL _/usr<https://ci.centos.org/job/libvirt-go-xml-check/systems=libvirt-freebsd-11/ws/> 37.261s Build step 'Execute shell' marked build as failure

See <https://ci.centos.org/job/libvirt-go-xml-check/systems=libvirt-freebsd-11/962/display/redirect> ------------------------------------------ Started by upstream project "libvirt-go-xml-check" build number 962 originally caused by: Started by upstream project "libvirt-go-xml-build" build number 965 originally caused by: Started by upstream project "libvirt-build" build number 1132 originally caused by: Started by an SCM change Started by an SCM change Started by an SCM change Started by an SCM change Running as SYSTEM [EnvInject] - Loading node environment variables. Building remotely on libvirt-freebsd-11 (libvirt) in workspace <https://ci.centos.org/job/libvirt-go-xml-check/systems=libvirt-freebsd-11/ws/> [libvirt-go-xml] $ /bin/sh -xe /tmp/jenkins17055054819210187085.sh + export 'TEST_ARGS=-tags xmlroundtrip' + go test -tags xmlroundtrip --- FAIL: TestRoundTrip (14.25s) xml_test.go:374: testdata/libvirt/tests/qemuxml2argvdata/virtio-rng-builtin.xml: /domain[0]/devices[0]/rng[0]/backend[0]: element in expected XML missing in actual XML FAIL exit status 1 FAIL _/usr<https://ci.centos.org/job/libvirt-go-xml-check/systems=libvirt-freebsd-11/ws/> 14.363s Build step 'Execute shell' marked build as failure

See <https://ci.centos.org/job/libvirt-go-xml-check/systems=libvirt-freebsd-11/963/display/redirect> ------------------------------------------ Started by upstream project "libvirt-go-xml-check" build number 963 originally caused by: Started by upstream project "libvirt-go-xml-build" build number 966 originally caused by: Started by upstream project "libvirt-build" build number 1133 originally caused by: Started by an SCM change Running as SYSTEM [EnvInject] - Loading node environment variables. Building remotely on libvirt-freebsd-11 (libvirt) in workspace <https://ci.centos.org/job/libvirt-go-xml-check/systems=libvirt-freebsd-11/ws/> [libvirt-go-xml] $ /bin/sh -xe /tmp/jenkins2797793597675587487.sh + export 'TEST_ARGS=-tags xmlroundtrip' + go test -tags xmlroundtrip --- FAIL: TestRoundTrip (7.24s) xml_test.go:374: testdata/libvirt/tests/qemuxml2argvdata/virtio-rng-builtin.xml: /domain[0]/devices[0]/rng[0]/backend[0]: element in expected XML missing in actual XML FAIL exit status 1 FAIL _/usr<https://ci.centos.org/job/libvirt-go-xml-check/systems=libvirt-freebsd-11/ws/> 7.330s Build step 'Execute shell' marked build as failure

participants (1)
-
ci@centos.org