Build failed in Jenkins: virt-manager-check » libvirt-debian-10 #1456

See <https://ci.centos.org/job/virt-manager-check/systems=libvirt-debian-10/1456/display/redirect> ------------------------------------------ Started by upstream project "virt-manager-check" build number 1456 originally caused by: Started by upstream project "virt-manager-build" build number 1460 originally caused by: Started by an SCM change Running as SYSTEM [EnvInject] - Loading node environment variables. Building remotely on libvirt-debian-10 (libvirt) in workspace <https://ci.centos.org/job/virt-manager-check/systems=libvirt-debian-10/ws/> [virt-manager] $ /bin/sh -xe /tmp/jenkins17644955340335300203.sh + /usr/bin/python3 ./setup.py test running test ............................................................F........................................................................................................................................................................................................................................................................................................................................................................................................................................................................................................................sssssssssssssssss ====================================================================== FAIL: test_dir_searchable (tests.test_xmlconfig.TestXMLMisc) ---------------------------------------------------------------------- Traceback (most recent call last): File "<https://ci.centos.org/job/virt-manager-check/systems=libvirt-debian-10/ws/tests/utils.py",> line 230, in wrapper_cb return cb(*args, **kwargs) File "<https://ci.centos.org/job/virt-manager-check/systems=libvirt-debian-10/ws/tests/test_xmlconfig.py",> line 205, in test_dir_searchable self.assertEqual(searchdata.user, "qemu") AssertionError: 'radvd' != 'qemu' - radvd + qemu ---------------------------------------------------------------------- Ran 582 tests in 83.554s FAILED (failures=1, skipped=17) Build step 'Execute shell' marked build as failure

See <https://ci.centos.org/job/virt-manager-check/systems=libvirt-debian-10/1457/display/redirect> ------------------------------------------ Started by upstream project "virt-manager-check" build number 1457 originally caused by: Started by upstream project "virt-manager-build" build number 1461 originally caused by: Started by an SCM change Running as SYSTEM [EnvInject] - Loading node environment variables. Building remotely on libvirt-debian-10 (libvirt) in workspace <https://ci.centos.org/job/virt-manager-check/systems=libvirt-debian-10/ws/> [virt-manager] $ /bin/sh -xe /tmp/jenkins14191876374867906344.sh + /usr/bin/python3 ./setup.py test running test ............................................................F.......................................................................................................................................................................................................................................................................................................................................................................................................................................................................................................................sssssssssssssssss ====================================================================== FAIL: test_dir_searchable (tests.test_xmlconfig.TestXMLMisc) ---------------------------------------------------------------------- Traceback (most recent call last): File "<https://ci.centos.org/job/virt-manager-check/systems=libvirt-debian-10/ws/tests/utils.py",> line 230, in wrapper_cb return cb(*args, **kwargs) File "<https://ci.centos.org/job/virt-manager-check/systems=libvirt-debian-10/ws/tests/test_xmlconfig.py",> line 205, in test_dir_searchable self.assertEqual(searchdata.user, "qemu") AssertionError: 'radvd' != 'qemu' - radvd + qemu ---------------------------------------------------------------------- Ran 581 tests in 55.855s FAILED (failures=1, skipped=17) Build step 'Execute shell' marked build as failure

See <https://ci.centos.org/job/virt-manager-check/systems=libvirt-debian-10/1458/display/redirect> ------------------------------------------ Started by upstream project "virt-manager-check" build number 1458 originally caused by: Started by upstream project "virt-manager-build" build number 1462 originally caused by: Started by upstream project "libvirt-python-build" build number 988 originally caused by: Started by upstream project "libvirt-build" build number 1143 originally caused by: Started by an SCM change Running as SYSTEM [EnvInject] - Loading node environment variables. Building remotely on libvirt-debian-10 (libvirt) in workspace <https://ci.centos.org/job/virt-manager-check/systems=libvirt-debian-10/ws/> [virt-manager] $ /bin/sh -xe /tmp/jenkins16697238020696442829.sh + /usr/bin/python3 ./setup.py test running test ............................................................F.......................................................................................................................................................................................................................................................................................................................................................................................................................................................................................................................sssssssssssssssss ====================================================================== FAIL: test_dir_searchable (tests.test_xmlconfig.TestXMLMisc) ---------------------------------------------------------------------- Traceback (most recent call last): File "<https://ci.centos.org/job/virt-manager-check/systems=libvirt-debian-10/ws/tests/utils.py",> line 230, in wrapper_cb return cb(*args, **kwargs) File "<https://ci.centos.org/job/virt-manager-check/systems=libvirt-debian-10/ws/tests/test_xmlconfig.py",> line 205, in test_dir_searchable self.assertEqual(searchdata.user, "qemu") AssertionError: 'radvd' != 'qemu' - radvd + qemu ---------------------------------------------------------------------- Ran 581 tests in 121.234s FAILED (failures=1, skipped=17) Build step 'Execute shell' marked build as failure

See <https://ci.centos.org/job/virt-manager-check/systems=libvirt-debian-10/1459/display/redirect> ------------------------------------------ Started by upstream project "virt-manager-check" build number 1459 originally caused by: Started by upstream project "virt-manager-build" build number 1463 originally caused by: Started by upstream project "libvirt-python-build" build number 989 originally caused by: Started by upstream project "libvirt-build" build number 1144 originally caused by: Started by an SCM change Running as SYSTEM [EnvInject] - Loading node environment variables. Building remotely on libvirt-debian-10 (libvirt) in workspace <https://ci.centos.org/job/virt-manager-check/systems=libvirt-debian-10/ws/> [virt-manager] $ /bin/sh -xe /tmp/jenkins7042400890045119254.sh + /usr/bin/python3 ./setup.py test running test ............................................................F.......................................................................................................................................................................................................................................................................................................................................................................................................................................................................................................................sssssssssssssssss ====================================================================== FAIL: test_dir_searchable (tests.test_xmlconfig.TestXMLMisc) ---------------------------------------------------------------------- Traceback (most recent call last): File "<https://ci.centos.org/job/virt-manager-check/systems=libvirt-debian-10/ws/tests/utils.py",> line 230, in wrapper_cb return cb(*args, **kwargs) File "<https://ci.centos.org/job/virt-manager-check/systems=libvirt-debian-10/ws/tests/test_xmlconfig.py",> line 205, in test_dir_searchable self.assertEqual(searchdata.user, "qemu") AssertionError: 'radvd' != 'qemu' - radvd + qemu ---------------------------------------------------------------------- Ran 581 tests in 118.276s FAILED (failures=1, skipped=17) Build step 'Execute shell' marked build as failure

See <https://ci.centos.org/job/virt-manager-check/systems=libvirt-debian-10/1460/display/redirect> ------------------------------------------ Started by upstream project "virt-manager-check" build number 1460 originally caused by: Started by upstream project "virt-manager-build" build number 1464 originally caused by: Started by upstream project "libvirt-python-build" build number 990 originally caused by: Started by upstream project "libvirt-build" build number 1145 originally caused by: Started by an SCM change Running as SYSTEM [EnvInject] - Loading node environment variables. Building remotely on libvirt-debian-10 (libvirt) in workspace <https://ci.centos.org/job/virt-manager-check/systems=libvirt-debian-10/ws/> [virt-manager] $ /bin/sh -xe /tmp/jenkins3123820025274750231.sh + /usr/bin/python3 ./setup.py test running test ............................................................F.......................................................................................................................................................................................................................................................................................................................................................................................................................................................................................................................sssssssssssssssss ====================================================================== FAIL: test_dir_searchable (tests.test_xmlconfig.TestXMLMisc) ---------------------------------------------------------------------- Traceback (most recent call last): File "<https://ci.centos.org/job/virt-manager-check/systems=libvirt-debian-10/ws/tests/utils.py",> line 230, in wrapper_cb return cb(*args, **kwargs) File "<https://ci.centos.org/job/virt-manager-check/systems=libvirt-debian-10/ws/tests/test_xmlconfig.py",> line 205, in test_dir_searchable self.assertEqual(searchdata.user, "qemu") AssertionError: 'radvd' != 'qemu' - radvd + qemu ---------------------------------------------------------------------- Ran 581 tests in 71.551s FAILED (failures=1, skipped=17) Build step 'Execute shell' marked build as failure

participants (1)
-
ci@centos.org