[Libvirt-ci] Build failed in Jenkins: libvirt-go-check » libvirt-fedora-29 #289

See <https://ci.centos.org/job/libvirt-go-check/systems=libvirt-fedora-29/289/display/redirect> ------------------------------------------ Started by upstream project "libvirt-go-check" build number 289 originally caused by: Started by upstream project "libvirt-go-build" build number 293 originally caused by: Started by upstream project "libvirt-build" build number 360 originally caused by: Started by an SCM change [EnvInject] - Loading node environment variables. Building remotely on libvirt-fedora-29 (libvirt) in workspace <https://ci.centos.org/job/libvirt-go-check/systems=libvirt-fedora-29/ws/> [libvirt-go] $ /bin/sh -xe /tmp/jenkins2496932684218471592.sh + export 'TEST_ARGS=-tags api' + TEST_ARGS='-tags api' + go test -tags api Missing function 'virConnectGetStoragePoolCapabilities' --- FAIL: TestAPICoverage (0.60s) panic: Missing symbols found [recovered] panic: Missing symbols found goroutine 19 [running]: testing.tRunner.func1(0xc0000c2100) /usr/lib/golang/src/testing/testing.go:792 +0x387 panic(0x5cca80, 0x639c80) /usr/lib/golang/src/runtime/panic.go:513 +0x1b9 _<https://ci.centos.org/job/libvirt-go-check/systems=libvirt-fedora-29/ws/.TestAPICoverage(0xc0000c2100)> <https://ci.centos.org/job/libvirt-go-check/systems=libvirt-fedora-29/ws/api_test.go>:501 +0x554 testing.tRunner(0xc0000c2100, 0x61b0e8) /usr/lib/golang/src/testing/testing.go:827 +0xbf created by testing.(*T).Run /usr/lib/golang/src/testing/testing.go:878 +0x35c exit status 2 FAIL _<https://ci.centos.org/job/libvirt-go-check/systems=libvirt-fedora-29/ws/> 0.939s Build step 'Execute shell' marked build as failure

See <https://ci.centos.org/job/libvirt-go-check/systems=libvirt-fedora-29/290/display/redirect> ------------------------------------------ Started by upstream project "libvirt-go-check" build number 290 originally caused by: Started by upstream project "libvirt-go-build" build number 294 originally caused by: Started by upstream project "libvirt-build" build number 361 originally caused by: Started by an SCM change Started by an SCM change Started by an SCM change Started by an SCM change Started by an SCM change Started by an SCM change Started by an SCM change Started by an SCM change Started by an SCM change Started by an SCM change Started by an SCM change Started by an SCM change Started by an SCM change Started by an SCM change Started by an SCM change Started by an SCM change Started by an SCM change Started by an SCM change [EnvInject] - Loading node environment variables. Building remotely on libvirt-fedora-29 (libvirt) in workspace <https://ci.centos.org/job/libvirt-go-check/systems=libvirt-fedora-29/ws/> [libvirt-go] $ /bin/sh -xe /tmp/jenkins7931929285862972535.sh + export 'TEST_ARGS=-tags api' + TEST_ARGS='-tags api' + go test -tags api Missing function 'virConnectGetStoragePoolCapabilities' --- FAIL: TestAPICoverage (0.68s) panic: Missing symbols found [recovered] panic: Missing symbols found goroutine 19 [running]: testing.tRunner.func1(0xc0000c2100) /usr/lib/golang/src/testing/testing.go:792 +0x387 panic(0x5cca80, 0x639c80) /usr/lib/golang/src/runtime/panic.go:513 +0x1b9 _<https://ci.centos.org/job/libvirt-go-check/systems=libvirt-fedora-29/ws/.TestAPICoverage(0xc0000c2100)> <https://ci.centos.org/job/libvirt-go-check/systems=libvirt-fedora-29/ws/api_test.go>:501 +0x554 testing.tRunner(0xc0000c2100, 0x61b0e8) /usr/lib/golang/src/testing/testing.go:827 +0xbf created by testing.(*T).Run /usr/lib/golang/src/testing/testing.go:878 +0x35c exit status 2 FAIL _<https://ci.centos.org/job/libvirt-go-check/systems=libvirt-fedora-29/ws/> 0.844s Build step 'Execute shell' marked build as failure

See <https://ci.centos.org/job/libvirt-go-check/systems=libvirt-fedora-29/291/display/redirect> ------------------------------------------ Started by upstream project "libvirt-go-check" build number 291 originally caused by: Started by upstream project "libvirt-go-build" build number 295 originally caused by: Started by upstream project "libvirt-build" build number 362 originally caused by: Started by an SCM change Started by an SCM change Started by an SCM change Started by an SCM change Started by an SCM change Started by an SCM change Started by an SCM change Started by an SCM change Started by an SCM change Started by an SCM change Started by an SCM change Started by an SCM change Started by an SCM change Started by an SCM change Started by an SCM change Started by an SCM change [EnvInject] - Loading node environment variables. Building remotely on libvirt-fedora-29 (libvirt) in workspace <https://ci.centos.org/job/libvirt-go-check/systems=libvirt-fedora-29/ws/> [libvirt-go] $ /bin/sh -xe /tmp/jenkins4893871665905231119.sh + export 'TEST_ARGS=-tags api' + TEST_ARGS='-tags api' + go test -tags api Missing function 'virConnectGetStoragePoolCapabilities' --- FAIL: TestAPICoverage (0.51s) panic: Missing symbols found [recovered] panic: Missing symbols found goroutine 19 [running]: testing.tRunner.func1(0xc0000c2100) /usr/lib/golang/src/testing/testing.go:792 +0x387 panic(0x5cca80, 0x639c80) /usr/lib/golang/src/runtime/panic.go:513 +0x1b9 _<https://ci.centos.org/job/libvirt-go-check/systems=libvirt-fedora-29/ws/.TestAPICoverage(0xc0000c2100)> <https://ci.centos.org/job/libvirt-go-check/systems=libvirt-fedora-29/ws/api_test.go>:501 +0x554 testing.tRunner(0xc0000c2100, 0x61b0e8) /usr/lib/golang/src/testing/testing.go:827 +0xbf created by testing.(*T).Run /usr/lib/golang/src/testing/testing.go:878 +0x35c exit status 2 FAIL _<https://ci.centos.org/job/libvirt-go-check/systems=libvirt-fedora-29/ws/> 0.643s Build step 'Execute shell' marked build as failure

See <https://ci.centos.org/job/libvirt-go-check/systems=libvirt-fedora-29/292/display/redirect> ------------------------------------------ Started by upstream project "libvirt-go-check" build number 292 originally caused by: Started by upstream project "libvirt-go-build" build number 296 originally caused by: Started by upstream project "libvirt-build" build number 363 originally caused by: Started by an SCM change Started by an SCM change Started by an SCM change Started by an SCM change Started by an SCM change Started by an SCM change Started by an SCM change Started by an SCM change Started by an SCM change Started by an SCM change [EnvInject] - Loading node environment variables. Building remotely on libvirt-fedora-29 (libvirt) in workspace <https://ci.centos.org/job/libvirt-go-check/systems=libvirt-fedora-29/ws/> [libvirt-go] $ /bin/sh -xe /tmp/jenkins2017031664897797443.sh + export 'TEST_ARGS=-tags api' + TEST_ARGS='-tags api' + go test -tags api Missing function 'virConnectGetStoragePoolCapabilities' --- FAIL: TestAPICoverage (0.66s) panic: Missing symbols found [recovered] panic: Missing symbols found goroutine 5 [running]: testing.tRunner.func1(0xc0000a8100) /usr/lib/golang/src/testing/testing.go:792 +0x387 panic(0x5cca80, 0x639c80) /usr/lib/golang/src/runtime/panic.go:513 +0x1b9 _<https://ci.centos.org/job/libvirt-go-check/systems=libvirt-fedora-29/ws/.TestAPICoverage(0xc0000a8100)> <https://ci.centos.org/job/libvirt-go-check/systems=libvirt-fedora-29/ws/api_test.go>:501 +0x554 testing.tRunner(0xc0000a8100, 0x61b0e8) /usr/lib/golang/src/testing/testing.go:827 +0xbf created by testing.(*T).Run /usr/lib/golang/src/testing/testing.go:878 +0x35c exit status 2 FAIL _<https://ci.centos.org/job/libvirt-go-check/systems=libvirt-fedora-29/ws/> 0.867s Build step 'Execute shell' marked build as failure

See <https://ci.centos.org/job/libvirt-go-check/systems=libvirt-fedora-29/293/display/redirect> ------------------------------------------ Started by upstream project "libvirt-go-check" build number 293 originally caused by: Started by upstream project "libvirt-go-build" build number 297 originally caused by: Started by upstream project "libvirt-build" build number 364 originally caused by: Started by an SCM change [EnvInject] - Loading node environment variables. Building remotely on libvirt-fedora-29 (libvirt) in workspace <https://ci.centos.org/job/libvirt-go-check/systems=libvirt-fedora-29/ws/> [libvirt-go] $ /bin/sh -xe /tmp/jenkins7793819874033209105.sh + export 'TEST_ARGS=-tags api' + TEST_ARGS='-tags api' + go test -tags api Missing function 'virConnectGetStoragePoolCapabilities' --- FAIL: TestAPICoverage (1.16s) panic: Missing symbols found [recovered] panic: Missing symbols found goroutine 19 [running]: testing.tRunner.func1(0xc0000c2100) /usr/lib/golang/src/testing/testing.go:792 +0x387 panic(0x5cca80, 0x639c80) /usr/lib/golang/src/runtime/panic.go:513 +0x1b9 _<https://ci.centos.org/job/libvirt-go-check/systems=libvirt-fedora-29/ws/.TestAPICoverage(0xc0000c2100)> <https://ci.centos.org/job/libvirt-go-check/systems=libvirt-fedora-29/ws/api_test.go>:501 +0x554 testing.tRunner(0xc0000c2100, 0x61b0e8) /usr/lib/golang/src/testing/testing.go:827 +0xbf created by testing.(*T).Run /usr/lib/golang/src/testing/testing.go:878 +0x35c exit status 2 FAIL _<https://ci.centos.org/job/libvirt-go-check/systems=libvirt-fedora-29/ws/> 1.535s Build step 'Execute shell' marked build as failure

See <https://ci.centos.org/job/libvirt-go-check/systems=libvirt-fedora-29/294/display/redirect> ------------------------------------------ Started by upstream project "libvirt-go-check" build number 294 originally caused by: Started by upstream project "libvirt-go-build" build number 298 originally caused by: Started by upstream project "libvirt-build" build number 365 originally caused by: Started by an SCM change [EnvInject] - Loading node environment variables. Building remotely on libvirt-fedora-29 (libvirt) in workspace <https://ci.centos.org/job/libvirt-go-check/systems=libvirt-fedora-29/ws/> [libvirt-go] $ /bin/sh -xe /tmp/jenkins3718882887200171639.sh + export 'TEST_ARGS=-tags api' + TEST_ARGS='-tags api' + go test -tags api Missing function 'virConnectGetStoragePoolCapabilities' --- FAIL: TestAPICoverage (0.24s) panic: Missing symbols found [recovered] panic: Missing symbols found goroutine 19 [running]: testing.tRunner.func1(0xc0000c2100) /usr/lib/golang/src/testing/testing.go:792 +0x387 panic(0x5cca80, 0x639c80) /usr/lib/golang/src/runtime/panic.go:513 +0x1b9 _<https://ci.centos.org/job/libvirt-go-check/systems=libvirt-fedora-29/ws/.TestAPICoverage(0xc0000c2100)> <https://ci.centos.org/job/libvirt-go-check/systems=libvirt-fedora-29/ws/api_test.go>:501 +0x554 testing.tRunner(0xc0000c2100, 0x61b0e8) /usr/lib/golang/src/testing/testing.go:827 +0xbf created by testing.(*T).Run /usr/lib/golang/src/testing/testing.go:878 +0x35c exit status 2 FAIL _<https://ci.centos.org/job/libvirt-go-check/systems=libvirt-fedora-29/ws/> 0.329s Build step 'Execute shell' marked build as failure

See <https://ci.centos.org/job/libvirt-go-check/systems=libvirt-fedora-29/295/display/redirect> ------------------------------------------ Started by upstream project "libvirt-go-check" build number 295 originally caused by: Started by upstream project "libvirt-go-build" build number 299 originally caused by: Started by upstream project "libvirt-build" build number 366 originally caused by: Started by an SCM change [EnvInject] - Loading node environment variables. Building remotely on libvirt-fedora-29 (libvirt) in workspace <https://ci.centos.org/job/libvirt-go-check/systems=libvirt-fedora-29/ws/> [libvirt-go] $ /bin/sh -xe /tmp/jenkins9199482007368229764.sh + export 'TEST_ARGS=-tags api' + TEST_ARGS='-tags api' + go test -tags api Missing function 'virConnectGetStoragePoolCapabilities' --- FAIL: TestAPICoverage (0.20s) panic: Missing symbols found [recovered] panic: Missing symbols found goroutine 5 [running]: testing.tRunner.func1(0xc0000b0100) /usr/lib/golang/src/testing/testing.go:792 +0x387 panic(0x5cca80, 0x639c80) /usr/lib/golang/src/runtime/panic.go:513 +0x1b9 _<https://ci.centos.org/job/libvirt-go-check/systems=libvirt-fedora-29/ws/.TestAPICoverage(0xc0000b0100)> <https://ci.centos.org/job/libvirt-go-check/systems=libvirt-fedora-29/ws/api_test.go>:501 +0x554 testing.tRunner(0xc0000b0100, 0x61b0e8) /usr/lib/golang/src/testing/testing.go:827 +0xbf created by testing.(*T).Run /usr/lib/golang/src/testing/testing.go:878 +0x35c exit status 2 FAIL _<https://ci.centos.org/job/libvirt-go-check/systems=libvirt-fedora-29/ws/> 0.242s Build step 'Execute shell' marked build as failure

See <https://ci.centos.org/job/libvirt-go-check/systems=libvirt-fedora-29/296/display/redirect> ------------------------------------------ Started by upstream project "libvirt-go-check" build number 296 originally caused by: Started by upstream project "libvirt-go-build" build number 300 originally caused by: Started by upstream project "libvirt-build" build number 367 originally caused by: Started by an SCM change [EnvInject] - Loading node environment variables. Building remotely on libvirt-fedora-29 (libvirt) in workspace <https://ci.centos.org/job/libvirt-go-check/systems=libvirt-fedora-29/ws/> [libvirt-go] $ /bin/sh -xe /tmp/jenkins5772874176702359369.sh + export 'TEST_ARGS=-tags api' + TEST_ARGS='-tags api' + go test -tags api Missing function 'virConnectGetStoragePoolCapabilities' --- FAIL: TestAPICoverage (0.57s) panic: Missing symbols found [recovered] panic: Missing symbols found goroutine 5 [running]: testing.tRunner.func1(0xc0000a8100) /usr/lib/golang/src/testing/testing.go:792 +0x387 panic(0x5cca80, 0x639c80) /usr/lib/golang/src/runtime/panic.go:513 +0x1b9 _<https://ci.centos.org/job/libvirt-go-check/systems=libvirt-fedora-29/ws/.TestAPICoverage(0xc0000a8100)> <https://ci.centos.org/job/libvirt-go-check/systems=libvirt-fedora-29/ws/api_test.go>:501 +0x554 testing.tRunner(0xc0000a8100, 0x61b0e8) /usr/lib/golang/src/testing/testing.go:827 +0xbf created by testing.(*T).Run /usr/lib/golang/src/testing/testing.go:878 +0x35c exit status 2 FAIL _<https://ci.centos.org/job/libvirt-go-check/systems=libvirt-fedora-29/ws/> 0.781s Build step 'Execute shell' marked build as failure

See <https://ci.centos.org/job/libvirt-go-check/systems=libvirt-fedora-29/297/display/redirect> ------------------------------------------ Started by upstream project "libvirt-go-check" build number 297 originally caused by: Started by upstream project "libvirt-go-build" build number 301 originally caused by: Started by upstream project "libvirt-build" build number 368 originally caused by: Started by an SCM change Started by an SCM change Started by an SCM change Started by an SCM change Started by an SCM change [EnvInject] - Loading node environment variables. Building remotely on libvirt-fedora-29 (libvirt) in workspace <https://ci.centos.org/job/libvirt-go-check/systems=libvirt-fedora-29/ws/> [libvirt-go] $ /bin/sh -xe /tmp/jenkins7258127430508563445.sh + export 'TEST_ARGS=-tags api' + TEST_ARGS='-tags api' + go test -tags api Missing function 'virConnectGetStoragePoolCapabilities' --- FAIL: TestAPICoverage (1.39s) panic: Missing symbols found [recovered] panic: Missing symbols found goroutine 19 [running]: testing.tRunner.func1(0xc0000c2100) /usr/lib/golang/src/testing/testing.go:792 +0x387 panic(0x5cca80, 0x639c80) /usr/lib/golang/src/runtime/panic.go:513 +0x1b9 _<https://ci.centos.org/job/libvirt-go-check/systems=libvirt-fedora-29/ws/.TestAPICoverage(0xc0000c2100)> <https://ci.centos.org/job/libvirt-go-check/systems=libvirt-fedora-29/ws/api_test.go>:501 +0x554 testing.tRunner(0xc0000c2100, 0x61b0e8) /usr/lib/golang/src/testing/testing.go:827 +0xbf created by testing.(*T).Run /usr/lib/golang/src/testing/testing.go:878 +0x35c exit status 2 FAIL _<https://ci.centos.org/job/libvirt-go-check/systems=libvirt-fedora-29/ws/> 1.726s Build step 'Execute shell' marked build as failure

See <https://ci.centos.org/job/libvirt-go-check/systems=libvirt-fedora-29/298/display/redirect> ------------------------------------------ Started by upstream project "libvirt-go-check" build number 298 originally caused by: Started by upstream project "libvirt-go-build" build number 302 originally caused by: Started by upstream project "libvirt-build" build number 370 originally caused by: Started by an SCM change Started by an SCM change Started by an SCM change Started by an SCM change [EnvInject] - Loading node environment variables. Building remotely on libvirt-fedora-29 (libvirt) in workspace <https://ci.centos.org/job/libvirt-go-check/systems=libvirt-fedora-29/ws/> [libvirt-go] $ /bin/sh -xe /tmp/jenkins3799309208298600732.sh + export 'TEST_ARGS=-tags api' + TEST_ARGS='-tags api' + go test -tags api Missing function 'virConnectGetStoragePoolCapabilities' --- FAIL: TestAPICoverage (1.27s) panic: Missing symbols found [recovered] panic: Missing symbols found goroutine 5 [running]: testing.tRunner.func1(0xc0000a8100) /usr/lib/golang/src/testing/testing.go:792 +0x387 panic(0x5cca80, 0x639c80) /usr/lib/golang/src/runtime/panic.go:513 +0x1b9 _<https://ci.centos.org/job/libvirt-go-check/systems=libvirt-fedora-29/ws/.TestAPICoverage(0xc0000a8100)> <https://ci.centos.org/job/libvirt-go-check/systems=libvirt-fedora-29/ws/api_test.go>:501 +0x554 testing.tRunner(0xc0000a8100, 0x61b0e8) /usr/lib/golang/src/testing/testing.go:827 +0xbf created by testing.(*T).Run /usr/lib/golang/src/testing/testing.go:878 +0x35c exit status 2 FAIL _<https://ci.centos.org/job/libvirt-go-check/systems=libvirt-fedora-29/ws/> 1.419s Build step 'Execute shell' marked build as failure

See <https://ci.centos.org/job/libvirt-go-check/systems=libvirt-fedora-29/299/display/redirect> ------------------------------------------ Started by upstream project "libvirt-go-check" build number 299 originally caused by: Started by upstream project "libvirt-go-build" build number 303 originally caused by: Started by upstream project "libvirt-build" build number 371 originally caused by: Started by an SCM change [EnvInject] - Loading node environment variables. Building remotely on libvirt-fedora-29 (libvirt) in workspace <https://ci.centos.org/job/libvirt-go-check/systems=libvirt-fedora-29/ws/> [libvirt-go] $ /bin/sh -xe /tmp/jenkins1508916473902609931.sh + export 'TEST_ARGS=-tags api' + TEST_ARGS='-tags api' + go test -tags api Missing function 'virConnectGetStoragePoolCapabilities' --- FAIL: TestAPICoverage (0.62s) panic: Missing symbols found [recovered] panic: Missing symbols found goroutine 5 [running]: testing.tRunner.func1(0xc0000a8100) /usr/lib/golang/src/testing/testing.go:792 +0x387 panic(0x5cca80, 0x639c80) /usr/lib/golang/src/runtime/panic.go:513 +0x1b9 _<https://ci.centos.org/job/libvirt-go-check/systems=libvirt-fedora-29/ws/.TestAPICoverage(0xc0000a8100)> <https://ci.centos.org/job/libvirt-go-check/systems=libvirt-fedora-29/ws/api_test.go>:501 +0x554 testing.tRunner(0xc0000a8100, 0x61b0e8) /usr/lib/golang/src/testing/testing.go:827 +0xbf created by testing.(*T).Run /usr/lib/golang/src/testing/testing.go:878 +0x35c exit status 2 FAIL _<https://ci.centos.org/job/libvirt-go-check/systems=libvirt-fedora-29/ws/> 0.765s Build step 'Execute shell' marked build as failure

See <https://ci.centos.org/job/libvirt-go-check/systems=libvirt-fedora-29/300/display/redirect> ------------------------------------------ Started by upstream project "libvirt-go-check" build number 300 originally caused by: Started by upstream project "libvirt-go-build" build number 304 originally caused by: Started by upstream project "libvirt-build" build number 372 originally caused by: Started by an SCM change [EnvInject] - Loading node environment variables. Building remotely on libvirt-fedora-29 (libvirt) in workspace <https://ci.centos.org/job/libvirt-go-check/systems=libvirt-fedora-29/ws/> [libvirt-go] $ /bin/sh -xe /tmp/jenkins8144454101456120334.sh + export 'TEST_ARGS=-tags api' + TEST_ARGS='-tags api' + go test -tags api Missing function 'virConnectGetStoragePoolCapabilities' --- FAIL: TestAPICoverage (0.43s) panic: Missing symbols found [recovered] panic: Missing symbols found goroutine 5 [running]: testing.tRunner.func1(0xc0000a8100) /usr/lib/golang/src/testing/testing.go:792 +0x387 panic(0x5cca80, 0x639c80) /usr/lib/golang/src/runtime/panic.go:513 +0x1b9 _<https://ci.centos.org/job/libvirt-go-check/systems=libvirt-fedora-29/ws/.TestAPICoverage(0xc0000a8100)> <https://ci.centos.org/job/libvirt-go-check/systems=libvirt-fedora-29/ws/api_test.go>:501 +0x554 testing.tRunner(0xc0000a8100, 0x61b0e8) /usr/lib/golang/src/testing/testing.go:827 +0xbf created by testing.(*T).Run /usr/lib/golang/src/testing/testing.go:878 +0x35c exit status 2 FAIL _<https://ci.centos.org/job/libvirt-go-check/systems=libvirt-fedora-29/ws/> 0.564s Build step 'Execute shell' marked build as failure

participants (1)
-
ci@centos.org