[Libvirt-ci] Build failed in Jenkins: libvirt-master-check » libvirt-centos-7 #696

See <https://ci.centos.org/job/libvirt-master-check/systems=libvirt-centos-7/696/display/redirect> ------------------------------------------ [...truncated 26.40 KB...] PASS: test-net_if PASS: test-netdb PASS: test-netinet_in PASS: test-nl_langinfo.sh PASS: test-memchr PASS: test-nanosleep PASS: test-nonblocking PASS: test-open PASS: test-openpty PASS: test-passfd PASS: test-pathmax PASS: test-perror.sh PASS: test-perror2 PASS: test-pipe PASS: test-pipe2 PASS: test-poll-h PASS: test-poll PASS: test-posix_openpt PASS: test-posix_spawn_file_actions_addclose PASS: test-posix_spawn_file_actions_adddup2 PASS: test-posix_spawn_file_actions_addopen PASS: test-posix_spawn1 PASS: test-posix_spawn2 PASS: test-pthread_sigmask1 PASS: test-pthread_sigmask2 SKIP: test-ptsname SKIP: test-ptsname_r PASS: test-raise PASS: test-random_r PASS: test-rawmemchr PASS: test-read PASS: test-readlink PASS: test-recv PASS: test-regex PASS: test-sched PASS: test-select PASS: test-nonblocking-pipe.sh PASS: test-select-out.sh PASS: test-send PASS: test-setenv PASS: test-setlocale1.sh PASS: test-setlocale2.sh PASS: test-setsockopt PASS: test-sigaction PASS: test-signal-h PASS: test-signbit PASS: test-sigpipe.sh PASS: test-select-in.sh PASS: test-nonblocking-socket.sh PASS: test-snprintf PASS: test-sockets PASS: test-spawn PASS: test-stat PASS: test-stat-time PASS: test-stdalign PASS: test-stdbool PASS: test-stddef PASS: test-stdint PASS: test-stdio PASS: test-stdlib PASS: test-strchrnul PASS: test-strerror PASS: test-strerror_r PASS: test-string PASS: test-strings PASS: test-strnlen PASS: test-symlink PASS: test-sys_ioctl PASS: test-sys_select PASS: test-sys_socket PASS: test-sys_stat PASS: test-sys_time PASS: test-sys_types PASS: test-sys_uio PASS: test-sys_utsname PASS: test-sys_wait PASS: test-termios PASS: test-sigprocmask PASS: test-thread_self PASS: test-init.sh PASS: test-time PASS: test-thread_create SKIP: test-ttyname_r PASS: test-unistd PASS: test-uname PASS: test-unlockpt PASS: test-unsetenv PASS: test-vasnprintf PASS: test-vasprintf PASS: test-vc-list-files-git.sh SKIP: test-vc-list-files-cvs.sh PASS: test-sleep PASS: test-verify PASS: test-vsnprintf PASS: test-wchar PASS: test-wcrtomb.sh SKIP: test-wcrtomb-w32-1.sh SKIP: test-wcrtomb-w32-2.sh SKIP: test-wcrtomb-w32-3.sh SKIP: test-wcrtomb-w32-4.sh SKIP: test-wcrtomb-w32-5.sh PASS: test-wctype-h PASS: test-write PASS: test-xalloc-die.sh PASS: test-usleep PASS: test-verify.sh make[6]: Entering directory `<https://ci.centos.org/job/libvirt-master-check/systems=libvirt-centos-7/ws/build/gnulib/tests'> make all-recursive make[7]: Entering directory `<https://ci.centos.org/job/libvirt-master-check/systems=libvirt-centos-7/ws/build/gnulib/tests'> Making all in . make[8]: Entering directory `<https://ci.centos.org/job/libvirt-master-check/systems=libvirt-centos-7/ws/build/gnulib/tests'> make[8]: Nothing to be done for `all-am'. make[8]: Leaving directory `<https://ci.centos.org/job/libvirt-master-check/systems=libvirt-centos-7/ws/build/gnulib/tests'> make[7]: Leaving directory `<https://ci.centos.org/job/libvirt-master-check/systems=libvirt-centos-7/ws/build/gnulib/tests'> make[6]: Leaving directory `<https://ci.centos.org/job/libvirt-master-check/systems=libvirt-centos-7/ws/build/gnulib/tests'> ============================================================================ Testsuite summary for libvirt 3.9.0 ============================================================================ # TOTAL: 218 # PASS: 204 # SKIP: 14 # XFAIL: 0 # FAIL: 0 # XPASS: 0 # ERROR: 0 ============================================================================ make[5]: Leaving directory `<https://ci.centos.org/job/libvirt-master-check/systems=libvirt-centos-7/ws/build/gnulib/tests'> make[4]: Leaving directory `<https://ci.centos.org/job/libvirt-master-check/systems=libvirt-centos-7/ws/build/gnulib/tests'> make[3]: Leaving directory `<https://ci.centos.org/job/libvirt-master-check/systems=libvirt-centos-7/ws/build/gnulib/tests'> make[2]: Leaving directory `<https://ci.centos.org/job/libvirt-master-check/systems=libvirt-centos-7/ws/build/gnulib/tests'> make[1]: Leaving directory `<https://ci.centos.org/job/libvirt-master-check/systems=libvirt-centos-7/ws/build/gnulib/tests'> Making check in tests make[1]: Entering directory `<https://ci.centos.org/job/libvirt-master-check/systems=libvirt-centos-7/ws/build/tests'> make make[2]: Entering directory `<https://ci.centos.org/job/libvirt-master-check/systems=libvirt-centos-7/ws/build/tests'> make[2]: Nothing to be done for `all'. make[2]: Leaving directory `<https://ci.centos.org/job/libvirt-master-check/systems=libvirt-centos-7/ws/build/tests'> make check-TESTS make[2]: Entering directory `<https://ci.centos.org/job/libvirt-master-check/systems=libvirt-centos-7/ws/build/tests'> make[3]: Entering directory `<https://ci.centos.org/job/libvirt-master-check/systems=libvirt-centos-7/ws/build/tests'> PASS: sockettest PASS: virhostcputest PASS: virbuftest PASS: seclabeltest PASS: virhashtest PASS: commandtest PASS: virconftest PASS: viratomictest PASS: shunloadtest PASS: utiltest PASS: virtimetest PASS: viruritest PASS: virkeyfiletest PASS: virauthconfigtest PASS: viralloctest PASS: virbitmaptest PASS: vircryptotest PASS: virpcitest PASS: virendiantest PASS: virshtest PASS: virfilecachetest PASS: vircgrouptest PASS: virfirewalltest PASS: viriscsitest PASS: virkeycodetest PASS: virlockspacetest PASS: virlogtest PASS: virrotatingfiletest PASS: virstringtest PASS: virportallocatortest PASS: sysinfotest PASS: virkmodtest PASS: vircapstest PASS: virschematest PASS: domaincapstest PASS: domainconftest PASS: virhostdevtest PASS: virfiletest PASS: virnetdevtest PASS: virtypedparamtest PASS: virnetmessagetest PASS: virnetsockettest PASS: virnetdaemontest PASS: virnetserverclienttest PASS: fchosttest PASS: virnettlscontexttest PASS: virnettlssessiontest PASS: vircaps2xmltest PASS: scsihosttest PASS: fdstreamtest PASS: virsystemdtest PASS: virpolkittest PASS: virdbustest PASS: viridentitytest PASS: securityselinuxtest PASS: securityselinuxlabeltest PASS: qemuargv2xmltest PASS: qemuxml2argvtest PASS: qemuhelptest PASS: qemuxml2xmltest PASS: domainsnapshotxml2xmltest PASS: qemumonitortest PASS: qemumonitorjsontest PASS: qemucapabilitiestest PASS: qemucaps2xmltest PASS: qemuhotplugtest PASS: qemumemlocktest PASS: qemucommandutiltest PASS: lxcxml2xmltest PASS: lxcconf2xmltest PASS: qemuagenttest PASS: openvzutilstest PASS: esxutilstest PASS: vboxsnapshotxmltest PASS: vmx2xmltest PASS: xml2vmxtest PASS: vmwarevertest PASS: virjsontest PASS: networkxml2xmltest PASS: networkxml2xmlupdatetest PASS: networkxml2conftest PASS: nwfilterxml2xmltest PASS: networkxml2firewalltest PASS: nwfilterebiptablestest PASS: nwfilterxml2firewalltest PASS: virstorageutiltest PASS: storagevolxml2argvtest PASS: virscsitest PASS: nsstest PASS: storagevolxml2xmltest PASS: nssguesttest PASS: nodedevxml2xmltest PASS: storagepoolxml2xmltest FAIL: cputest make[3]: *** [metadatatest.log] Segmentation fault make[3]: *** Waiting for unfinished jobs.... FAIL: virstoragetest FAIL: interfacexml2xmltest make[3]: *** wait: No child processes. Stop. make[2]: *** [check-TESTS] Error 2 make[2]: Leaving directory `<https://ci.centos.org/job/libvirt-master-check/systems=libvirt-centos-7/ws/build/tests'> make[1]: *** [check-am] Error 2 make[1]: Leaving directory `<https://ci.centos.org/job/libvirt-master-check/systems=libvirt-centos-7/ws/build/tests'> make: *** [check-recursive] Error 1 + cat tests/test-suite.log /tmp/jenkins2815878437671215998.sh: line 16: 10159 Bus error cat tests/test-suite.log + true + exit 1 Build step 'Execute shell' marked build as failure

participants (1)
-
ci@centos.org