[Libvirt-ci] Build failed in Jenkins: libvirt-go-master-check » libvirt-fedora-rawhide #1057

See <https://ci.centos.org/job/libvirt-go-master-check/systems=libvirt-fedora-rawhide/1057/display/redirect> ------------------------------------------ Started by upstream project "libvirt-go-master-check" build number 1057 originally caused by: Started by upstream project "libvirt-go-master-build" build number 1068 originally caused by: Started by upstream project "libvirt-master-build" build number 1465 originally caused by: Started by an SCM change [EnvInject] - Loading node environment variables. Building remotely on libvirt-fedora-rawhide (libvirt) in workspace <https://ci.centos.org/job/libvirt-go-master-check/systems=libvirt-fedora-rawhide/ws/> [libvirt-go-master] $ /bin/sh -xe /tmp/jenkins5609251247621353634.sh + export 'TEST_ARGS=-tags api' + TEST_ARGS='-tags api' + go test -tags api 2018-05-28 12:31:16.076+0000: 16154: info : libvirt version: 4.4.0 2018-05-28 12:31:16.076+0000: 16154: info : hostname: libvirt-fedora-rawhide 2018-05-28 12:31:16.076+0000: 16154: warning : virEventRegisterImpl:245 : Ignoring attempt to replace registered event loop 2018-05-28 12:31:16.077+0000: 16154: warning : virEventRegisterImpl:245 : Ignoring attempt to replace registered event loop 2018-05-28 12:31:16.077+0000: 16154: warning : virEventRegisterImpl:245 : Ignoring attempt to replace registered event loop Missing function 'virDomainDetachDeviceAlias' --- FAIL: TestAPICoverage (0.63s) panic: Missing symbols found [recovered] panic: Missing symbols found goroutine 5 [running]: testing.tRunner.func1(0xc4200aa0f0) /usr/lib/golang/src/testing/testing.go:742 +0x29d panic(0x5ad520, 0x611850) /usr/lib/golang/src/runtime/panic.go:502 +0x229 _<https://ci.centos.org/job/libvirt-go-master-check/systems=libvirt-fedora-rawhide/ws/.TestAPICoverage(0xc4200aa0f0)> <https://ci.centos.org/job/libvirt-go-master-check/systems=libvirt-fedora-rawhide/ws/api_test.go>:504 +0x548 testing.tRunner(0xc4200aa0f0, 0x5fc938) /usr/lib/golang/src/testing/testing.go:777 +0xd0 created by testing.(*T).Run /usr/lib/golang/src/testing/testing.go:824 +0x2e0 exit status 2 FAIL _<https://ci.centos.org/job/libvirt-go-master-check/systems=libvirt-fedora-rawhide/ws/> 1.931s Build step 'Execute shell' marked build as failure

See <https://ci.centos.org/job/libvirt-go-master-check/systems=libvirt-fedora-rawhide/1058/display/redirect> ------------------------------------------ Started by upstream project "libvirt-go-master-check" build number 1058 originally caused by: Started by upstream project "libvirt-go-master-build" build number 1069 originally caused by: Started by upstream project "libvirt-master-build" build number 1466 originally caused by: Started by an SCM change [EnvInject] - Loading node environment variables. Building remotely on libvirt-fedora-rawhide (libvirt) in workspace <https://ci.centos.org/job/libvirt-go-master-check/systems=libvirt-fedora-rawhide/ws/> [libvirt-go-master] $ /bin/sh -xe /tmp/jenkins560966253023877359.sh + export 'TEST_ARGS=-tags api' + TEST_ARGS='-tags api' + go test -tags api 2018-05-28 15:31:46.861+0000: 15847: info : libvirt version: 4.4.0 2018-05-28 15:31:46.861+0000: 15847: info : hostname: libvirt-fedora-rawhide 2018-05-28 15:31:46.861+0000: 15847: warning : virEventRegisterImpl:245 : Ignoring attempt to replace registered event loop 2018-05-28 15:31:46.861+0000: 15847: warning : virEventRegisterImpl:245 : Ignoring attempt to replace registered event loop 2018-05-28 15:31:46.861+0000: 15847: warning : virEventRegisterImpl:245 : Ignoring attempt to replace registered event loop Missing function 'virConnectBaselineHypervisorCPU' Missing function 'virConnectCompareHypervisorCPU' Missing function 'virDomainDetachDeviceAlias' --- FAIL: TestAPICoverage (0.24s) panic: Missing symbols found [recovered] panic: Missing symbols found goroutine 5 [running]: testing.tRunner.func1(0xc4200b80f0) /usr/lib/golang/src/testing/testing.go:742 +0x29d panic(0x5ad520, 0x611850) /usr/lib/golang/src/runtime/panic.go:502 +0x229 _<https://ci.centos.org/job/libvirt-go-master-check/systems=libvirt-fedora-rawhide/ws/.TestAPICoverage(0xc4200b80f0)> <https://ci.centos.org/job/libvirt-go-master-check/systems=libvirt-fedora-rawhide/ws/api_test.go>:504 +0x548 testing.tRunner(0xc4200b80f0, 0x5fc938) /usr/lib/golang/src/testing/testing.go:777 +0xd0 created by testing.(*T).Run /usr/lib/golang/src/testing/testing.go:824 +0x2e0 exit status 2 FAIL _<https://ci.centos.org/job/libvirt-go-master-check/systems=libvirt-fedora-rawhide/ws/> 0.300s Build step 'Execute shell' marked build as failure

See <https://ci.centos.org/job/libvirt-go-master-check/systems=libvirt-fedora-rawhide/1059/display/redirect> ------------------------------------------ Started by upstream project "libvirt-go-master-check" build number 1059 originally caused by: Started by upstream project "libvirt-go-master-build" build number 1070 originally caused by: Started by upstream project "libvirt-master-build" build number 1467 originally caused by: Started by an SCM change Started by an SCM change [EnvInject] - Loading node environment variables. Building remotely on libvirt-fedora-rawhide (libvirt) in workspace <https://ci.centos.org/job/libvirt-go-master-check/systems=libvirt-fedora-rawhide/ws/> [libvirt-go-master] $ /bin/sh -xe /tmp/jenkins5850089989241679098.sh + export 'TEST_ARGS=-tags api' + TEST_ARGS='-tags api' + go test -tags api 2018-05-28 16:51:46.549+0000: 27786: info : libvirt version: 4.4.0 2018-05-28 16:51:46.549+0000: 27786: info : hostname: libvirt-fedora-rawhide 2018-05-28 16:51:46.549+0000: 27786: warning : virEventRegisterImpl:245 : Ignoring attempt to replace registered event loop 2018-05-28 16:51:46.549+0000: 27786: warning : virEventRegisterImpl:245 : Ignoring attempt to replace registered event loop 2018-05-28 16:51:46.549+0000: 27786: warning : virEventRegisterImpl:245 : Ignoring attempt to replace registered event loop Missing function 'virConnectBaselineHypervisorCPU' Missing function 'virConnectCompareHypervisorCPU' Missing function 'virDomainDetachDeviceAlias' --- FAIL: TestAPICoverage (1.51s) panic: Missing symbols found [recovered] panic: Missing symbols found goroutine 5 [running]: testing.tRunner.func1(0xc4200aa0f0) /usr/lib/golang/src/testing/testing.go:742 +0x29d panic(0x5ad520, 0x611850) /usr/lib/golang/src/runtime/panic.go:502 +0x229 _<https://ci.centos.org/job/libvirt-go-master-check/systems=libvirt-fedora-rawhide/ws/.TestAPICoverage(0xc4200aa0f0)> <https://ci.centos.org/job/libvirt-go-master-check/systems=libvirt-fedora-rawhide/ws/api_test.go>:504 +0x548 testing.tRunner(0xc4200aa0f0, 0x5fc938) /usr/lib/golang/src/testing/testing.go:777 +0xd0 created by testing.(*T).Run /usr/lib/golang/src/testing/testing.go:824 +0x2e0 exit status 2 FAIL _<https://ci.centos.org/job/libvirt-go-master-check/systems=libvirt-fedora-rawhide/ws/> 1.811s Build step 'Execute shell' marked build as failure

See <https://ci.centos.org/job/libvirt-go-master-check/systems=libvirt-fedora-rawhide/1060/display/redirect> ------------------------------------------ Started by upstream project "libvirt-go-master-check" build number 1060 originally caused by: Started by upstream project "libvirt-go-master-build" build number 1071 originally caused by: Started by upstream project "libvirt-master-build" build number 1468 originally caused by: Started by an SCM change [EnvInject] - Loading node environment variables. Building remotely on libvirt-fedora-rawhide (libvirt) in workspace <https://ci.centos.org/job/libvirt-go-master-check/systems=libvirt-fedora-rawhide/ws/> [libvirt-go-master] $ /bin/sh -xe /tmp/jenkins1400780795886622753.sh + export 'TEST_ARGS=-tags api' + TEST_ARGS='-tags api' + go test -tags api 2018-05-29 09:48:42.268+0000: 1647: info : libvirt version: 4.4.0 2018-05-29 09:48:42.268+0000: 1647: info : hostname: libvirt-fedora-rawhide 2018-05-29 09:48:42.268+0000: 1647: warning : virEventRegisterImpl:245 : Ignoring attempt to replace registered event loop 2018-05-29 09:48:42.268+0000: 1647: warning : virEventRegisterImpl:245 : Ignoring attempt to replace registered event loop 2018-05-29 09:48:42.268+0000: 1647: warning : virEventRegisterImpl:245 : Ignoring attempt to replace registered event loop Missing function 'virConnectBaselineHypervisorCPU' Missing function 'virConnectCompareHypervisorCPU' Missing function 'virDomainDetachDeviceAlias' --- FAIL: TestAPICoverage (0.98s) panic: Missing symbols found [recovered] panic: Missing symbols found goroutine 19 [running]: testing.tRunner.func1(0xc4200d00f0) /usr/lib/golang/src/testing/testing.go:742 +0x29d panic(0x5ad520, 0x611850) /usr/lib/golang/src/runtime/panic.go:502 +0x229 _<https://ci.centos.org/job/libvirt-go-master-check/systems=libvirt-fedora-rawhide/ws/.TestAPICoverage(0xc4200d00f0)> <https://ci.centos.org/job/libvirt-go-master-check/systems=libvirt-fedora-rawhide/ws/api_test.go>:504 +0x548 testing.tRunner(0xc4200d00f0, 0x5fc938) /usr/lib/golang/src/testing/testing.go:777 +0xd0 created by testing.(*T).Run /usr/lib/golang/src/testing/testing.go:824 +0x2e0 exit status 2 FAIL _<https://ci.centos.org/job/libvirt-go-master-check/systems=libvirt-fedora-rawhide/ws/> 1.159s Build step 'Execute shell' marked build as failure

See <https://ci.centos.org/job/libvirt-go-master-check/systems=libvirt-fedora-rawhide/1061/display/redirect> ------------------------------------------ Started by upstream project "libvirt-go-master-check" build number 1061 originally caused by: Started by upstream project "libvirt-go-master-build" build number 1072 originally caused by: Started by upstream project "libvirt-master-build" build number 1469 originally caused by: Started by an SCM change [EnvInject] - Loading node environment variables. Building remotely on libvirt-fedora-rawhide (libvirt) in workspace <https://ci.centos.org/job/libvirt-go-master-check/systems=libvirt-fedora-rawhide/ws/> [libvirt-go-master] $ /bin/sh -xe /tmp/jenkins1137182032412969475.sh + export 'TEST_ARGS=-tags api' + TEST_ARGS='-tags api' + go test -tags api 2018-05-29 13:36:01.471+0000: 9859: info : libvirt version: 4.4.0 2018-05-29 13:36:01.471+0000: 9859: info : hostname: libvirt-fedora-rawhide 2018-05-29 13:36:01.471+0000: 9859: warning : virEventRegisterImpl:245 : Ignoring attempt to replace registered event loop 2018-05-29 13:36:01.471+0000: 9859: warning : virEventRegisterImpl:245 : Ignoring attempt to replace registered event loop 2018-05-29 13:36:01.471+0000: 9859: warning : virEventRegisterImpl:245 : Ignoring attempt to replace registered event loop Missing function 'virConnectBaselineHypervisorCPU' Missing function 'virConnectCompareHypervisorCPU' Missing function 'virDomainDetachDeviceAlias' --- FAIL: TestAPICoverage (0.38s) panic: Missing symbols found [recovered] panic: Missing symbols found goroutine 18 [running]: testing.tRunner.func1(0xc4200c40f0) /usr/lib/golang/src/testing/testing.go:742 +0x29d panic(0x5ad520, 0x611850) /usr/lib/golang/src/runtime/panic.go:502 +0x229 _<https://ci.centos.org/job/libvirt-go-master-check/systems=libvirt-fedora-rawhide/ws/.TestAPICoverage(0xc4200c40f0)> <https://ci.centos.org/job/libvirt-go-master-check/systems=libvirt-fedora-rawhide/ws/api_test.go>:504 +0x548 testing.tRunner(0xc4200c40f0, 0x5fc938) /usr/lib/golang/src/testing/testing.go:777 +0xd0 created by testing.(*T).Run /usr/lib/golang/src/testing/testing.go:824 +0x2e0 exit status 2 FAIL _<https://ci.centos.org/job/libvirt-go-master-check/systems=libvirt-fedora-rawhide/ws/> 0.447s Build step 'Execute shell' marked build as failure

See <https://ci.centos.org/job/libvirt-go-master-check/systems=libvirt-fedora-rawhide/1062/display/redirect> ------------------------------------------ Started by upstream project "libvirt-go-master-check" build number 1062 originally caused by: Started by upstream project "libvirt-go-master-build" build number 1073 originally caused by: Started by upstream project "libvirt-master-build" build number 1470 originally caused by: Started by an SCM change [EnvInject] - Loading node environment variables. Building remotely on libvirt-fedora-rawhide (libvirt) in workspace <https://ci.centos.org/job/libvirt-go-master-check/systems=libvirt-fedora-rawhide/ws/> [libvirt-go-master] $ /bin/sh -xe /tmp/jenkins7902382188488808077.sh + export 'TEST_ARGS=-tags api' + TEST_ARGS='-tags api' + go test -tags api 2018-05-29 15:17:34.530+0000: 14759: info : libvirt version: 4.4.0 2018-05-29 15:17:34.530+0000: 14759: info : hostname: libvirt-fedora-rawhide 2018-05-29 15:17:34.530+0000: 14759: warning : virEventRegisterImpl:245 : Ignoring attempt to replace registered event loop 2018-05-29 15:17:34.530+0000: 14759: warning : virEventRegisterImpl:245 : Ignoring attempt to replace registered event loop 2018-05-29 15:17:34.530+0000: 14759: warning : virEventRegisterImpl:245 : Ignoring attempt to replace registered event loop Missing function 'virConnectBaselineHypervisorCPU' Missing function 'virConnectCompareHypervisorCPU' Missing function 'virDomainDetachDeviceAlias' --- FAIL: TestAPICoverage (0.94s) panic: Missing symbols found [recovered] panic: Missing symbols found goroutine 5 [running]: testing.tRunner.func1(0xc4200aa0f0) /usr/lib/golang/src/testing/testing.go:742 +0x29d panic(0x5ad520, 0x611850) /usr/lib/golang/src/runtime/panic.go:502 +0x229 _<https://ci.centos.org/job/libvirt-go-master-check/systems=libvirt-fedora-rawhide/ws/.TestAPICoverage(0xc4200aa0f0)> <https://ci.centos.org/job/libvirt-go-master-check/systems=libvirt-fedora-rawhide/ws/api_test.go>:504 +0x548 testing.tRunner(0xc4200aa0f0, 0x5fc938) /usr/lib/golang/src/testing/testing.go:777 +0xd0 created by testing.(*T).Run /usr/lib/golang/src/testing/testing.go:824 +0x2e0 exit status 2 FAIL _<https://ci.centos.org/job/libvirt-go-master-check/systems=libvirt-fedora-rawhide/ws/> 1.229s Build step 'Execute shell' marked build as failure

See <https://ci.centos.org/job/libvirt-go-master-check/systems=libvirt-fedora-rawhide/1063/display/redirect> ------------------------------------------ Started by upstream project "libvirt-go-master-check" build number 1063 originally caused by: Started by upstream project "libvirt-go-master-build" build number 1074 originally caused by: Started by upstream project "libvirt-master-build" build number 1471 originally caused by: Started by an SCM change Started by an SCM change [EnvInject] - Loading node environment variables. Building remotely on libvirt-fedora-rawhide (libvirt) in workspace <https://ci.centos.org/job/libvirt-go-master-check/systems=libvirt-fedora-rawhide/ws/> [libvirt-go-master] $ /bin/sh -xe /tmp/jenkins1272074372240661153.sh + export 'TEST_ARGS=-tags api' + TEST_ARGS='-tags api' + go test -tags api 2018-05-29 16:11:08.542+0000: 17976: info : libvirt version: 4.4.0 2018-05-29 16:11:08.542+0000: 17976: info : hostname: libvirt-fedora-rawhide 2018-05-29 16:11:08.542+0000: 17976: warning : virEventRegisterImpl:245 : Ignoring attempt to replace registered event loop 2018-05-29 16:11:08.542+0000: 17976: warning : virEventRegisterImpl:245 : Ignoring attempt to replace registered event loop 2018-05-29 16:11:08.542+0000: 17976: warning : virEventRegisterImpl:245 : Ignoring attempt to replace registered event loop Missing function 'virConnectBaselineHypervisorCPU' Missing function 'virConnectCompareHypervisorCPU' Missing function 'virDomainDetachDeviceAlias' --- FAIL: TestAPICoverage (0.69s) panic: Missing symbols found [recovered] panic: Missing symbols found goroutine 18 [running]: testing.tRunner.func1(0xc4200b60f0) /usr/lib/golang/src/testing/testing.go:742 +0x29d panic(0x5ad520, 0x611850) /usr/lib/golang/src/runtime/panic.go:502 +0x229 _<https://ci.centos.org/job/libvirt-go-master-check/systems=libvirt-fedora-rawhide/ws/.TestAPICoverage(0xc4200b60f0)> <https://ci.centos.org/job/libvirt-go-master-check/systems=libvirt-fedora-rawhide/ws/api_test.go>:504 +0x548 testing.tRunner(0xc4200b60f0, 0x5fc938) /usr/lib/golang/src/testing/testing.go:777 +0xd0 created by testing.(*T).Run /usr/lib/golang/src/testing/testing.go:824 +0x2e0 exit status 2 FAIL _<https://ci.centos.org/job/libvirt-go-master-check/systems=libvirt-fedora-rawhide/ws/> 1.034s Build step 'Execute shell' marked build as failure

See <https://ci.centos.org/job/libvirt-go-master-check/systems=libvirt-fedora-rawhide/1064/display/redirect> ------------------------------------------ Started by upstream project "libvirt-go-master-check" build number 1064 originally caused by: Started by upstream project "libvirt-go-master-build" build number 1075 originally caused by: Started by upstream project "libvirt-master-build" build number 1472 originally caused by: Started by an SCM change [EnvInject] - Loading node environment variables. Building remotely on libvirt-fedora-rawhide (libvirt) in workspace <https://ci.centos.org/job/libvirt-go-master-check/systems=libvirt-fedora-rawhide/ws/> [libvirt-go-master] $ /bin/sh -xe /tmp/jenkins7213057624179421836.sh + export 'TEST_ARGS=-tags api' + TEST_ARGS='-tags api' + go test -tags api 2018-05-30 10:20:20.660+0000: 9580: info : libvirt version: 4.4.0 2018-05-30 10:20:20.660+0000: 9580: info : hostname: libvirt-fedora-rawhide 2018-05-30 10:20:20.660+0000: 9580: warning : virEventRegisterImpl:245 : Ignoring attempt to replace registered event loop 2018-05-30 10:20:20.660+0000: 9580: warning : virEventRegisterImpl:245 : Ignoring attempt to replace registered event loop 2018-05-30 10:20:20.660+0000: 9580: warning : virEventRegisterImpl:245 : Ignoring attempt to replace registered event loop Missing function 'virConnectBaselineHypervisorCPU' Missing function 'virConnectCompareHypervisorCPU' Missing function 'virDomainDetachDeviceAlias' --- FAIL: TestAPICoverage (0.46s) panic: Missing symbols found [recovered] panic: Missing symbols found goroutine 19 [running]: testing.tRunner.func1(0xc4200d00f0) /usr/lib/golang/src/testing/testing.go:742 +0x29d panic(0x5ad520, 0x611850) /usr/lib/golang/src/runtime/panic.go:502 +0x229 _<https://ci.centos.org/job/libvirt-go-master-check/systems=libvirt-fedora-rawhide/ws/.TestAPICoverage(0xc4200d00f0)> <https://ci.centos.org/job/libvirt-go-master-check/systems=libvirt-fedora-rawhide/ws/api_test.go>:504 +0x548 testing.tRunner(0xc4200d00f0, 0x5fc938) /usr/lib/golang/src/testing/testing.go:777 +0xd0 created by testing.(*T).Run /usr/lib/golang/src/testing/testing.go:824 +0x2e0 exit status 2 FAIL _<https://ci.centos.org/job/libvirt-go-master-check/systems=libvirt-fedora-rawhide/ws/> 0.608s Build step 'Execute shell' marked build as failure

See <https://ci.centos.org/job/libvirt-go-master-check/systems=libvirt-fedora-rawhide/1065/display/redirect> ------------------------------------------ Started by upstream project "libvirt-go-master-check" build number 1065 originally caused by: Started by upstream project "libvirt-go-master-build" build number 1076 originally caused by: Started by upstream project "libvirt-master-build" build number 1473 originally caused by: Started by an SCM change [EnvInject] - Loading node environment variables. Building remotely on libvirt-fedora-rawhide (libvirt) in workspace <https://ci.centos.org/job/libvirt-go-master-check/systems=libvirt-fedora-rawhide/ws/> [libvirt-go-master] $ /bin/sh -xe /tmp/jenkins7007917252731734146.sh + export 'TEST_ARGS=-tags api' + TEST_ARGS='-tags api' + go test -tags api 2018-05-30 14:55:05.848+0000: 25704: info : libvirt version: 4.4.0 2018-05-30 14:55:05.848+0000: 25704: info : hostname: libvirt-fedora-rawhide 2018-05-30 14:55:05.848+0000: 25704: warning : virEventRegisterImpl:245 : Ignoring attempt to replace registered event loop 2018-05-30 14:55:05.848+0000: 25704: warning : virEventRegisterImpl:245 : Ignoring attempt to replace registered event loop 2018-05-30 14:55:05.848+0000: 25704: warning : virEventRegisterImpl:245 : Ignoring attempt to replace registered event loop Missing function 'virConnectBaselineHypervisorCPU' Missing function 'virConnectCompareHypervisorCPU' Missing function 'virDomainDetachDeviceAlias' --- FAIL: TestAPICoverage (0.86s) panic: Missing symbols found [recovered] panic: Missing symbols found goroutine 19 [running]: testing.tRunner.func1(0xc4200d00f0) /usr/lib/golang/src/testing/testing.go:742 +0x29d panic(0x5ad520, 0x611850) /usr/lib/golang/src/runtime/panic.go:502 +0x229 _<https://ci.centos.org/job/libvirt-go-master-check/systems=libvirt-fedora-rawhide/ws/.TestAPICoverage(0xc4200d00f0)> <https://ci.centos.org/job/libvirt-go-master-check/systems=libvirt-fedora-rawhide/ws/api_test.go>:504 +0x548 testing.tRunner(0xc4200d00f0, 0x5fc938) /usr/lib/golang/src/testing/testing.go:777 +0xd0 created by testing.(*T).Run /usr/lib/golang/src/testing/testing.go:824 +0x2e0 exit status 2 FAIL _<https://ci.centos.org/job/libvirt-go-master-check/systems=libvirt-fedora-rawhide/ws/> 1.049s Build step 'Execute shell' marked build as failure

See <https://ci.centos.org/job/libvirt-go-master-check/systems=libvirt-fedora-rawhide/1066/display/redirect> ------------------------------------------ Started by upstream project "libvirt-go-master-check" build number 1066 originally caused by: Started by upstream project "libvirt-go-master-build" build number 1077 originally caused by: Started by upstream project "libvirt-master-build" build number 1474 originally caused by: Started by an SCM change Started by an SCM change Started by an SCM change [EnvInject] - Loading node environment variables. Building remotely on libvirt-fedora-rawhide (libvirt) in workspace <https://ci.centos.org/job/libvirt-go-master-check/systems=libvirt-fedora-rawhide/ws/> [libvirt-go-master] $ /bin/sh -xe /tmp/jenkins3597341109079200130.sh + export 'TEST_ARGS=-tags api' + TEST_ARGS='-tags api' + go test -tags api 2018-05-30 15:58:08.737+0000: 22361: info : libvirt version: 4.4.0 2018-05-30 15:58:08.737+0000: 22361: info : hostname: libvirt-fedora-rawhide 2018-05-30 15:58:08.737+0000: 22361: warning : virEventRegisterImpl:245 : Ignoring attempt to replace registered event loop 2018-05-30 15:58:08.737+0000: 22361: warning : virEventRegisterImpl:245 : Ignoring attempt to replace registered event loop 2018-05-30 15:58:08.737+0000: 22361: warning : virEventRegisterImpl:245 : Ignoring attempt to replace registered event loop Missing function 'virConnectBaselineHypervisorCPU' Missing function 'virConnectCompareHypervisorCPU' Missing function 'virDomainDetachDeviceAlias' --- FAIL: TestAPICoverage (0.70s) panic: Missing symbols found [recovered] panic: Missing symbols found goroutine 19 [running]: testing.tRunner.func1(0xc4200d00f0) /usr/lib/golang/src/testing/testing.go:742 +0x29d panic(0x5ad520, 0x611850) /usr/lib/golang/src/runtime/panic.go:502 +0x229 _<https://ci.centos.org/job/libvirt-go-master-check/systems=libvirt-fedora-rawhide/ws/.TestAPICoverage(0xc4200d00f0)> <https://ci.centos.org/job/libvirt-go-master-check/systems=libvirt-fedora-rawhide/ws/api_test.go>:504 +0x548 testing.tRunner(0xc4200d00f0, 0x5fc938) /usr/lib/golang/src/testing/testing.go:777 +0xd0 created by testing.(*T).Run /usr/lib/golang/src/testing/testing.go:824 +0x2e0 exit status 2 FAIL _<https://ci.centos.org/job/libvirt-go-master-check/systems=libvirt-fedora-rawhide/ws/> 0.974s Build step 'Execute shell' marked build as failure

See <https://ci.centos.org/job/libvirt-go-master-check/systems=libvirt-fedora-rawhide/1067/display/redirect> ------------------------------------------ Started by upstream project "libvirt-go-master-check" build number 1067 originally caused by: Started by upstream project "libvirt-go-master-build" build number 1078 originally caused by: Started by upstream project "libvirt-master-build" build number 1475 originally caused by: Started by an SCM change [EnvInject] - Loading node environment variables. Building remotely on libvirt-fedora-rawhide (libvirt) in workspace <https://ci.centos.org/job/libvirt-go-master-check/systems=libvirt-fedora-rawhide/ws/> [libvirt-go-master] $ /bin/sh -xe /tmp/jenkins7979661912013540424.sh + export 'TEST_ARGS=-tags api' + TEST_ARGS='-tags api' + go test -tags api 2018-05-31 08:29:10.588+0000: 23644: info : libvirt version: 4.4.0 2018-05-31 08:29:10.588+0000: 23644: info : hostname: libvirt-fedora-rawhide 2018-05-31 08:29:10.588+0000: 23644: warning : virEventRegisterImpl:245 : Ignoring attempt to replace registered event loop 2018-05-31 08:29:10.588+0000: 23644: warning : virEventRegisterImpl:245 : Ignoring attempt to replace registered event loop 2018-05-31 08:29:10.588+0000: 23644: warning : virEventRegisterImpl:245 : Ignoring attempt to replace registered event loop Missing function 'virConnectBaselineHypervisorCPU' Missing function 'virConnectCompareHypervisorCPU' Missing function 'virDomainDetachDeviceAlias' --- FAIL: TestAPICoverage (1.50s) panic: Missing symbols found [recovered] panic: Missing symbols found goroutine 19 [running]: testing.tRunner.func1(0xc4200d00f0) /usr/lib/golang/src/testing/testing.go:742 +0x29d panic(0x5ad520, 0x611850) /usr/lib/golang/src/runtime/panic.go:502 +0x229 _<https://ci.centos.org/job/libvirt-go-master-check/systems=libvirt-fedora-rawhide/ws/.TestAPICoverage(0xc4200d00f0)> <https://ci.centos.org/job/libvirt-go-master-check/systems=libvirt-fedora-rawhide/ws/api_test.go>:504 +0x548 testing.tRunner(0xc4200d00f0, 0x5fc938) /usr/lib/golang/src/testing/testing.go:777 +0xd0 created by testing.(*T).Run /usr/lib/golang/src/testing/testing.go:824 +0x2e0 exit status 2 FAIL _<https://ci.centos.org/job/libvirt-go-master-check/systems=libvirt-fedora-rawhide/ws/> 2.791s Build step 'Execute shell' marked build as failure

See <https://ci.centos.org/job/libvirt-go-master-check/systems=libvirt-fedora-rawhide/1068/display/redirect> ------------------------------------------ Started by upstream project "libvirt-go-master-check" build number 1068 originally caused by: Started by upstream project "libvirt-go-master-build" build number 1079 originally caused by: Started by upstream project "libvirt-master-build" build number 1476 originally caused by: Started by an SCM change [EnvInject] - Loading node environment variables. Building remotely on libvirt-fedora-rawhide (libvirt) in workspace <https://ci.centos.org/job/libvirt-go-master-check/systems=libvirt-fedora-rawhide/ws/> [libvirt-go-master] $ /bin/sh -xe /tmp/jenkins1577930557182591873.sh + export 'TEST_ARGS=-tags api' + TEST_ARGS='-tags api' + go test -tags api 2018-05-31 10:31:08.189+0000: 19816: info : libvirt version: 4.4.0 2018-05-31 10:31:08.189+0000: 19816: info : hostname: libvirt-fedora-rawhide 2018-05-31 10:31:08.189+0000: 19816: warning : virEventRegisterImpl:245 : Ignoring attempt to replace registered event loop 2018-05-31 10:31:08.201+0000: 19816: warning : virEventRegisterImpl:245 : Ignoring attempt to replace registered event loop 2018-05-31 10:31:08.201+0000: 19816: warning : virEventRegisterImpl:245 : Ignoring attempt to replace registered event loop Missing function 'virConnectBaselineHypervisorCPU' Missing function 'virConnectCompareHypervisorCPU' Missing function 'virDomainDetachDeviceAlias' --- FAIL: TestAPICoverage (1.05s) panic: Missing symbols found [recovered] panic: Missing symbols found goroutine 19 [running]: testing.tRunner.func1(0xc4200da0f0) /usr/lib/golang/src/testing/testing.go:742 +0x29d panic(0x5ad520, 0x611850) /usr/lib/golang/src/runtime/panic.go:502 +0x229 _<https://ci.centos.org/job/libvirt-go-master-check/systems=libvirt-fedora-rawhide/ws/.TestAPICoverage(0xc4200da0f0)> <https://ci.centos.org/job/libvirt-go-master-check/systems=libvirt-fedora-rawhide/ws/api_test.go>:504 +0x548 testing.tRunner(0xc4200da0f0, 0x5fc938) /usr/lib/golang/src/testing/testing.go:777 +0xd0 created by testing.(*T).Run /usr/lib/golang/src/testing/testing.go:824 +0x2e0 exit status 2 FAIL _<https://ci.centos.org/job/libvirt-go-master-check/systems=libvirt-fedora-rawhide/ws/> 2.220s Build step 'Execute shell' marked build as failure

See <https://ci.centos.org/job/libvirt-go-master-check/systems=libvirt-fedora-rawhide/1069/display/redirect> ------------------------------------------ Started by upstream project "libvirt-go-master-check" build number 1069 originally caused by: Started by upstream project "libvirt-go-master-build" build number 1080 originally caused by: Started by upstream project "libvirt-master-build" build number 1477 originally caused by: Started by an SCM change Started by an SCM change Started by an SCM change [EnvInject] - Loading node environment variables. Building remotely on libvirt-fedora-rawhide (libvirt) in workspace <https://ci.centos.org/job/libvirt-go-master-check/systems=libvirt-fedora-rawhide/ws/> [libvirt-go-master] $ /bin/sh -xe /tmp/jenkins1331609033185671019.sh + export 'TEST_ARGS=-tags api' + TEST_ARGS='-tags api' + go test -tags api 2018-05-31 11:49:23.075+0000: 17363: info : libvirt version: 4.4.0 2018-05-31 11:49:23.075+0000: 17363: info : hostname: libvirt-fedora-rawhide 2018-05-31 11:49:23.075+0000: 17363: warning : virEventRegisterImpl:245 : Ignoring attempt to replace registered event loop 2018-05-31 11:49:23.075+0000: 17363: warning : virEventRegisterImpl:245 : Ignoring attempt to replace registered event loop 2018-05-31 11:49:23.075+0000: 17363: warning : virEventRegisterImpl:245 : Ignoring attempt to replace registered event loop Missing function 'virConnectBaselineHypervisorCPU' Missing function 'virConnectCompareHypervisorCPU' Missing function 'virDomainDetachDeviceAlias' --- FAIL: TestAPICoverage (0.78s) panic: Missing symbols found [recovered] panic: Missing symbols found goroutine 19 [running]: testing.tRunner.func1(0xc4200d00f0) /usr/lib/golang/src/testing/testing.go:742 +0x29d panic(0x5ad520, 0x611850) /usr/lib/golang/src/runtime/panic.go:502 +0x229 _<https://ci.centos.org/job/libvirt-go-master-check/systems=libvirt-fedora-rawhide/ws/.TestAPICoverage(0xc4200d00f0)> <https://ci.centos.org/job/libvirt-go-master-check/systems=libvirt-fedora-rawhide/ws/api_test.go>:504 +0x548 testing.tRunner(0xc4200d00f0, 0x5fc938) /usr/lib/golang/src/testing/testing.go:777 +0xd0 created by testing.(*T).Run /usr/lib/golang/src/testing/testing.go:824 +0x2e0 exit status 2 FAIL _<https://ci.centos.org/job/libvirt-go-master-check/systems=libvirt-fedora-rawhide/ws/> 1.047s Build step 'Execute shell' marked build as failure

See <https://ci.centos.org/job/libvirt-go-master-check/systems=libvirt-fedora-rawhide/1070/display/redirect> ------------------------------------------ Started by upstream project "libvirt-go-master-check" build number 1070 originally caused by: Started by upstream project "libvirt-go-master-build" build number 1081 originally caused by: Started by upstream project "libvirt-master-build" build number 1478 originally caused by: Started by an SCM change [EnvInject] - Loading node environment variables. Building remotely on libvirt-fedora-rawhide (libvirt) in workspace <https://ci.centos.org/job/libvirt-go-master-check/systems=libvirt-fedora-rawhide/ws/> [libvirt-go-master] $ /bin/sh -xe /tmp/jenkins8256987456024812094.sh + export 'TEST_ARGS=-tags api' + TEST_ARGS='-tags api' + go test -tags api 2018-05-31 14:19:51.880+0000: 20043: info : libvirt version: 4.4.0 2018-05-31 14:19:51.880+0000: 20043: info : hostname: libvirt-fedora-rawhide 2018-05-31 14:19:51.880+0000: 20043: warning : virEventRegisterImpl:245 : Ignoring attempt to replace registered event loop 2018-05-31 14:19:51.880+0000: 20043: warning : virEventRegisterImpl:245 : Ignoring attempt to replace registered event loop 2018-05-31 14:19:51.880+0000: 20043: warning : virEventRegisterImpl:245 : Ignoring attempt to replace registered event loop Missing function 'virConnectBaselineHypervisorCPU' Missing function 'virConnectCompareHypervisorCPU' Missing function 'virDomainDetachDeviceAlias' --- FAIL: TestAPICoverage (0.69s) panic: Missing symbols found [recovered] panic: Missing symbols found goroutine 34 [running]: testing.tRunner.func1(0xc4200dc0f0) /usr/lib/golang/src/testing/testing.go:742 +0x29d panic(0x5ad520, 0x611850) /usr/lib/golang/src/runtime/panic.go:502 +0x229 _<https://ci.centos.org/job/libvirt-go-master-check/systems=libvirt-fedora-rawhide/ws/.TestAPICoverage(0xc4200dc0f0)> <https://ci.centos.org/job/libvirt-go-master-check/systems=libvirt-fedora-rawhide/ws/api_test.go>:504 +0x548 testing.tRunner(0xc4200dc0f0, 0x5fc938) /usr/lib/golang/src/testing/testing.go:777 +0xd0 created by testing.(*T).Run /usr/lib/golang/src/testing/testing.go:824 +0x2e0 exit status 2 FAIL _<https://ci.centos.org/job/libvirt-go-master-check/systems=libvirt-fedora-rawhide/ws/> 0.925s Build step 'Execute shell' marked build as failure

See <https://ci.centos.org/job/libvirt-go-master-check/systems=libvirt-fedora-rawhide/1071/display/redirect> ------------------------------------------ Started by upstream project "libvirt-go-master-check" build number 1071 originally caused by: Started by upstream project "libvirt-go-master-build" build number 1082 originally caused by: Started by upstream project "libvirt-master-build" build number 1479 originally caused by: Started by an SCM change [EnvInject] - Loading node environment variables. Building remotely on libvirt-fedora-rawhide (libvirt) in workspace <https://ci.centos.org/job/libvirt-go-master-check/systems=libvirt-fedora-rawhide/ws/> [libvirt-go-master] $ /bin/sh -xe /tmp/jenkins9175450745642746858.sh + export 'TEST_ARGS=-tags api' + TEST_ARGS='-tags api' + go test -tags api 2018-05-31 15:47:45.269+0000: 14963: info : libvirt version: 4.4.0 2018-05-31 15:47:45.269+0000: 14963: info : hostname: libvirt-fedora-rawhide 2018-05-31 15:47:45.269+0000: 14963: warning : virEventRegisterImpl:245 : Ignoring attempt to replace registered event loop 2018-05-31 15:47:45.269+0000: 14963: warning : virEventRegisterImpl:245 : Ignoring attempt to replace registered event loop 2018-05-31 15:47:45.269+0000: 14963: warning : virEventRegisterImpl:245 : Ignoring attempt to replace registered event loop Missing function 'virConnectBaselineHypervisorCPU' Missing function 'virConnectCompareHypervisorCPU' Missing function 'virDomainDetachDeviceAlias' --- FAIL: TestAPICoverage (0.81s) panic: Missing symbols found [recovered] panic: Missing symbols found goroutine 19 [running]: testing.tRunner.func1(0xc4200d00f0) /usr/lib/golang/src/testing/testing.go:742 +0x29d panic(0x5ad520, 0x611850) /usr/lib/golang/src/runtime/panic.go:502 +0x229 _<https://ci.centos.org/job/libvirt-go-master-check/systems=libvirt-fedora-rawhide/ws/.TestAPICoverage(0xc4200d00f0)> <https://ci.centos.org/job/libvirt-go-master-check/systems=libvirt-fedora-rawhide/ws/api_test.go>:504 +0x548 testing.tRunner(0xc4200d00f0, 0x5fc938) /usr/lib/golang/src/testing/testing.go:777 +0xd0 created by testing.(*T).Run /usr/lib/golang/src/testing/testing.go:824 +0x2e0 exit status 2 FAIL _<https://ci.centos.org/job/libvirt-go-master-check/systems=libvirt-fedora-rawhide/ws/> 1.102s Build step 'Execute shell' marked build as failure

See <https://ci.centos.org/job/libvirt-go-master-check/systems=libvirt-fedora-rawhide/1072/display/redirect> ------------------------------------------ Started by upstream project "libvirt-go-master-check" build number 1072 originally caused by: Started by upstream project "libvirt-go-master-build" build number 1083 originally caused by: Started by upstream project "libvirt-master-build" build number 1480 originally caused by: Started by an SCM change [EnvInject] - Loading node environment variables. Building remotely on libvirt-fedora-rawhide (libvirt) in workspace <https://ci.centos.org/job/libvirt-go-master-check/systems=libvirt-fedora-rawhide/ws/> [libvirt-go-master] $ /bin/sh -xe /tmp/jenkins6420820448452806344.sh + export 'TEST_ARGS=-tags api' + TEST_ARGS='-tags api' + go test -tags api 2018-06-01 12:39:47.389+0000: 17127: info : libvirt version: 4.4.0 2018-06-01 12:39:47.389+0000: 17127: info : hostname: libvirt-fedora-rawhide 2018-06-01 12:39:47.389+0000: 17127: warning : virEventRegisterImpl:245 : Ignoring attempt to replace registered event loop 2018-06-01 12:39:47.389+0000: 17127: warning : virEventRegisterImpl:245 : Ignoring attempt to replace registered event loop 2018-06-01 12:39:47.389+0000: 17127: warning : virEventRegisterImpl:245 : Ignoring attempt to replace registered event loop Missing function 'virConnectBaselineHypervisorCPU' Missing function 'virConnectCompareHypervisorCPU' Missing function 'virDomainDetachDeviceAlias' --- FAIL: TestAPICoverage (0.92s) panic: Missing symbols found [recovered] panic: Missing symbols found goroutine 5 [running]: testing.tRunner.func1(0xc4200aa0f0) /usr/lib/golang/src/testing/testing.go:742 +0x29d panic(0x5ad520, 0x611850) /usr/lib/golang/src/runtime/panic.go:502 +0x229 _<https://ci.centos.org/job/libvirt-go-master-check/systems=libvirt-fedora-rawhide/ws/.TestAPICoverage(0xc4200aa0f0)> <https://ci.centos.org/job/libvirt-go-master-check/systems=libvirt-fedora-rawhide/ws/api_test.go>:504 +0x548 testing.tRunner(0xc4200aa0f0, 0x5fc938) /usr/lib/golang/src/testing/testing.go:777 +0xd0 created by testing.(*T).Run /usr/lib/golang/src/testing/testing.go:824 +0x2e0 exit status 2 FAIL _<https://ci.centos.org/job/libvirt-go-master-check/systems=libvirt-fedora-rawhide/ws/> 1.140s Build step 'Execute shell' marked build as failure

See <https://ci.centos.org/job/libvirt-go-master-check/systems=libvirt-fedora-rawhide/1073/display/redirect> ------------------------------------------ Started by upstream project "libvirt-go-master-check" build number 1073 originally caused by: Started by upstream project "libvirt-go-master-build" build number 1084 originally caused by: Started by upstream project "libvirt-master-build" build number 1481 originally caused by: Started by an SCM change Started by an SCM change [EnvInject] - Loading node environment variables. Building remotely on libvirt-fedora-rawhide (libvirt) in workspace <https://ci.centos.org/job/libvirt-go-master-check/systems=libvirt-fedora-rawhide/ws/> [libvirt-go-master] $ /bin/sh -xe /tmp/jenkins8771435987883890525.sh + export 'TEST_ARGS=-tags api' + TEST_ARGS='-tags api' + go test -tags api 2018-06-01 13:59:32.395+0000: 9972: info : libvirt version: 4.4.0 2018-06-01 13:59:32.395+0000: 9972: info : hostname: libvirt-fedora-rawhide 2018-06-01 13:59:32.395+0000: 9972: warning : virEventRegisterImpl:245 : Ignoring attempt to replace registered event loop 2018-06-01 13:59:32.395+0000: 9972: warning : virEventRegisterImpl:245 : Ignoring attempt to replace registered event loop 2018-06-01 13:59:32.395+0000: 9972: warning : virEventRegisterImpl:245 : Ignoring attempt to replace registered event loop Missing function 'virConnectBaselineHypervisorCPU' Missing function 'virConnectCompareHypervisorCPU' Missing function 'virDomainDetachDeviceAlias' --- FAIL: TestAPICoverage (0.96s) panic: Missing symbols found [recovered] panic: Missing symbols found goroutine 5 [running]: testing.tRunner.func1(0xc4200aa0f0) /usr/lib/golang/src/testing/testing.go:742 +0x29d panic(0x5ad520, 0x611850) /usr/lib/golang/src/runtime/panic.go:502 +0x229 _<https://ci.centos.org/job/libvirt-go-master-check/systems=libvirt-fedora-rawhide/ws/.TestAPICoverage(0xc4200aa0f0)> <https://ci.centos.org/job/libvirt-go-master-check/systems=libvirt-fedora-rawhide/ws/api_test.go>:504 +0x548 testing.tRunner(0xc4200aa0f0, 0x5fc938) /usr/lib/golang/src/testing/testing.go:777 +0xd0 created by testing.(*T).Run /usr/lib/golang/src/testing/testing.go:824 +0x2e0 exit status 2 FAIL _<https://ci.centos.org/job/libvirt-go-master-check/systems=libvirt-fedora-rawhide/ws/> 1.265s Build step 'Execute shell' marked build as failure

See <https://ci.centos.org/job/libvirt-go-master-check/systems=libvirt-fedora-rawhide/1074/display/redirect> ------------------------------------------ Started by upstream project "libvirt-go-master-check" build number 1074 originally caused by: Started by upstream project "libvirt-go-master-build" build number 1085 originally caused by: Started by upstream project "libvirt-master-build" build number 1482 originally caused by: Started by an SCM change [EnvInject] - Loading node environment variables. Building remotely on libvirt-fedora-rawhide (libvirt) in workspace <https://ci.centos.org/job/libvirt-go-master-check/systems=libvirt-fedora-rawhide/ws/> [libvirt-go-master] $ /bin/sh -xe /tmp/jenkins5551040945112592324.sh + export 'TEST_ARGS=-tags api' + TEST_ARGS='-tags api' + go test -tags api 2018-06-01 16:33:10.753+0000: 17166: info : libvirt version: 4.4.0 2018-06-01 16:33:10.753+0000: 17166: info : hostname: libvirt-fedora-rawhide 2018-06-01 16:33:10.753+0000: 17166: warning : virEventRegisterImpl:245 : Ignoring attempt to replace registered event loop 2018-06-01 16:33:10.756+0000: 17166: warning : virEventRegisterImpl:245 : Ignoring attempt to replace registered event loop 2018-06-01 16:33:10.756+0000: 17166: warning : virEventRegisterImpl:245 : Ignoring attempt to replace registered event loop Missing function 'virConnectBaselineHypervisorCPU' Missing function 'virConnectCompareHypervisorCPU' Missing function 'virDomainDetachDeviceAlias' --- FAIL: TestAPICoverage (1.21s) panic: Missing symbols found [recovered] panic: Missing symbols found goroutine 4 [running]: testing.tRunner.func1(0xc4200d20f0) /usr/lib/golang/src/testing/testing.go:742 +0x29d panic(0x5ad520, 0x611850) /usr/lib/golang/src/runtime/panic.go:502 +0x229 _<https://ci.centos.org/job/libvirt-go-master-check/systems=libvirt-fedora-rawhide/ws/.TestAPICoverage(0xc4200d20f0)> <https://ci.centos.org/job/libvirt-go-master-check/systems=libvirt-fedora-rawhide/ws/api_test.go>:504 +0x548 testing.tRunner(0xc4200d20f0, 0x5fc938) /usr/lib/golang/src/testing/testing.go:777 +0xd0 created by testing.(*T).Run /usr/lib/golang/src/testing/testing.go:824 +0x2e0 exit status 2 FAIL _<https://ci.centos.org/job/libvirt-go-master-check/systems=libvirt-fedora-rawhide/ws/> 2.169s Build step 'Execute shell' marked build as failure

participants (1)
-
ci@centos.org