[Libvirt-ci] Build failed in Jenkins: libvirt-go-check » libvirt-fedora-rawhide #289

See <https://ci.centos.org/job/libvirt-go-check/systems=libvirt-fedora-rawhide/289/display/redirect> ------------------------------------------ Started by upstream project "libvirt-go-check" build number 289 originally caused by: Started by upstream project "libvirt-go-build" build number 293 originally caused by: Started by upstream project "libvirt-build" build number 360 originally caused by: Started by an SCM change [EnvInject] - Loading node environment variables. Building remotely on libvirt-fedora-rawhide (libvirt) in workspace <https://ci.centos.org/job/libvirt-go-check/systems=libvirt-fedora-rawhide/ws/> [libvirt-go] $ /bin/sh -xe /tmp/jenkins8603788292733317634.sh + export 'TEST_ARGS=-tags api' + TEST_ARGS='-tags api' + go test -tags api Missing function 'virConnectGetStoragePoolCapabilities' --- FAIL: TestAPICoverage (1.57s) panic: Missing symbols found [recovered] panic: Missing symbols found goroutine 19 [running]: testing.tRunner.func1(0xc0000c2100) /usr/lib/golang/src/testing/testing.go:827 +0x388 panic(0x5cd4e0, 0x642bb0) /usr/lib/golang/src/runtime/panic.go:522 +0x1b5 _<https://ci.centos.org/job/libvirt-go-check/systems=libvirt-fedora-rawhide/ws/.TestAPICoverage(0xc0000c2100)> <https://ci.centos.org/job/libvirt-go-check/systems=libvirt-fedora-rawhide/ws/api_test.go>:501 +0x551 testing.tRunner(0xc0000c2100, 0x61d0d8) /usr/lib/golang/src/testing/testing.go:862 +0xc0 created by testing.(*T).Run /usr/lib/golang/src/testing/testing.go:913 +0x357 exit status 2 FAIL _<https://ci.centos.org/job/libvirt-go-check/systems=libvirt-fedora-rawhide/ws/> 2.042s Build step 'Execute shell' marked build as failure

See <https://ci.centos.org/job/libvirt-go-check/systems=libvirt-fedora-rawhide/290/display/redirect> ------------------------------------------ Started by upstream project "libvirt-go-check" build number 290 originally caused by: Started by upstream project "libvirt-go-build" build number 294 originally caused by: Started by upstream project "libvirt-build" build number 361 originally caused by: Started by an SCM change Started by an SCM change Started by an SCM change Started by an SCM change Started by an SCM change Started by an SCM change Started by an SCM change Started by an SCM change Started by an SCM change Started by an SCM change Started by an SCM change Started by an SCM change Started by an SCM change Started by an SCM change Started by an SCM change Started by an SCM change Started by an SCM change Started by an SCM change [EnvInject] - Loading node environment variables. Building remotely on libvirt-fedora-rawhide (libvirt) in workspace <https://ci.centos.org/job/libvirt-go-check/systems=libvirt-fedora-rawhide/ws/> [libvirt-go] $ /bin/sh -xe /tmp/jenkins203123529878279601.sh + export 'TEST_ARGS=-tags api' + TEST_ARGS='-tags api' + go test -tags api Missing function 'virConnectGetStoragePoolCapabilities' --- FAIL: TestAPICoverage (1.89s) panic: Missing symbols found [recovered] panic: Missing symbols found goroutine 5 [running]: testing.tRunner.func1(0xc0000aa100) /usr/lib/golang/src/testing/testing.go:827 +0x388 panic(0x5cd4e0, 0x642bb0) /usr/lib/golang/src/runtime/panic.go:522 +0x1b5 _<https://ci.centos.org/job/libvirt-go-check/systems=libvirt-fedora-rawhide/ws/.TestAPICoverage(0xc0000aa100)> <https://ci.centos.org/job/libvirt-go-check/systems=libvirt-fedora-rawhide/ws/api_test.go>:501 +0x551 testing.tRunner(0xc0000aa100, 0x61d0d8) /usr/lib/golang/src/testing/testing.go:862 +0xc0 created by testing.(*T).Run /usr/lib/golang/src/testing/testing.go:913 +0x357 exit status 2 FAIL _<https://ci.centos.org/job/libvirt-go-check/systems=libvirt-fedora-rawhide/ws/> 2.738s Build step 'Execute shell' marked build as failure

See <https://ci.centos.org/job/libvirt-go-check/systems=libvirt-fedora-rawhide/291/display/redirect> ------------------------------------------ Started by upstream project "libvirt-go-check" build number 291 originally caused by: Started by upstream project "libvirt-go-build" build number 295 originally caused by: Started by upstream project "libvirt-build" build number 362 originally caused by: Started by an SCM change Started by an SCM change Started by an SCM change Started by an SCM change Started by an SCM change Started by an SCM change Started by an SCM change Started by an SCM change Started by an SCM change Started by an SCM change Started by an SCM change Started by an SCM change Started by an SCM change Started by an SCM change Started by an SCM change Started by an SCM change [EnvInject] - Loading node environment variables. Building remotely on libvirt-fedora-rawhide (libvirt) in workspace <https://ci.centos.org/job/libvirt-go-check/systems=libvirt-fedora-rawhide/ws/> [libvirt-go] $ /bin/sh -xe /tmp/jenkins5874169747358738025.sh + export 'TEST_ARGS=-tags api' + TEST_ARGS='-tags api' + go test -tags api Missing function 'virConnectGetStoragePoolCapabilities' --- FAIL: TestAPICoverage (0.80s) panic: Missing symbols found [recovered] panic: Missing symbols found goroutine 5 [running]: testing.tRunner.func1(0xc0000aa100) /usr/lib/golang/src/testing/testing.go:827 +0x388 panic(0x5cd4e0, 0x642bb0) /usr/lib/golang/src/runtime/panic.go:522 +0x1b5 _<https://ci.centos.org/job/libvirt-go-check/systems=libvirt-fedora-rawhide/ws/.TestAPICoverage(0xc0000aa100)> <https://ci.centos.org/job/libvirt-go-check/systems=libvirt-fedora-rawhide/ws/api_test.go>:501 +0x551 testing.tRunner(0xc0000aa100, 0x61d0d8) /usr/lib/golang/src/testing/testing.go:862 +0xc0 created by testing.(*T).Run /usr/lib/golang/src/testing/testing.go:913 +0x357 exit status 2 FAIL _<https://ci.centos.org/job/libvirt-go-check/systems=libvirt-fedora-rawhide/ws/> 1.142s Build step 'Execute shell' marked build as failure

See <https://ci.centos.org/job/libvirt-go-check/systems=libvirt-fedora-rawhide/292/display/redirect> ------------------------------------------ Started by upstream project "libvirt-go-check" build number 292 originally caused by: Started by upstream project "libvirt-go-build" build number 296 originally caused by: Started by upstream project "libvirt-build" build number 363 originally caused by: Started by an SCM change Started by an SCM change Started by an SCM change Started by an SCM change Started by an SCM change Started by an SCM change Started by an SCM change Started by an SCM change Started by an SCM change Started by an SCM change [EnvInject] - Loading node environment variables. Building remotely on libvirt-fedora-rawhide (libvirt) in workspace <https://ci.centos.org/job/libvirt-go-check/systems=libvirt-fedora-rawhide/ws/> [libvirt-go] $ /bin/sh -xe /tmp/jenkins7071518321795428343.sh + export 'TEST_ARGS=-tags api' + TEST_ARGS='-tags api' + go test -tags api Missing function 'virConnectGetStoragePoolCapabilities' --- FAIL: TestAPICoverage (1.44s) panic: Missing symbols found [recovered] panic: Missing symbols found goroutine 5 [running]: testing.tRunner.func1(0xc0000aa100) /usr/lib/golang/src/testing/testing.go:827 +0x388 panic(0x5cd4e0, 0x642bb0) /usr/lib/golang/src/runtime/panic.go:522 +0x1b5 _<https://ci.centos.org/job/libvirt-go-check/systems=libvirt-fedora-rawhide/ws/.TestAPICoverage(0xc0000aa100)> <https://ci.centos.org/job/libvirt-go-check/systems=libvirt-fedora-rawhide/ws/api_test.go>:501 +0x551 testing.tRunner(0xc0000aa100, 0x61d0d8) /usr/lib/golang/src/testing/testing.go:862 +0xc0 created by testing.(*T).Run /usr/lib/golang/src/testing/testing.go:913 +0x357 exit status 2 FAIL _<https://ci.centos.org/job/libvirt-go-check/systems=libvirt-fedora-rawhide/ws/> 2.210s Build step 'Execute shell' marked build as failure

See <https://ci.centos.org/job/libvirt-go-check/systems=libvirt-fedora-rawhide/293/display/redirect> ------------------------------------------ Started by upstream project "libvirt-go-check" build number 293 originally caused by: Started by upstream project "libvirt-go-build" build number 297 originally caused by: Started by upstream project "libvirt-build" build number 364 originally caused by: Started by an SCM change [EnvInject] - Loading node environment variables. Building remotely on libvirt-fedora-rawhide (libvirt) in workspace <https://ci.centos.org/job/libvirt-go-check/systems=libvirt-fedora-rawhide/ws/> [libvirt-go] $ /bin/sh -xe /tmp/jenkins7505960283493575453.sh + export 'TEST_ARGS=-tags api' + TEST_ARGS='-tags api' + go test -tags api Missing function 'virConnectGetStoragePoolCapabilities' --- FAIL: TestAPICoverage (1.05s) panic: Missing symbols found [recovered] panic: Missing symbols found goroutine 19 [running]: testing.tRunner.func1(0xc0000c2100) /usr/lib/golang/src/testing/testing.go:827 +0x388 panic(0x5cd4e0, 0x642bb0) /usr/lib/golang/src/runtime/panic.go:522 +0x1b5 _<https://ci.centos.org/job/libvirt-go-check/systems=libvirt-fedora-rawhide/ws/.TestAPICoverage(0xc0000c2100)> <https://ci.centos.org/job/libvirt-go-check/systems=libvirt-fedora-rawhide/ws/api_test.go>:501 +0x551 testing.tRunner(0xc0000c2100, 0x61d0d8) /usr/lib/golang/src/testing/testing.go:862 +0xc0 created by testing.(*T).Run /usr/lib/golang/src/testing/testing.go:913 +0x357 exit status 2 FAIL _<https://ci.centos.org/job/libvirt-go-check/systems=libvirt-fedora-rawhide/ws/> 1.363s Build step 'Execute shell' marked build as failure

See <https://ci.centos.org/job/libvirt-go-check/systems=libvirt-fedora-rawhide/294/display/redirect> ------------------------------------------ Started by upstream project "libvirt-go-check" build number 294 originally caused by: Started by upstream project "libvirt-go-build" build number 298 originally caused by: Started by upstream project "libvirt-build" build number 365 originally caused by: Started by an SCM change [EnvInject] - Loading node environment variables. Building remotely on libvirt-fedora-rawhide (libvirt) in workspace <https://ci.centos.org/job/libvirt-go-check/systems=libvirt-fedora-rawhide/ws/> [libvirt-go] $ /bin/sh -xe /tmp/jenkins6104856504848126736.sh + export 'TEST_ARGS=-tags api' + TEST_ARGS='-tags api' + go test -tags api Missing function 'virConnectGetStoragePoolCapabilities' --- FAIL: TestAPICoverage (0.43s) panic: Missing symbols found [recovered] panic: Missing symbols found goroutine 19 [running]: testing.tRunner.func1(0xc0000c2100) /usr/lib/golang/src/testing/testing.go:827 +0x388 panic(0x5cd4e0, 0x642bb0) /usr/lib/golang/src/runtime/panic.go:522 +0x1b5 _<https://ci.centos.org/job/libvirt-go-check/systems=libvirt-fedora-rawhide/ws/.TestAPICoverage(0xc0000c2100)> <https://ci.centos.org/job/libvirt-go-check/systems=libvirt-fedora-rawhide/ws/api_test.go>:501 +0x551 testing.tRunner(0xc0000c2100, 0x61d0d8) /usr/lib/golang/src/testing/testing.go:862 +0xc0 created by testing.(*T).Run /usr/lib/golang/src/testing/testing.go:913 +0x357 exit status 2 FAIL _<https://ci.centos.org/job/libvirt-go-check/systems=libvirt-fedora-rawhide/ws/> 0.608s Build step 'Execute shell' marked build as failure

See <https://ci.centos.org/job/libvirt-go-check/systems=libvirt-fedora-rawhide/295/display/redirect> ------------------------------------------ Started by upstream project "libvirt-go-check" build number 295 originally caused by: Started by upstream project "libvirt-go-build" build number 299 originally caused by: Started by upstream project "libvirt-build" build number 366 originally caused by: Started by an SCM change [EnvInject] - Loading node environment variables. Building remotely on libvirt-fedora-rawhide (libvirt) in workspace <https://ci.centos.org/job/libvirt-go-check/systems=libvirt-fedora-rawhide/ws/> [libvirt-go] $ /bin/sh -xe /tmp/jenkins5344209585278062714.sh + export 'TEST_ARGS=-tags api' + TEST_ARGS='-tags api' + go test -tags api Missing function 'virConnectGetStoragePoolCapabilities' --- FAIL: TestAPICoverage (0.73s) panic: Missing symbols found [recovered] panic: Missing symbols found goroutine 5 [running]: testing.tRunner.func1(0xc0000aa100) /usr/lib/golang/src/testing/testing.go:827 +0x388 panic(0x5cd4e0, 0x642bb0) /usr/lib/golang/src/runtime/panic.go:522 +0x1b5 _<https://ci.centos.org/job/libvirt-go-check/systems=libvirt-fedora-rawhide/ws/.TestAPICoverage(0xc0000aa100)> <https://ci.centos.org/job/libvirt-go-check/systems=libvirt-fedora-rawhide/ws/api_test.go>:501 +0x551 testing.tRunner(0xc0000aa100, 0x61d0d8) /usr/lib/golang/src/testing/testing.go:862 +0xc0 created by testing.(*T).Run /usr/lib/golang/src/testing/testing.go:913 +0x357 exit status 2 FAIL _<https://ci.centos.org/job/libvirt-go-check/systems=libvirt-fedora-rawhide/ws/> 0.969s Build step 'Execute shell' marked build as failure

See <https://ci.centos.org/job/libvirt-go-check/systems=libvirt-fedora-rawhide/296/display/redirect> ------------------------------------------ Started by upstream project "libvirt-go-check" build number 296 originally caused by: Started by upstream project "libvirt-go-build" build number 300 originally caused by: Started by upstream project "libvirt-build" build number 367 originally caused by: Started by an SCM change [EnvInject] - Loading node environment variables. Building remotely on libvirt-fedora-rawhide (libvirt) in workspace <https://ci.centos.org/job/libvirt-go-check/systems=libvirt-fedora-rawhide/ws/> [libvirt-go] $ /bin/sh -xe /tmp/jenkins5935667781447927761.sh + export 'TEST_ARGS=-tags api' + TEST_ARGS='-tags api' + go test -tags api Missing function 'virConnectGetStoragePoolCapabilities' --- FAIL: TestAPICoverage (1.92s) panic: Missing symbols found [recovered] panic: Missing symbols found goroutine 5 [running]: testing.tRunner.func1(0xc0000aa100) /usr/lib/golang/src/testing/testing.go:827 +0x388 panic(0x5cd4e0, 0x642bb0) /usr/lib/golang/src/runtime/panic.go:522 +0x1b5 _<https://ci.centos.org/job/libvirt-go-check/systems=libvirt-fedora-rawhide/ws/.TestAPICoverage(0xc0000aa100)> <https://ci.centos.org/job/libvirt-go-check/systems=libvirt-fedora-rawhide/ws/api_test.go>:501 +0x551 testing.tRunner(0xc0000aa100, 0x61d0d8) /usr/lib/golang/src/testing/testing.go:862 +0xc0 created by testing.(*T).Run /usr/lib/golang/src/testing/testing.go:913 +0x357 exit status 2 FAIL _<https://ci.centos.org/job/libvirt-go-check/systems=libvirt-fedora-rawhide/ws/> 2.790s Build step 'Execute shell' marked build as failure

See <https://ci.centos.org/job/libvirt-go-check/systems=libvirt-fedora-rawhide/297/display/redirect> ------------------------------------------ Started by upstream project "libvirt-go-check" build number 297 originally caused by: Started by upstream project "libvirt-go-build" build number 301 originally caused by: Started by upstream project "libvirt-build" build number 368 originally caused by: Started by an SCM change Started by an SCM change Started by an SCM change Started by an SCM change Started by an SCM change [EnvInject] - Loading node environment variables. Building remotely on libvirt-fedora-rawhide (libvirt) in workspace <https://ci.centos.org/job/libvirt-go-check/systems=libvirt-fedora-rawhide/ws/> [libvirt-go] $ /bin/sh -xe /tmp/jenkins4371417786931192629.sh + export 'TEST_ARGS=-tags api' + TEST_ARGS='-tags api' + go test -tags api Missing function 'virConnectGetStoragePoolCapabilities' --- FAIL: TestAPICoverage (1.84s) panic: Missing symbols found [recovered] panic: Missing symbols found goroutine 19 [running]: testing.tRunner.func1(0xc0000c2100) /usr/lib/golang/src/testing/testing.go:827 +0x388 panic(0x5cd4e0, 0x642bb0) /usr/lib/golang/src/runtime/panic.go:522 +0x1b5 _<https://ci.centos.org/job/libvirt-go-check/systems=libvirt-fedora-rawhide/ws/.TestAPICoverage(0xc0000c2100)> <https://ci.centos.org/job/libvirt-go-check/systems=libvirt-fedora-rawhide/ws/api_test.go>:501 +0x551 testing.tRunner(0xc0000c2100, 0x61d0d8) /usr/lib/golang/src/testing/testing.go:862 +0xc0 created by testing.(*T).Run /usr/lib/golang/src/testing/testing.go:913 +0x357 exit status 2 FAIL _<https://ci.centos.org/job/libvirt-go-check/systems=libvirt-fedora-rawhide/ws/> 2.581s Build step 'Execute shell' marked build as failure

See <https://ci.centos.org/job/libvirt-go-check/systems=libvirt-fedora-rawhide/298/display/redirect> ------------------------------------------ Started by upstream project "libvirt-go-check" build number 298 originally caused by: Started by upstream project "libvirt-go-build" build number 302 originally caused by: Started by upstream project "libvirt-build" build number 370 originally caused by: Started by an SCM change Started by an SCM change Started by an SCM change Started by an SCM change [EnvInject] - Loading node environment variables. Building remotely on libvirt-fedora-rawhide (libvirt) in workspace <https://ci.centos.org/job/libvirt-go-check/systems=libvirt-fedora-rawhide/ws/> [libvirt-go] $ /bin/sh -xe /tmp/jenkins982384174256787427.sh + export 'TEST_ARGS=-tags api' + TEST_ARGS='-tags api' + go test -tags api Missing function 'virConnectGetStoragePoolCapabilities' --- FAIL: TestAPICoverage (0.67s) panic: Missing symbols found [recovered] panic: Missing symbols found goroutine 19 [running]: testing.tRunner.func1(0xc0000c2100) /usr/lib/golang/src/testing/testing.go:830 +0x388 panic(0x5ce540, 0x643eb0) /usr/lib/golang/src/runtime/panic.go:522 +0x1b5 _<https://ci.centos.org/job/libvirt-go-check/systems=libvirt-fedora-rawhide/ws/.TestAPICoverage(0xc0000c2100)> <https://ci.centos.org/job/libvirt-go-check/systems=libvirt-fedora-rawhide/ws/api_test.go>:501 +0x551 testing.tRunner(0xc0000c2100, 0x61e320) /usr/lib/golang/src/testing/testing.go:865 +0xc0 created by testing.(*T).Run /usr/lib/golang/src/testing/testing.go:916 +0x357 exit status 2 FAIL _<https://ci.centos.org/job/libvirt-go-check/systems=libvirt-fedora-rawhide/ws/> 1.005s Build step 'Execute shell' marked build as failure

See <https://ci.centos.org/job/libvirt-go-check/systems=libvirt-fedora-rawhide/299/display/redirect> ------------------------------------------ Started by upstream project "libvirt-go-check" build number 299 originally caused by: Started by upstream project "libvirt-go-build" build number 303 originally caused by: Started by upstream project "libvirt-build" build number 371 originally caused by: Started by an SCM change [EnvInject] - Loading node environment variables. Building remotely on libvirt-fedora-rawhide (libvirt) in workspace <https://ci.centos.org/job/libvirt-go-check/systems=libvirt-fedora-rawhide/ws/> [libvirt-go] $ /bin/sh -xe /tmp/jenkins1965671219774707577.sh + export 'TEST_ARGS=-tags api' + TEST_ARGS='-tags api' + go test -tags api Missing function 'virConnectGetStoragePoolCapabilities' --- FAIL: TestAPICoverage (2.11s) panic: Missing symbols found [recovered] panic: Missing symbols found goroutine 4 [running]: testing.tRunner.func1(0xc0000c4100) /usr/lib/golang/src/testing/testing.go:830 +0x388 panic(0x5ce540, 0x643eb0) /usr/lib/golang/src/runtime/panic.go:522 +0x1b5 _<https://ci.centos.org/job/libvirt-go-check/systems=libvirt-fedora-rawhide/ws/.TestAPICoverage(0xc0000c4100)> <https://ci.centos.org/job/libvirt-go-check/systems=libvirt-fedora-rawhide/ws/api_test.go>:501 +0x551 testing.tRunner(0xc0000c4100, 0x61e320) /usr/lib/golang/src/testing/testing.go:865 +0xc0 created by testing.(*T).Run /usr/lib/golang/src/testing/testing.go:916 +0x357 exit status 2 FAIL _<https://ci.centos.org/job/libvirt-go-check/systems=libvirt-fedora-rawhide/ws/> 3.122s Build step 'Execute shell' marked build as failure

See <https://ci.centos.org/job/libvirt-go-check/systems=libvirt-fedora-rawhide/300/display/redirect> ------------------------------------------ Started by upstream project "libvirt-go-check" build number 300 originally caused by: Started by upstream project "libvirt-go-build" build number 304 originally caused by: Started by upstream project "libvirt-build" build number 372 originally caused by: Started by an SCM change [EnvInject] - Loading node environment variables. Building remotely on libvirt-fedora-rawhide (libvirt) in workspace <https://ci.centos.org/job/libvirt-go-check/systems=libvirt-fedora-rawhide/ws/> [libvirt-go] $ /bin/sh -xe /tmp/jenkins352003744692388291.sh + export 'TEST_ARGS=-tags api' + TEST_ARGS='-tags api' + go test -tags api Missing function 'virConnectGetStoragePoolCapabilities' --- FAIL: TestAPICoverage (1.36s) panic: Missing symbols found [recovered] panic: Missing symbols found goroutine 5 [running]: testing.tRunner.func1(0xc0000aa100) /usr/lib/golang/src/testing/testing.go:830 +0x388 panic(0x5ce540, 0x643eb0) /usr/lib/golang/src/runtime/panic.go:522 +0x1b5 _<https://ci.centos.org/job/libvirt-go-check/systems=libvirt-fedora-rawhide/ws/.TestAPICoverage(0xc0000aa100)> <https://ci.centos.org/job/libvirt-go-check/systems=libvirt-fedora-rawhide/ws/api_test.go>:501 +0x551 testing.tRunner(0xc0000aa100, 0x61e320) /usr/lib/golang/src/testing/testing.go:865 +0xc0 created by testing.(*T).Run /usr/lib/golang/src/testing/testing.go:916 +0x357 exit status 2 FAIL _<https://ci.centos.org/job/libvirt-go-check/systems=libvirt-fedora-rawhide/ws/> 1.858s Build step 'Execute shell' marked build as failure

participants (1)
-
ci@centos.org