[Libvirt-ci] Build failed in Jenkins: libvirt-go-xml-check » libvirt-debian-9 #318

See <https://ci.centos.org/job/libvirt-go-xml-check/systems=libvirt-debian-9/318/display/redirect> ------------------------------------------ Started by upstream project "libvirt-go-xml-check" build number 318 originally caused by: Started by upstream project "libvirt-go-xml-build" build number 318 originally caused by: Started by upstream project "libvirt-build" build number 402 originally caused by: Started by an SCM change [EnvInject] - Loading node environment variables. Building remotely on libvirt-debian-9 (libvirt) in workspace <https://ci.centos.org/job/libvirt-go-xml-check/systems=libvirt-debian-9/ws/> [libvirt-go-xml] $ /bin/sh -xe /tmp/jenkins1238327957738189325.sh + export TEST_ARGS=-tags xmlroundtrip + go test -tags xmlroundtrip --- FAIL: TestRoundTrip (8.66s) xml_test.go:394: testdata/libvirt/tests/domaincapsschemadata/empty.xml: /domainCapabilities[0]/os[0]: element in actual XML missing in expected XML FAIL exit status 1 FAIL _<https://ci.centos.org/job/libvirt-go-xml-check/systems=libvirt-debian-9/ws/> 8.697s Build step 'Execute shell' marked build as failure

See <https://ci.centos.org/job/libvirt-go-xml-check/systems=libvirt-debian-9/319/display/redirect> ------------------------------------------ Started by upstream project "libvirt-go-xml-check" build number 319 originally caused by: Started by upstream project "libvirt-go-xml-build" build number 319 originally caused by: Started by upstream project "libvirt-build" build number 403 originally caused by: Started by an SCM change Started by an SCM change Started by an SCM change Started by an SCM change Started by an SCM change Started by an SCM change Started by an SCM change Started by an SCM change [EnvInject] - Loading node environment variables. Building remotely on libvirt-debian-9 (libvirt) in workspace <https://ci.centos.org/job/libvirt-go-xml-check/systems=libvirt-debian-9/ws/> [libvirt-go-xml] $ /bin/sh -xe /tmp/jenkins8596517641630954508.sh + export TEST_ARGS=-tags xmlroundtrip + go test -tags xmlroundtrip --- FAIL: TestRoundTrip (5.43s) xml_test.go:394: testdata/libvirt/tests/domaincapsschemadata/empty.xml: /domainCapabilities[0]/os[0]: element in actual XML missing in expected XML FAIL exit status 1 FAIL _<https://ci.centos.org/job/libvirt-go-xml-check/systems=libvirt-debian-9/ws/> 5.529s Build step 'Execute shell' marked build as failure

See <https://ci.centos.org/job/libvirt-go-xml-check/systems=libvirt-debian-9/321/display/redirect> ------------------------------------------ Started by upstream project "libvirt-go-xml-check" build number 321 originally caused by: Started by upstream project "libvirt-go-xml-build" build number 323 originally caused by: Started by upstream project "libvirt-build" build number 406 originally caused by: Started by an SCM change Started by an SCM change [EnvInject] - Loading node environment variables. Building remotely on libvirt-debian-9 (libvirt) in workspace <https://ci.centos.org/job/libvirt-go-xml-check/systems=libvirt-debian-9/ws/> [libvirt-go-xml] $ /bin/sh -xe /tmp/jenkins6538860488695635302.sh + export TEST_ARGS=-tags xmlroundtrip + go test -tags xmlroundtrip --- FAIL: TestRoundTrip (14.54s) xml_test.go:394: testdata/libvirt/tests/storagepoolxml2xmlin/pool-rbd-refresh-volume-allocation.xml: /pool[0]/refresh[0]: element in expected XML missing in actual XML FAIL exit status 1 FAIL _<https://ci.centos.org/job/libvirt-go-xml-check/systems=libvirt-debian-9/ws/> 14.623s Build step 'Execute shell' marked build as failure

See <https://ci.centos.org/job/libvirt-go-xml-check/systems=libvirt-debian-9/322/display/redirect> ------------------------------------------ Started by upstream project "libvirt-go-xml-check" build number 322 originally caused by: Started by upstream project "libvirt-go-xml-build" build number 324 originally caused by: Started by upstream project "libvirt-build" build number 408 originally caused by: Started by an SCM change [EnvInject] - Loading node environment variables. Building remotely on libvirt-debian-9 (libvirt) in workspace <https://ci.centos.org/job/libvirt-go-xml-check/systems=libvirt-debian-9/ws/> [libvirt-go-xml] $ /bin/sh -xe /tmp/jenkins2883510567063386509.sh + export TEST_ARGS=-tags xmlroundtrip + go test -tags xmlroundtrip --- FAIL: TestRoundTrip (49.80s) xml_test.go:394: testdata/libvirt/tests/storagepoolxml2xmlin/pool-rbd-refresh-volume-allocation.xml: /pool[0]/refresh[0]: element in expected XML missing in actual XML FAIL exit status 1 FAIL _<https://ci.centos.org/job/libvirt-go-xml-check/systems=libvirt-debian-9/ws/> 50.011s Build step 'Execute shell' marked build as failure

participants (1)
-
ci@centos.org