[Libvirt-ci] Build failed in Jenkins: libvirt-dbus-master-check » libvirt-fedora-rawhide #145

See <https://ci.centos.org/job/libvirt-dbus-master-check/systems=libvirt-fedora-rawhide/145/display/redirect> ------------------------------------------ Started by upstream project "libvirt-dbus-master-check" build number 145 originally caused by: Started by upstream project "libvirt-dbus-master-build" build number 178 originally caused by: Started by upstream project "libvirt-glib-master-build" build number 1159 originally caused by: Started by upstream project "libvirt-master-build" build number 1481 originally caused by: Started by an SCM change Started by an SCM change [EnvInject] - Loading node environment variables. Building remotely on libvirt-fedora-rawhide (libvirt) in workspace <https://ci.centos.org/job/libvirt-dbus-master-check/systems=libvirt-fedora-rawhide/ws/> [libvirt-dbus-master] $ /bin/sh -xe /tmp/jenkins3679407248032264289.sh + cd build + /usr/bin/gmake -j3 check Making check in data gmake[1]: Entering directory '<https://ci.centos.org/job/libvirt-dbus-master-check/systems=libvirt-fedora-rawhide/ws/build/data'> gmake[1]: Nothing to be done for 'check'. gmake[1]: Leaving directory '<https://ci.centos.org/job/libvirt-dbus-master-check/systems=libvirt-fedora-rawhide/ws/build/data'> Making check in docs gmake[1]: Entering directory '<https://ci.centos.org/job/libvirt-dbus-master-check/systems=libvirt-fedora-rawhide/ws/build/docs'> gmake[1]: Nothing to be done for 'check'. gmake[1]: Leaving directory '<https://ci.centos.org/job/libvirt-dbus-master-check/systems=libvirt-fedora-rawhide/ws/build/docs'> Making check in src gmake[1]: Entering directory '<https://ci.centos.org/job/libvirt-dbus-master-check/systems=libvirt-fedora-rawhide/ws/build/src'> gmake[1]: Nothing to be done for 'check'. gmake[1]: Leaving directory '<https://ci.centos.org/job/libvirt-dbus-master-check/systems=libvirt-fedora-rawhide/ws/build/src'> Making check in tests gmake[1]: Entering directory '<https://ci.centos.org/job/libvirt-dbus-master-check/systems=libvirt-fedora-rawhide/ws/build/tests'> /usr/bin/gmake check-TESTS gmake[2]: Entering directory '<https://ci.centos.org/job/libvirt-dbus-master-check/systems=libvirt-fedora-rawhide/ws/build/tests'> gmake[3]: Entering directory '<https://ci.centos.org/job/libvirt-dbus-master-check/systems=libvirt-fedora-rawhide/ws/build/tests'> PASS: test_network.py FAIL: test_domain.py PASS: test_storage.py PASS: test_connect.py ============================================================================ Testsuite summary for libvirt-dbus 1.0.0 ============================================================================ # TOTAL: 4 # PASS: 3 # SKIP: 0 # XFAIL: 0 # FAIL: 1 # XPASS: 0 # ERROR: 0 ============================================================================ See tests/test-suite.log Please report to libvir-list@redhat.com ============================================================================ gmake[3]: *** [Makefile:534: test-suite.log] Error 1 gmake[3]: Leaving directory '<https://ci.centos.org/job/libvirt-dbus-master-check/systems=libvirt-fedora-rawhide/ws/build/tests'> gmake[2]: *** [Makefile:642: check-TESTS] Error 2 gmake[2]: Leaving directory '<https://ci.centos.org/job/libvirt-dbus-master-check/systems=libvirt-fedora-rawhide/ws/build/tests'> gmake[1]: *** [Makefile:736: check-am] Error 2 gmake[1]: Leaving directory '<https://ci.centos.org/job/libvirt-dbus-master-check/systems=libvirt-fedora-rawhide/ws/build/tests'> gmake: *** [Makefile:417: check-recursive] Error 1 + cat tests/test-suite.log ============================================== libvirt-dbus 1.0.0: tests/test-suite.log ============================================== # TOTAL: 4 # PASS: 3 # SKIP: 0 # XFAIL: 0 # FAIL: 1 # XPASS: 0 # ERROR: 0 .. contents:: :depth: 2 FAIL: test_domain.py ==================== ============================= test session starts ============================== platform linux -- Python 3.6.5, pytest-3.5.1, py-1.5.3, pluggy-0.6.0 rootdir: <https://ci.centos.org/job/libvirt-dbus-master-check/systems=libvirt-fedora-rawhide/ws/,> inifile: collected 12 items ../../tests/test_domain.py ...........E [100%] ==================================== ERRORS ==================================== ____________ ERROR at setup of TestDomain.test_domain_vcpu_pin_info ____________ self = <test_domain.TestDomain object at 0x7ff03113d128> request = <SubRequest 'libvirt_dbus_setup' for <Function 'test_domain_vcpu_pin_info'>> @pytest.fixture(autouse=True) def libvirt_dbus_setup(self, request): """Start libvirt-dbus for each test function """ os.environ['LIBVIRT_DEBUG'] = '3' self.libvirt_dbus = subprocess.Popen([exe]) self.bus = dbus.SessionBus() for i in range(10): if self.bus.name_has_owner('org.libvirt'): break time.sleep(0.1) else:
raise TimeoutError('error starting libvirt-dbus')
E TimeoutError: error starting libvirt-dbus ../../tests/libvirttest.py:43: TimeoutError ===================== 11 passed, 1 error in 10.44 seconds ====================== FAIL test_domain.py (exit status: 1) + exit 1 Build step 'Execute shell' marked build as failure

participants (1)
-
ci@centos.org