libvirt | Pipeline #169467026 has failed for master | 8f474cee

Your pipeline has failed. Project: libvirt ( https://gitlab.com/libvirt/libvirt ) Branch: master ( https://gitlab.com/libvirt/libvirt/-/commits/master ) Commit: 8f474cee ( https://gitlab.com/libvirt/libvirt/-/commit/8f474ceea05aec349be19726e394a62e... ) Commit Message: formatdomain.html.in: mention pSeries NVDIMM 'a... Commit Author: Daniel Henrique Barboza ( https://gitlab.com/danielhb ) Committed by: Andrea Bolognani ( https://gitlab.com/abologna ) Pipeline #169467026 ( https://gitlab.com/libvirt/libvirt/-/pipelines/169467026 ) triggered by Andrea Bolognani ( https://gitlab.com/abologna ) had 2 failed builds. Job #650650948 ( https://gitlab.com/libvirt/libvirt/-/jobs/650650948/raw ) Stage: builds Name: i686-debian-sid Trace: CC util/libvirt_util_la-virnetdevbridge.lo CC util/libvirt_util_la-virnetdevip.lo In file included from /usr/include/string.h:495, from ../../src/internal.h:28, from ../../src/util/virsocket.h:21, from ../../src/util/virsocketaddr.h:21, from ../../src/util/virnetdevip.h:21, from ../../src/util/virnetdevip.c:21: In function 'memcpy', inlined from 'virNetDevGetifaddrsAddress' at ../../src/util/virnetdevip.c:914:13, inlined from 'virNetDevIPAddrGet' at ../../src/util/virnetdevip.c:962:16: /usr/include/i386-linux-gnu/bits/string_fortified.h:34:10: error: '__builtin_memcpy' offset [16, 27] from the object at 'addr' is out of the bounds of referenced subobject 'inet4' with type 'struct sockaddr_in' at offset 0 [-Werror=array-bounds] 34 | return __builtin___memcpy_chk (__dest, __src, __len, __bos0 (__dest)); | ^~~~~~~~~~~~~~~~~~~~~~~~~~~~~~~~~~~~~~~~~~~~~~~~~~~~~~~~~~~~~~ In file included from ../../src/util/virnetdevip.h:21, from ../../src/util/virnetdevip.c:21: ../../src/util/virnetdevip.c: In function 'virNetDevIPAddrGet': ../../src/util/virsocketaddr.h:29:28: note: subobject 'inet4' declared here 29 | struct sockaddr_in inet4; | ^~~~~ cc1: all warnings being treated as errors make[3]: *** [Makefile:10888: util/libvirt_util_la-virnetdevip.lo] Error 1 make[3]: Leaving directory '/builds/libvirt/libvirt/build/src' make[2]: *** [Makefile:6456: all] Error 2 make[2]: Leaving directory '/builds/libvirt/libvirt/build/src' make[1]: *** [Makefile:806: all-recursive] Error 1 make[1]: Leaving directory '/builds/libvirt/libvirt/build' make: *** [Makefile:699: all] Error 2 section_end:1595420578:step_script [0K[31;1mERROR: Job failed: exit code 1 [0;m Job #650650946 ( https://gitlab.com/libvirt/libvirt/-/jobs/650650946/raw ) Stage: builds Name: armv7l-debian-sid Trace: CC util/libvirt_util_la-virnetdevbridge.lo CC util/libvirt_util_la-virnetdevip.lo In file included from /usr/include/string.h:495, from ../../src/internal.h:28, from ../../src/util/virsocket.h:21, from ../../src/util/virsocketaddr.h:21, from ../../src/util/virnetdevip.h:21, from ../../src/util/virnetdevip.c:21: In function 'memcpy', inlined from 'virNetDevGetifaddrsAddress' at ../../src/util/virnetdevip.c:914:13, inlined from 'virNetDevIPAddrGet' at ../../src/util/virnetdevip.c:962:16: /usr/include/arm-linux-gnueabihf/bits/string_fortified.h:34:10: error: '__builtin_memcpy' offset [16, 27] from the object at 'addr' is out of the bounds of referenced subobject 'inet4' with type 'struct sockaddr_in' at offset 0 [-Werror=array-bounds] 34 | return __builtin___memcpy_chk (__dest, __src, __len, __bos0 (__dest)); | ^~~~~~~~~~~~~~~~~~~~~~~~~~~~~~~~~~~~~~~~~~~~~~~~~~~~~~~~~~~~~~ In file included from ../../src/util/virnetdevip.h:21, from ../../src/util/virnetdevip.c:21: ../../src/util/virnetdevip.c: In function 'virNetDevIPAddrGet': ../../src/util/virsocketaddr.h:29:28: note: subobject 'inet4' declared here 29 | struct sockaddr_in inet4; | ^~~~~ cc1: all warnings being treated as errors make[3]: *** [Makefile:10888: util/libvirt_util_la-virnetdevip.lo] Error 1 make[2]: *** [Makefile:6456: all] Error 2 make[3]: Leaving directory '/builds/libvirt/libvirt/build/src' make[2]: Leaving directory '/builds/libvirt/libvirt/build/src' make[1]: *** [Makefile:806: all-recursive] Error 1 make[1]: Leaving directory '/builds/libvirt/libvirt/build' make: *** [Makefile:699: all] Error 2 section_end:1595420563:step_script [0K[31;1mERROR: Job failed: exit code 1 [0;m -- You're receiving this email because of your account on gitlab.com.
participants (1)
-
GitLab