[Libvirt-ci] Build failed in Jenkins: libvirt-go-xml-check » libvirt-centos-7 #892

See <https://ci.centos.org/job/libvirt-go-xml-check/systems=libvirt-centos-7/892/display/redirect> ------------------------------------------ Started by upstream project "libvirt-go-xml-check" build number 892 originally caused by: Started by upstream project "libvirt-go-xml-build" build number 895 originally caused by: Started by upstream project "libvirt-build" build number 1049 originally caused by: Started by an SCM change Running as SYSTEM [EnvInject] - Loading node environment variables. Building remotely on libvirt-centos-7 (libvirt) in workspace <https://ci.centos.org/job/libvirt-go-xml-check/systems=libvirt-centos-7/ws/> [libvirt-go-xml] $ /bin/sh -xe /tmp/jenkins3434321129958544508.sh + export 'TEST_ARGS=-tags xmlroundtrip' + TEST_ARGS='-tags xmlroundtrip' + go test -tags xmlroundtrip --- FAIL: TestRoundTrip (46.04s) xml_test.go:358: Cannot parse file testdata/libvirt/tests/qemuxml2argvdata/disk-nvme.xml: xml: (*libvirtxml.DomainDiskSource).UnmarshalXML did not consume entire <source> element FAIL exit status 1 FAIL _<https://ci.centos.org/job/libvirt-go-xml-check/systems=libvirt-centos-7/ws/> 46.221s Build step 'Execute shell' marked build as failure

See <https://ci.centos.org/job/libvirt-go-xml-check/systems=libvirt-centos-7/893/display/redirect> ------------------------------------------ Started by upstream project "libvirt-go-xml-check" build number 893 originally caused by: Started by upstream project "libvirt-go-xml-build" build number 896 originally caused by: Started by upstream project "libvirt-build" build number 1050 originally caused by: Started by an SCM change Started by an SCM change Started by an SCM change Running as SYSTEM [EnvInject] - Loading node environment variables. Building remotely on libvirt-centos-7 (libvirt) in workspace <https://ci.centos.org/job/libvirt-go-xml-check/systems=libvirt-centos-7/ws/> [libvirt-go-xml] $ /bin/sh -xe /tmp/jenkins3261189063019296295.sh + export 'TEST_ARGS=-tags xmlroundtrip' + TEST_ARGS='-tags xmlroundtrip' + go test -tags xmlroundtrip --- FAIL: TestRoundTrip (27.24s) xml_test.go:358: Cannot parse file testdata/libvirt/tests/qemuxml2argvdata/disk-nvme.xml: xml: (*libvirtxml.DomainDiskSource).UnmarshalXML did not consume entire <source> element FAIL exit status 1 FAIL _<https://ci.centos.org/job/libvirt-go-xml-check/systems=libvirt-centos-7/ws/> 27.521s Build step 'Execute shell' marked build as failure

See <https://ci.centos.org/job/libvirt-go-xml-check/systems=libvirt-centos-7/894/display/redirect> ------------------------------------------ Started by upstream project "libvirt-go-xml-check" build number 894 originally caused by: Started by upstream project "libvirt-go-xml-build" build number 897 originally caused by: Started by upstream project "libvirt-build" build number 1051 originally caused by: Started by an SCM change Started by an SCM change Started by an SCM change Running as SYSTEM [EnvInject] - Loading node environment variables. Building remotely on libvirt-centos-7 (libvirt) in workspace <https://ci.centos.org/job/libvirt-go-xml-check/systems=libvirt-centos-7/ws/> [libvirt-go-xml] $ /bin/sh -xe /tmp/jenkins1247958810093446675.sh + export 'TEST_ARGS=-tags xmlroundtrip' + TEST_ARGS='-tags xmlroundtrip' + go test -tags xmlroundtrip --- FAIL: TestRoundTrip (39.80s) xml_test.go:358: Cannot parse file testdata/libvirt/tests/qemuxml2argvdata/disk-nvme.xml: xml: (*libvirtxml.DomainDiskSource).UnmarshalXML did not consume entire <source> element FAIL exit status 1 FAIL _<https://ci.centos.org/job/libvirt-go-xml-check/systems=libvirt-centos-7/ws/> 39.930s Build step 'Execute shell' marked build as failure

See <https://ci.centos.org/job/libvirt-go-xml-check/systems=libvirt-centos-7/895/display/redirect> ------------------------------------------ Started by upstream project "libvirt-go-xml-check" build number 895 originally caused by: Started by upstream project "libvirt-go-xml-build" build number 898 originally caused by: Started by upstream project "libvirt-build" build number 1052 originally caused by: Started by an SCM change Running as SYSTEM [EnvInject] - Loading node environment variables. Building remotely on libvirt-centos-7 (libvirt) in workspace <https://ci.centos.org/job/libvirt-go-xml-check/systems=libvirt-centos-7/ws/> [libvirt-go-xml] $ /bin/sh -xe /tmp/jenkins14075937135575449819.sh + export 'TEST_ARGS=-tags xmlroundtrip' + TEST_ARGS='-tags xmlroundtrip' + go test -tags xmlroundtrip --- FAIL: TestRoundTrip (40.50s) xml_test.go:358: Cannot parse file testdata/libvirt/tests/qemuxml2argvdata/disk-nvme.xml: xml: (*libvirtxml.DomainDiskSource).UnmarshalXML did not consume entire <source> element FAIL exit status 1 FAIL _<https://ci.centos.org/job/libvirt-go-xml-check/systems=libvirt-centos-7/ws/> 40.647s Build step 'Execute shell' marked build as failure

See <https://ci.centos.org/job/libvirt-go-xml-check/systems=libvirt-centos-7/896/display/redirect> ------------------------------------------ Started by upstream project "libvirt-go-xml-check" build number 896 originally caused by: Started by upstream project "libvirt-go-xml-build" build number 899 originally caused by: Started by upstream project "libvirt-build" build number 1053 originally caused by: Started by an SCM change Running as SYSTEM [EnvInject] - Loading node environment variables. Building remotely on libvirt-centos-7 (libvirt) in workspace <https://ci.centos.org/job/libvirt-go-xml-check/systems=libvirt-centos-7/ws/> [libvirt-go-xml] $ /bin/sh -xe /tmp/jenkins16231302557326428305.sh + export 'TEST_ARGS=-tags xmlroundtrip' + TEST_ARGS='-tags xmlroundtrip' + go test -tags xmlroundtrip --- FAIL: TestRoundTrip (50.63s) xml_test.go:358: Cannot parse file testdata/libvirt/tests/qemuxml2argvdata/disk-nvme.xml: xml: (*libvirtxml.DomainDiskSource).UnmarshalXML did not consume entire <source> element FAIL exit status 1 FAIL _<https://ci.centos.org/job/libvirt-go-xml-check/systems=libvirt-centos-7/ws/> 50.884s Build step 'Execute shell' marked build as failure

participants (1)
-
ci@centos.org