[Libvirt-ci] Build failed in Jenkins: libvirt-go-master-check » libvirt-freebsd-10 #1057

See <https://ci.centos.org/job/libvirt-go-master-check/systems=libvirt-freebsd-10/1057/display/redirect> ------------------------------------------ Started by upstream project "libvirt-go-master-check" build number 1057 originally caused by: Started by upstream project "libvirt-go-master-build" build number 1068 originally caused by: Started by upstream project "libvirt-master-build" build number 1465 originally caused by: Started by an SCM change [EnvInject] - Loading node environment variables. Building remotely on libvirt-freebsd-10 (libvirt) in workspace <https://ci.centos.org/job/libvirt-go-master-check/systems=libvirt-freebsd-10/ws/> [libvirt-go-master] $ /bin/sh -xe /tmp/jenkins1701654166181742530.sh + export 'TEST_ARGS=-tags api' + go test -tags api 2018-05-28 12:25:52.007+0000: 34498176000: info : libvirt version: 4.4.0 2018-05-28 12:25:52.007+0000: 34498176000: info : hostname: libvirt-freebsd-10 2018-05-28 12:25:52.007+0000: 34498176000: warning : virEventRegisterImpl:245 : Ignoring attempt to replace registered event loop 2018-05-28 12:25:52.007+0000: 34498176000: warning : virEventRegisterImpl:245 : Ignoring attempt to replace registered event loop 2018-05-28 12:25:52.007+0000: 34498176000: warning : virEventRegisterImpl:245 : Ignoring attempt to replace registered event loop Missing function 'virDomainDetachDeviceAlias' --- FAIL: TestAPICoverage (0.53s) panic: Missing symbols found [recovered] panic: Missing symbols found goroutine 5 [running]: testing.tRunner.func1(0xc4200ae0f0) /usr/local/go/src/testing/testing.go:742 +0x29d panic(0x5aeec0, 0x612410) /usr/local/go/src/runtime/panic.go:505 +0x229 _/usr<https://ci.centos.org/job/libvirt-go-master-check/systems=libvirt-freebsd-10/ws/.TestAPICoverage(0xc4200ae0f0)> /usr<https://ci.centos.org/job/libvirt-go-master-check/systems=libvirt-freebsd-10/ws/api_test.go>:504 +0x548 testing.tRunner(0xc4200ae0f0, 0x5fd490) /usr/local/go/src/testing/testing.go:777 +0xd0 created by testing.(*T).Run /usr/local/go/src/testing/testing.go:824 +0x2e0 exit status 2 FAIL _/usr<https://ci.centos.org/job/libvirt-go-master-check/systems=libvirt-freebsd-10/ws/> 0.681s Build step 'Execute shell' marked build as failure

See <https://ci.centos.org/job/libvirt-go-master-check/systems=libvirt-freebsd-10/1058/display/redirect> ------------------------------------------ Started by upstream project "libvirt-go-master-check" build number 1058 originally caused by: Started by upstream project "libvirt-go-master-build" build number 1069 originally caused by: Started by upstream project "libvirt-master-build" build number 1466 originally caused by: Started by an SCM change [EnvInject] - Loading node environment variables. Building remotely on libvirt-freebsd-10 (libvirt) in workspace <https://ci.centos.org/job/libvirt-go-master-check/systems=libvirt-freebsd-10/ws/> [libvirt-go-master] $ /bin/sh -xe /tmp/jenkins4140402193331850743.sh + export 'TEST_ARGS=-tags api' + go test -tags api 2018-05-28 15:26:09.967+0000: 34498176000: info : libvirt version: 4.4.0 2018-05-28 15:26:09.967+0000: 34498176000: info : hostname: libvirt-freebsd-10 2018-05-28 15:26:09.967+0000: 34498176000: warning : virEventRegisterImpl:245 : Ignoring attempt to replace registered event loop 2018-05-28 15:26:09.967+0000: 34498176000: warning : virEventRegisterImpl:245 : Ignoring attempt to replace registered event loop 2018-05-28 15:26:09.967+0000: 34498176000: warning : virEventRegisterImpl:245 : Ignoring attempt to replace registered event loop Missing function 'virConnectBaselineHypervisorCPU' Missing function 'virConnectCompareHypervisorCPU' Missing function 'virDomainDetachDeviceAlias' --- FAIL: TestAPICoverage (0.25s) panic: Missing symbols found [recovered] panic: Missing symbols found goroutine 19 [running]: testing.tRunner.func1(0xc4200cc0f0) /usr/local/go/src/testing/testing.go:742 +0x29d panic(0x5aeec0, 0x612410) /usr/local/go/src/runtime/panic.go:505 +0x229 _/usr<https://ci.centos.org/job/libvirt-go-master-check/systems=libvirt-freebsd-10/ws/.TestAPICoverage(0xc4200cc0f0)> /usr<https://ci.centos.org/job/libvirt-go-master-check/systems=libvirt-freebsd-10/ws/api_test.go>:504 +0x548 testing.tRunner(0xc4200cc0f0, 0x5fd490) /usr/local/go/src/testing/testing.go:777 +0xd0 created by testing.(*T).Run /usr/local/go/src/testing/testing.go:824 +0x2e0 exit status 2 FAIL _/usr<https://ci.centos.org/job/libvirt-go-master-check/systems=libvirt-freebsd-10/ws/> 0.323s Build step 'Execute shell' marked build as failure

See <https://ci.centos.org/job/libvirt-go-master-check/systems=libvirt-freebsd-10/1059/display/redirect> ------------------------------------------ Started by upstream project "libvirt-go-master-check" build number 1059 originally caused by: Started by upstream project "libvirt-go-master-build" build number 1070 originally caused by: Started by upstream project "libvirt-master-build" build number 1467 originally caused by: Started by an SCM change Started by an SCM change [EnvInject] - Loading node environment variables. Building remotely on libvirt-freebsd-10 (libvirt) in workspace <https://ci.centos.org/job/libvirt-go-master-check/systems=libvirt-freebsd-10/ws/> [libvirt-go-master] $ /bin/sh -xe /tmp/jenkins6302917243884633256.sh + export 'TEST_ARGS=-tags api' + go test -tags api 2018-05-28 16:50:32.919+0000: 34498176000: info : libvirt version: 4.4.0 2018-05-28 16:50:32.919+0000: 34498176000: info : hostname: libvirt-freebsd-10 2018-05-28 16:50:32.919+0000: 34498176000: warning : virEventRegisterImpl:245 : Ignoring attempt to replace registered event loop 2018-05-28 16:50:32.921+0000: 34498176000: warning : virEventRegisterImpl:245 : Ignoring attempt to replace registered event loop 2018-05-28 16:50:32.921+0000: 34498176000: warning : virEventRegisterImpl:245 : Ignoring attempt to replace registered event loop Missing function 'virConnectBaselineHypervisorCPU' Missing function 'virConnectCompareHypervisorCPU' Missing function 'virDomainDetachDeviceAlias' --- FAIL: TestAPICoverage (0.26s) panic: Missing symbols found [recovered] panic: Missing symbols found goroutine 4 [running]: testing.tRunner.func1(0xc4200b40f0) /usr/local/go/src/testing/testing.go:742 +0x29d panic(0x5aeec0, 0x612410) /usr/local/go/src/runtime/panic.go:505 +0x229 _/usr<https://ci.centos.org/job/libvirt-go-master-check/systems=libvirt-freebsd-10/ws/.TestAPICoverage(0xc4200b40f0)> /usr<https://ci.centos.org/job/libvirt-go-master-check/systems=libvirt-freebsd-10/ws/api_test.go>:504 +0x548 testing.tRunner(0xc4200b40f0, 0x5fd490) /usr/local/go/src/testing/testing.go:777 +0xd0 created by testing.(*T).Run /usr/local/go/src/testing/testing.go:824 +0x2e0 exit status 2 FAIL _/usr<https://ci.centos.org/job/libvirt-go-master-check/systems=libvirt-freebsd-10/ws/> 0.442s Build step 'Execute shell' marked build as failure

See <https://ci.centos.org/job/libvirt-go-master-check/systems=libvirt-freebsd-10/1060/display/redirect> ------------------------------------------ Started by upstream project "libvirt-go-master-check" build number 1060 originally caused by: Started by upstream project "libvirt-go-master-build" build number 1071 originally caused by: Started by upstream project "libvirt-master-build" build number 1468 originally caused by: Started by an SCM change [EnvInject] - Loading node environment variables. Building remotely on libvirt-freebsd-10 (libvirt) in workspace <https://ci.centos.org/job/libvirt-go-master-check/systems=libvirt-freebsd-10/ws/> [libvirt-go-master] $ /bin/sh -xe /tmp/jenkins5858933013471229640.sh + export 'TEST_ARGS=-tags api' + go test -tags api 2018-05-29 09:47:44.277+0000: 34498176000: info : libvirt version: 4.4.0 2018-05-29 09:47:44.277+0000: 34498176000: info : hostname: libvirt-freebsd-10 2018-05-29 09:47:44.277+0000: 34498176000: warning : virEventRegisterImpl:245 : Ignoring attempt to replace registered event loop 2018-05-29 09:47:44.278+0000: 34498176000: warning : virEventRegisterImpl:245 : Ignoring attempt to replace registered event loop 2018-05-29 09:47:44.278+0000: 34498176000: warning : virEventRegisterImpl:245 : Ignoring attempt to replace registered event loop Missing function 'virConnectBaselineHypervisorCPU' Missing function 'virConnectCompareHypervisorCPU' Missing function 'virDomainDetachDeviceAlias' --- FAIL: TestAPICoverage (0.76s) panic: Missing symbols found [recovered] panic: Missing symbols found goroutine 20 [running]: testing.tRunner.func1(0xc4200ca0f0) /usr/local/go/src/testing/testing.go:742 +0x29d panic(0x5aeec0, 0x612410) /usr/local/go/src/runtime/panic.go:505 +0x229 _/usr<https://ci.centos.org/job/libvirt-go-master-check/systems=libvirt-freebsd-10/ws/.TestAPICoverage(0xc4200ca0f0)> /usr<https://ci.centos.org/job/libvirt-go-master-check/systems=libvirt-freebsd-10/ws/api_test.go>:504 +0x548 testing.tRunner(0xc4200ca0f0, 0x5fd490) /usr/local/go/src/testing/testing.go:777 +0xd0 created by testing.(*T).Run /usr/local/go/src/testing/testing.go:824 +0x2e0 exit status 2 FAIL _/usr<https://ci.centos.org/job/libvirt-go-master-check/systems=libvirt-freebsd-10/ws/> 1.009s Build step 'Execute shell' marked build as failure

See <https://ci.centos.org/job/libvirt-go-master-check/systems=libvirt-freebsd-10/1061/display/redirect> ------------------------------------------ Started by upstream project "libvirt-go-master-check" build number 1061 originally caused by: Started by upstream project "libvirt-go-master-build" build number 1072 originally caused by: Started by upstream project "libvirt-master-build" build number 1469 originally caused by: Started by an SCM change [EnvInject] - Loading node environment variables. Building remotely on libvirt-freebsd-10 (libvirt) in workspace <https://ci.centos.org/job/libvirt-go-master-check/systems=libvirt-freebsd-10/ws/> [libvirt-go-master] $ /bin/sh -xe /tmp/jenkins972401284436814186.sh + export 'TEST_ARGS=-tags api' + go test -tags api 2018-05-29 13:29:29.756+0000: 34498176000: info : libvirt version: 4.4.0 2018-05-29 13:29:29.756+0000: 34498176000: info : hostname: libvirt-freebsd-10 2018-05-29 13:29:29.756+0000: 34498176000: warning : virEventRegisterImpl:245 : Ignoring attempt to replace registered event loop 2018-05-29 13:29:29.758+0000: 34498176000: warning : virEventRegisterImpl:245 : Ignoring attempt to replace registered event loop 2018-05-29 13:29:29.763+0000: 34498176000: warning : virEventRegisterImpl:245 : Ignoring attempt to replace registered event loop Missing function 'virConnectBaselineHypervisorCPU' Missing function 'virConnectCompareHypervisorCPU' Missing function 'virDomainDetachDeviceAlias' --- FAIL: TestAPICoverage (0.62s) panic: Missing symbols found [recovered] panic: Missing symbols found goroutine 19 [running]: testing.tRunner.func1(0xc4200c00f0) /usr/local/go/src/testing/testing.go:742 +0x29d panic(0x5aeec0, 0x612410) /usr/local/go/src/runtime/panic.go:505 +0x229 _/usr<https://ci.centos.org/job/libvirt-go-master-check/systems=libvirt-freebsd-10/ws/.TestAPICoverage(0xc4200c00f0)> /usr<https://ci.centos.org/job/libvirt-go-master-check/systems=libvirt-freebsd-10/ws/api_test.go>:504 +0x548 testing.tRunner(0xc4200c00f0, 0x5fd490) /usr/local/go/src/testing/testing.go:777 +0xd0 created by testing.(*T).Run /usr/local/go/src/testing/testing.go:824 +0x2e0 exit status 2 FAIL _/usr<https://ci.centos.org/job/libvirt-go-master-check/systems=libvirt-freebsd-10/ws/> 0.771s Build step 'Execute shell' marked build as failure

See <https://ci.centos.org/job/libvirt-go-master-check/systems=libvirt-freebsd-10/1062/display/redirect> ------------------------------------------ Started by upstream project "libvirt-go-master-check" build number 1062 originally caused by: Started by upstream project "libvirt-go-master-build" build number 1073 originally caused by: Started by upstream project "libvirt-master-build" build number 1470 originally caused by: Started by an SCM change [EnvInject] - Loading node environment variables. Building remotely on libvirt-freebsd-10 (libvirt) in workspace <https://ci.centos.org/job/libvirt-go-master-check/systems=libvirt-freebsd-10/ws/> [libvirt-go-master] $ /bin/sh -xe /tmp/jenkins1687923480927179934.sh + export 'TEST_ARGS=-tags api' + go test -tags api 2018-05-29 15:13:21.741+0000: 34498176000: info : libvirt version: 4.4.0 2018-05-29 15:13:21.741+0000: 34498176000: info : hostname: libvirt-freebsd-10 2018-05-29 15:13:21.741+0000: 34498176000: warning : virEventRegisterImpl:245 : Ignoring attempt to replace registered event loop 2018-05-29 15:13:21.741+0000: 34498176000: warning : virEventRegisterImpl:245 : Ignoring attempt to replace registered event loop 2018-05-29 15:13:21.741+0000: 34498176000: warning : virEventRegisterImpl:245 : Ignoring attempt to replace registered event loop Missing function 'virConnectBaselineHypervisorCPU' Missing function 'virConnectCompareHypervisorCPU' Missing function 'virDomainDetachDeviceAlias' --- FAIL: TestAPICoverage (0.22s) panic: Missing symbols found [recovered] panic: Missing symbols found goroutine 5 [running]: testing.tRunner.func1(0xc4200ae0f0) /usr/local/go/src/testing/testing.go:742 +0x29d panic(0x5aeec0, 0x612410) /usr/local/go/src/runtime/panic.go:505 +0x229 _/usr<https://ci.centos.org/job/libvirt-go-master-check/systems=libvirt-freebsd-10/ws/.TestAPICoverage(0xc4200ae0f0)> /usr<https://ci.centos.org/job/libvirt-go-master-check/systems=libvirt-freebsd-10/ws/api_test.go>:504 +0x548 testing.tRunner(0xc4200ae0f0, 0x5fd490) /usr/local/go/src/testing/testing.go:777 +0xd0 created by testing.(*T).Run /usr/local/go/src/testing/testing.go:824 +0x2e0 exit status 2 FAIL _/usr<https://ci.centos.org/job/libvirt-go-master-check/systems=libvirt-freebsd-10/ws/> 0.283s Build step 'Execute shell' marked build as failure

See <https://ci.centos.org/job/libvirt-go-master-check/systems=libvirt-freebsd-10/1063/display/redirect> ------------------------------------------ Started by upstream project "libvirt-go-master-check" build number 1063 originally caused by: Started by upstream project "libvirt-go-master-build" build number 1074 originally caused by: Started by upstream project "libvirt-master-build" build number 1471 originally caused by: Started by an SCM change Started by an SCM change [EnvInject] - Loading node environment variables. Building remotely on libvirt-freebsd-10 (libvirt) in workspace <https://ci.centos.org/job/libvirt-go-master-check/systems=libvirt-freebsd-10/ws/> [libvirt-go-master] $ /bin/sh -xe /tmp/jenkins5851885183302930384.sh + export 'TEST_ARGS=-tags api' + go test -tags api 2018-05-29 16:09:35.545+0000: 34498176000: info : libvirt version: 4.4.0 2018-05-29 16:09:35.545+0000: 34498176000: info : hostname: libvirt-freebsd-10 2018-05-29 16:09:35.545+0000: 34498176000: warning : virEventRegisterImpl:245 : Ignoring attempt to replace registered event loop 2018-05-29 16:09:35.546+0000: 34498176000: warning : virEventRegisterImpl:245 : Ignoring attempt to replace registered event loop 2018-05-29 16:09:35.546+0000: 34498176000: warning : virEventRegisterImpl:245 : Ignoring attempt to replace registered event loop Missing function 'virConnectBaselineHypervisorCPU' Missing function 'virConnectCompareHypervisorCPU' Missing function 'virDomainDetachDeviceAlias' --- FAIL: TestAPICoverage (0.76s) panic: Missing symbols found [recovered] panic: Missing symbols found goroutine 4 [running]: testing.tRunner.func1(0xc4200ce0f0) /usr/local/go/src/testing/testing.go:742 +0x29d panic(0x5aeec0, 0x612410) /usr/local/go/src/runtime/panic.go:505 +0x229 _/usr<https://ci.centos.org/job/libvirt-go-master-check/systems=libvirt-freebsd-10/ws/.TestAPICoverage(0xc4200ce0f0)> /usr<https://ci.centos.org/job/libvirt-go-master-check/systems=libvirt-freebsd-10/ws/api_test.go>:504 +0x548 testing.tRunner(0xc4200ce0f0, 0x5fd490) /usr/local/go/src/testing/testing.go:777 +0xd0 created by testing.(*T).Run /usr/local/go/src/testing/testing.go:824 +0x2e0 exit status 2 FAIL _/usr<https://ci.centos.org/job/libvirt-go-master-check/systems=libvirt-freebsd-10/ws/> 0.894s Build step 'Execute shell' marked build as failure

See <https://ci.centos.org/job/libvirt-go-master-check/systems=libvirt-freebsd-10/1064/display/redirect> ------------------------------------------ Started by upstream project "libvirt-go-master-check" build number 1064 originally caused by: Started by upstream project "libvirt-go-master-build" build number 1075 originally caused by: Started by upstream project "libvirt-master-build" build number 1472 originally caused by: Started by an SCM change [EnvInject] - Loading node environment variables. Building remotely on libvirt-freebsd-10 (libvirt) in workspace <https://ci.centos.org/job/libvirt-go-master-check/systems=libvirt-freebsd-10/ws/> [libvirt-go-master] $ /bin/sh -xe /tmp/jenkins7706728367149770670.sh + export 'TEST_ARGS=-tags api' + go test -tags api 2018-05-30 10:19:24.744+0000: 34498176000: info : libvirt version: 4.4.0 2018-05-30 10:19:24.744+0000: 34498176000: info : hostname: libvirt-freebsd-10 2018-05-30 10:19:24.744+0000: 34498176000: warning : virEventRegisterImpl:245 : Ignoring attempt to replace registered event loop 2018-05-30 10:19:24.745+0000: 34498176000: warning : virEventRegisterImpl:245 : Ignoring attempt to replace registered event loop 2018-05-30 10:19:24.745+0000: 34498176000: warning : virEventRegisterImpl:245 : Ignoring attempt to replace registered event loop Missing function 'virConnectBaselineHypervisorCPU' Missing function 'virConnectCompareHypervisorCPU' Missing function 'virDomainDetachDeviceAlias' --- FAIL: TestAPICoverage (1.03s) panic: Missing symbols found [recovered] panic: Missing symbols found goroutine 20 [running]: testing.tRunner.func1(0xc4200ca0f0) /usr/local/go/src/testing/testing.go:742 +0x29d panic(0x5aeec0, 0x612410) /usr/local/go/src/runtime/panic.go:505 +0x229 _/usr<https://ci.centos.org/job/libvirt-go-master-check/systems=libvirt-freebsd-10/ws/.TestAPICoverage(0xc4200ca0f0)> /usr<https://ci.centos.org/job/libvirt-go-master-check/systems=libvirt-freebsd-10/ws/api_test.go>:504 +0x548 testing.tRunner(0xc4200ca0f0, 0x5fd490) /usr/local/go/src/testing/testing.go:777 +0xd0 created by testing.(*T).Run /usr/local/go/src/testing/testing.go:824 +0x2e0 exit status 2 FAIL _/usr<https://ci.centos.org/job/libvirt-go-master-check/systems=libvirt-freebsd-10/ws/> 1.206s Build step 'Execute shell' marked build as failure

See <https://ci.centos.org/job/libvirt-go-master-check/systems=libvirt-freebsd-10/1065/display/redirect> ------------------------------------------ Started by upstream project "libvirt-go-master-check" build number 1065 originally caused by: Started by upstream project "libvirt-go-master-build" build number 1076 originally caused by: Started by upstream project "libvirt-master-build" build number 1473 originally caused by: Started by an SCM change [EnvInject] - Loading node environment variables. Building remotely on libvirt-freebsd-10 (libvirt) in workspace <https://ci.centos.org/job/libvirt-go-master-check/systems=libvirt-freebsd-10/ws/> [libvirt-go-master] $ /bin/sh -xe /tmp/jenkins8606791871777542694.sh + export 'TEST_ARGS=-tags api' + go test -tags api 2018-05-30 14:50:23.322+0000: 34498176000: info : libvirt version: 4.4.0 2018-05-30 14:50:23.322+0000: 34498176000: info : hostname: libvirt-freebsd-10 2018-05-30 14:50:23.322+0000: 34498176000: warning : virEventRegisterImpl:245 : Ignoring attempt to replace registered event loop 2018-05-30 14:50:23.323+0000: 34498176000: warning : virEventRegisterImpl:245 : Ignoring attempt to replace registered event loop 2018-05-30 14:50:23.323+0000: 34498176000: warning : virEventRegisterImpl:245 : Ignoring attempt to replace registered event loop Missing function 'virConnectBaselineHypervisorCPU' Missing function 'virConnectCompareHypervisorCPU' Missing function 'virDomainDetachDeviceAlias' --- FAIL: TestAPICoverage (0.54s) panic: Missing symbols found [recovered] panic: Missing symbols found goroutine 5 [running]: testing.tRunner.func1(0xc4200ae0f0) /usr/local/go/src/testing/testing.go:742 +0x29d panic(0x5aeec0, 0x612410) /usr/local/go/src/runtime/panic.go:505 +0x229 _/usr<https://ci.centos.org/job/libvirt-go-master-check/systems=libvirt-freebsd-10/ws/.TestAPICoverage(0xc4200ae0f0)> /usr<https://ci.centos.org/job/libvirt-go-master-check/systems=libvirt-freebsd-10/ws/api_test.go>:504 +0x548 testing.tRunner(0xc4200ae0f0, 0x5fd490) /usr/local/go/src/testing/testing.go:777 +0xd0 created by testing.(*T).Run /usr/local/go/src/testing/testing.go:824 +0x2e0 exit status 2 FAIL _/usr<https://ci.centos.org/job/libvirt-go-master-check/systems=libvirt-freebsd-10/ws/> 0.774s Build step 'Execute shell' marked build as failure

See <https://ci.centos.org/job/libvirt-go-master-check/systems=libvirt-freebsd-10/1066/display/redirect> ------------------------------------------ Started by upstream project "libvirt-go-master-check" build number 1066 originally caused by: Started by upstream project "libvirt-go-master-build" build number 1077 originally caused by: Started by upstream project "libvirt-master-build" build number 1474 originally caused by: Started by an SCM change Started by an SCM change Started by an SCM change [EnvInject] - Loading node environment variables. Building remotely on libvirt-freebsd-10 (libvirt) in workspace <https://ci.centos.org/job/libvirt-go-master-check/systems=libvirt-freebsd-10/ws/> [libvirt-go-master] $ /bin/sh -xe /tmp/jenkins364664583383959492.sh + export 'TEST_ARGS=-tags api' + go test -tags api 2018-05-30 15:57:04.528+0000: 34498176000: info : libvirt version: 4.4.0 2018-05-30 15:57:04.528+0000: 34498176000: info : hostname: libvirt-freebsd-10 2018-05-30 15:57:04.528+0000: 34498176000: warning : virEventRegisterImpl:245 : Ignoring attempt to replace registered event loop 2018-05-30 15:57:04.529+0000: 34498176000: warning : virEventRegisterImpl:245 : Ignoring attempt to replace registered event loop 2018-05-30 15:57:04.529+0000: 34498176000: warning : virEventRegisterImpl:245 : Ignoring attempt to replace registered event loop Missing function 'virConnectBaselineHypervisorCPU' Missing function 'virConnectCompareHypervisorCPU' Missing function 'virDomainDetachDeviceAlias' --- FAIL: TestAPICoverage (0.72s) panic: Missing symbols found [recovered] panic: Missing symbols found goroutine 18 [running]: testing.tRunner.func1(0xc4200c00f0) /usr/local/go/src/testing/testing.go:742 +0x29d panic(0x5aeec0, 0x612410) /usr/local/go/src/runtime/panic.go:505 +0x229 _/usr<https://ci.centos.org/job/libvirt-go-master-check/systems=libvirt-freebsd-10/ws/.TestAPICoverage(0xc4200c00f0)> /usr<https://ci.centos.org/job/libvirt-go-master-check/systems=libvirt-freebsd-10/ws/api_test.go>:504 +0x548 testing.tRunner(0xc4200c00f0, 0x5fd490) /usr/local/go/src/testing/testing.go:777 +0xd0 created by testing.(*T).Run /usr/local/go/src/testing/testing.go:824 +0x2e0 exit status 2 FAIL _/usr<https://ci.centos.org/job/libvirt-go-master-check/systems=libvirt-freebsd-10/ws/> 0.863s Build step 'Execute shell' marked build as failure

See <https://ci.centos.org/job/libvirt-go-master-check/systems=libvirt-freebsd-10/1067/display/redirect> ------------------------------------------ Started by upstream project "libvirt-go-master-check" build number 1067 originally caused by: Started by upstream project "libvirt-go-master-build" build number 1078 originally caused by: Started by upstream project "libvirt-master-build" build number 1475 originally caused by: Started by an SCM change [EnvInject] - Loading node environment variables. Building remotely on libvirt-freebsd-10 (libvirt) in workspace <https://ci.centos.org/job/libvirt-go-master-check/systems=libvirt-freebsd-10/ws/> [libvirt-go-master] $ /bin/sh -xe /tmp/jenkins5187924862103339895.sh + export 'TEST_ARGS=-tags api' + go test -tags api 2018-05-31 08:27:12.638+0000: 34498176000: info : libvirt version: 4.4.0 2018-05-31 08:27:12.638+0000: 34498176000: info : hostname: libvirt-freebsd-10 2018-05-31 08:27:12.638+0000: 34498176000: warning : virEventRegisterImpl:245 : Ignoring attempt to replace registered event loop 2018-05-31 08:27:12.639+0000: 34498176000: warning : virEventRegisterImpl:245 : Ignoring attempt to replace registered event loop 2018-05-31 08:27:12.639+0000: 34498176000: warning : virEventRegisterImpl:245 : Ignoring attempt to replace registered event loop Missing function 'virConnectBaselineHypervisorCPU' Missing function 'virConnectCompareHypervisorCPU' Missing function 'virDomainDetachDeviceAlias' --- FAIL: TestAPICoverage (0.89s) panic: Missing symbols found [recovered] panic: Missing symbols found goroutine 19 [running]: testing.tRunner.func1(0xc4200cc0f0) /usr/local/go/src/testing/testing.go:742 +0x29d panic(0x5aeec0, 0x612410) /usr/local/go/src/runtime/panic.go:505 +0x229 _/usr<https://ci.centos.org/job/libvirt-go-master-check/systems=libvirt-freebsd-10/ws/.TestAPICoverage(0xc4200cc0f0)> /usr<https://ci.centos.org/job/libvirt-go-master-check/systems=libvirt-freebsd-10/ws/api_test.go>:504 +0x548 testing.tRunner(0xc4200cc0f0, 0x5fd490) /usr/local/go/src/testing/testing.go:777 +0xd0 created by testing.(*T).Run /usr/local/go/src/testing/testing.go:824 +0x2e0 exit status 2 FAIL _/usr<https://ci.centos.org/job/libvirt-go-master-check/systems=libvirt-freebsd-10/ws/> 1.089s Build step 'Execute shell' marked build as failure

See <https://ci.centos.org/job/libvirt-go-master-check/systems=libvirt-freebsd-10/1068/display/redirect> ------------------------------------------ Started by upstream project "libvirt-go-master-check" build number 1068 originally caused by: Started by upstream project "libvirt-go-master-build" build number 1079 originally caused by: Started by upstream project "libvirt-master-build" build number 1476 originally caused by: Started by an SCM change [EnvInject] - Loading node environment variables. Building remotely on libvirt-freebsd-10 (libvirt) in workspace <https://ci.centos.org/job/libvirt-go-master-check/systems=libvirt-freebsd-10/ws/> [libvirt-go-master] $ /bin/sh -xe /tmp/jenkins2613725650443421366.sh + export 'TEST_ARGS=-tags api' + go test -tags api 2018-05-31 10:28:40.968+0000: 34498176000: info : libvirt version: 4.4.0 2018-05-31 10:28:40.968+0000: 34498176000: info : hostname: libvirt-freebsd-10 2018-05-31 10:28:40.968+0000: 34498176000: warning : virEventRegisterImpl:245 : Ignoring attempt to replace registered event loop 2018-05-31 10:28:40.969+0000: 34498176000: warning : virEventRegisterImpl:245 : Ignoring attempt to replace registered event loop 2018-05-31 10:28:40.969+0000: 34498176000: warning : virEventRegisterImpl:245 : Ignoring attempt to replace registered event loop Missing function 'virConnectBaselineHypervisorCPU' Missing function 'virConnectCompareHypervisorCPU' Missing function 'virDomainDetachDeviceAlias' --- FAIL: TestAPICoverage (0.62s) panic: Missing symbols found [recovered] panic: Missing symbols found goroutine 19 [running]: testing.tRunner.func1(0xc4200c80f0) /usr/local/go/src/testing/testing.go:742 +0x29d panic(0x5aeec0, 0x612410) /usr/local/go/src/runtime/panic.go:505 +0x229 _/usr<https://ci.centos.org/job/libvirt-go-master-check/systems=libvirt-freebsd-10/ws/.TestAPICoverage(0xc4200c80f0)> /usr<https://ci.centos.org/job/libvirt-go-master-check/systems=libvirt-freebsd-10/ws/api_test.go>:504 +0x548 testing.tRunner(0xc4200c80f0, 0x5fd490) /usr/local/go/src/testing/testing.go:777 +0xd0 created by testing.(*T).Run /usr/local/go/src/testing/testing.go:824 +0x2e0 exit status 2 FAIL _/usr<https://ci.centos.org/job/libvirt-go-master-check/systems=libvirt-freebsd-10/ws/> 0.828s Build step 'Execute shell' marked build as failure

See <https://ci.centos.org/job/libvirt-go-master-check/systems=libvirt-freebsd-10/1069/display/redirect> ------------------------------------------ Started by upstream project "libvirt-go-master-check" build number 1069 originally caused by: Started by upstream project "libvirt-go-master-build" build number 1080 originally caused by: Started by upstream project "libvirt-master-build" build number 1477 originally caused by: Started by an SCM change Started by an SCM change Started by an SCM change [EnvInject] - Loading node environment variables. Building remotely on libvirt-freebsd-10 (libvirt) in workspace <https://ci.centos.org/job/libvirt-go-master-check/systems=libvirt-freebsd-10/ws/> [libvirt-go-master] $ /bin/sh -xe /tmp/jenkins5954830857971491955.sh + export 'TEST_ARGS=-tags api' + go test -tags api 2018-05-31 11:48:23.374+0000: 34498176000: info : libvirt version: 4.4.0 2018-05-31 11:48:23.374+0000: 34498176000: info : hostname: libvirt-freebsd-10 2018-05-31 11:48:23.374+0000: 34498176000: warning : virEventRegisterImpl:245 : Ignoring attempt to replace registered event loop 2018-05-31 11:48:23.374+0000: 34498176000: warning : virEventRegisterImpl:245 : Ignoring attempt to replace registered event loop 2018-05-31 11:48:23.374+0000: 34498176000: warning : virEventRegisterImpl:245 : Ignoring attempt to replace registered event loop Missing function 'virConnectBaselineHypervisorCPU' Missing function 'virConnectCompareHypervisorCPU' Missing function 'virDomainDetachDeviceAlias' --- FAIL: TestAPICoverage (0.83s) panic: Missing symbols found [recovered] panic: Missing symbols found goroutine 5 [running]: testing.tRunner.func1(0xc4200b60f0) /usr/local/go/src/testing/testing.go:742 +0x29d panic(0x5aeec0, 0x612410) /usr/local/go/src/runtime/panic.go:505 +0x229 _/usr<https://ci.centos.org/job/libvirt-go-master-check/systems=libvirt-freebsd-10/ws/.TestAPICoverage(0xc4200b60f0)> /usr<https://ci.centos.org/job/libvirt-go-master-check/systems=libvirt-freebsd-10/ws/api_test.go>:504 +0x548 testing.tRunner(0xc4200b60f0, 0x5fd490) /usr/local/go/src/testing/testing.go:777 +0xd0 created by testing.(*T).Run /usr/local/go/src/testing/testing.go:824 +0x2e0 exit status 2 FAIL _/usr<https://ci.centos.org/job/libvirt-go-master-check/systems=libvirt-freebsd-10/ws/> 0.998s Build step 'Execute shell' marked build as failure

See <https://ci.centos.org/job/libvirt-go-master-check/systems=libvirt-freebsd-10/1070/display/redirect> ------------------------------------------ Started by upstream project "libvirt-go-master-check" build number 1070 originally caused by: Started by upstream project "libvirt-go-master-build" build number 1081 originally caused by: Started by upstream project "libvirt-master-build" build number 1478 originally caused by: Started by an SCM change [EnvInject] - Loading node environment variables. Building remotely on libvirt-freebsd-10 (libvirt) in workspace <https://ci.centos.org/job/libvirt-go-master-check/systems=libvirt-freebsd-10/ws/> [libvirt-go-master] $ /bin/sh -xe /tmp/jenkins4943040241360647066.sh + export 'TEST_ARGS=-tags api' + go test -tags api 2018-05-31 14:18:47.873+0000: 34498176000: info : libvirt version: 4.4.0 2018-05-31 14:18:47.873+0000: 34498176000: info : hostname: libvirt-freebsd-10 2018-05-31 14:18:47.873+0000: 34498176000: warning : virEventRegisterImpl:245 : Ignoring attempt to replace registered event loop 2018-05-31 14:18:47.888+0000: 34498176000: warning : virEventRegisterImpl:245 : Ignoring attempt to replace registered event loop 2018-05-31 14:18:47.888+0000: 34498176000: warning : virEventRegisterImpl:245 : Ignoring attempt to replace registered event loop Missing function 'virConnectBaselineHypervisorCPU' Missing function 'virConnectCompareHypervisorCPU' Missing function 'virDomainDetachDeviceAlias' --- FAIL: TestAPICoverage (0.92s) panic: Missing symbols found [recovered] panic: Missing symbols found goroutine 19 [running]: testing.tRunner.func1(0xc4200cc0f0) /usr/local/go/src/testing/testing.go:742 +0x29d panic(0x5aeec0, 0x612410) /usr/local/go/src/runtime/panic.go:505 +0x229 _/usr<https://ci.centos.org/job/libvirt-go-master-check/systems=libvirt-freebsd-10/ws/.TestAPICoverage(0xc4200cc0f0)> /usr<https://ci.centos.org/job/libvirt-go-master-check/systems=libvirt-freebsd-10/ws/api_test.go>:504 +0x548 testing.tRunner(0xc4200cc0f0, 0x5fd490) /usr/local/go/src/testing/testing.go:777 +0xd0 created by testing.(*T).Run /usr/local/go/src/testing/testing.go:824 +0x2e0 exit status 2 FAIL _/usr<https://ci.centos.org/job/libvirt-go-master-check/systems=libvirt-freebsd-10/ws/> 1.067s Build step 'Execute shell' marked build as failure

See <https://ci.centos.org/job/libvirt-go-master-check/systems=libvirt-freebsd-10/1071/display/redirect> ------------------------------------------ Started by upstream project "libvirt-go-master-check" build number 1071 originally caused by: Started by upstream project "libvirt-go-master-build" build number 1082 originally caused by: Started by upstream project "libvirt-master-build" build number 1479 originally caused by: Started by an SCM change [EnvInject] - Loading node environment variables. Building remotely on libvirt-freebsd-10 (libvirt) in workspace <https://ci.centos.org/job/libvirt-go-master-check/systems=libvirt-freebsd-10/ws/> [libvirt-go-master] $ /bin/sh -xe /tmp/jenkins4139946720354704145.sh + export 'TEST_ARGS=-tags api' + go test -tags api 2018-05-31 15:45:39.501+0000: 34498176000: info : libvirt version: 4.4.0 2018-05-31 15:45:39.501+0000: 34498176000: info : hostname: libvirt-freebsd-10 2018-05-31 15:45:39.501+0000: 34498176000: warning : virEventRegisterImpl:245 : Ignoring attempt to replace registered event loop 2018-05-31 15:45:39.501+0000: 34498176000: warning : virEventRegisterImpl:245 : Ignoring attempt to replace registered event loop 2018-05-31 15:45:39.502+0000: 34498176000: warning : virEventRegisterImpl:245 : Ignoring attempt to replace registered event loop Missing function 'virConnectBaselineHypervisorCPU' Missing function 'virConnectCompareHypervisorCPU' Missing function 'virDomainDetachDeviceAlias' --- FAIL: TestAPICoverage (0.88s) panic: Missing symbols found [recovered] panic: Missing symbols found goroutine 19 [running]: testing.tRunner.func1(0xc4200cc0f0) /usr/local/go/src/testing/testing.go:742 +0x29d panic(0x5aeec0, 0x612410) /usr/local/go/src/runtime/panic.go:505 +0x229 _/usr<https://ci.centos.org/job/libvirt-go-master-check/systems=libvirt-freebsd-10/ws/.TestAPICoverage(0xc4200cc0f0)> /usr<https://ci.centos.org/job/libvirt-go-master-check/systems=libvirt-freebsd-10/ws/api_test.go>:504 +0x548 testing.tRunner(0xc4200cc0f0, 0x5fd490) /usr/local/go/src/testing/testing.go:777 +0xd0 created by testing.(*T).Run /usr/local/go/src/testing/testing.go:824 +0x2e0 exit status 2 FAIL _/usr<https://ci.centos.org/job/libvirt-go-master-check/systems=libvirt-freebsd-10/ws/> 1.041s Build step 'Execute shell' marked build as failure

See <https://ci.centos.org/job/libvirt-go-master-check/systems=libvirt-freebsd-10/1072/display/redirect> ------------------------------------------ Started by upstream project "libvirt-go-master-check" build number 1072 originally caused by: Started by upstream project "libvirt-go-master-build" build number 1083 originally caused by: Started by upstream project "libvirt-master-build" build number 1480 originally caused by: Started by an SCM change [EnvInject] - Loading node environment variables. Building remotely on libvirt-freebsd-10 (libvirt) in workspace <https://ci.centos.org/job/libvirt-go-master-check/systems=libvirt-freebsd-10/ws/> [libvirt-go-master] $ /bin/sh -xe /tmp/jenkins5242356064232903491.sh + export 'TEST_ARGS=-tags api' + go test -tags api 2018-06-01 12:39:08.913+0000: 34498176000: info : libvirt version: 4.4.0 2018-06-01 12:39:08.913+0000: 34498176000: info : hostname: libvirt-freebsd-10 2018-06-01 12:39:08.913+0000: 34498176000: warning : virEventRegisterImpl:245 : Ignoring attempt to replace registered event loop 2018-06-01 12:39:08.914+0000: 34498176000: warning : virEventRegisterImpl:245 : Ignoring attempt to replace registered event loop 2018-06-01 12:39:08.914+0000: 34498176000: warning : virEventRegisterImpl:245 : Ignoring attempt to replace registered event loop Missing function 'virConnectBaselineHypervisorCPU' Missing function 'virConnectCompareHypervisorCPU' Missing function 'virDomainDetachDeviceAlias' --- FAIL: TestAPICoverage (0.32s) panic: Missing symbols found [recovered] panic: Missing symbols found goroutine 5 [running]: testing.tRunner.func1(0xc4200b60f0) /usr/local/go/src/testing/testing.go:742 +0x29d panic(0x5ae480, 0x6116b0) /usr/local/go/src/runtime/panic.go:502 +0x229 _/usr<https://ci.centos.org/job/libvirt-go-master-check/systems=libvirt-freebsd-10/ws/.TestAPICoverage(0xc4200b60f0)> /usr<https://ci.centos.org/job/libvirt-go-master-check/systems=libvirt-freebsd-10/ws/api_test.go>:504 +0x548 testing.tRunner(0xc4200b60f0, 0x5fc908) /usr/local/go/src/testing/testing.go:777 +0xd0 created by testing.(*T).Run /usr/local/go/src/testing/testing.go:824 +0x2e0 exit status 2 FAIL _/usr<https://ci.centos.org/job/libvirt-go-master-check/systems=libvirt-freebsd-10/ws/> 0.433s Build step 'Execute shell' marked build as failure

See <https://ci.centos.org/job/libvirt-go-master-check/systems=libvirt-freebsd-10/1073/display/redirect> ------------------------------------------ Started by upstream project "libvirt-go-master-check" build number 1073 originally caused by: Started by upstream project "libvirt-go-master-build" build number 1084 originally caused by: Started by upstream project "libvirt-master-build" build number 1481 originally caused by: Started by an SCM change Started by an SCM change [EnvInject] - Loading node environment variables. Building remotely on libvirt-freebsd-10 (libvirt) in workspace <https://ci.centos.org/job/libvirt-go-master-check/systems=libvirt-freebsd-10/ws/> [libvirt-go-master] $ /bin/sh -xe /tmp/jenkins2496746302649451228.sh + export 'TEST_ARGS=-tags api' + go test -tags api 2018-06-01 13:58:07.041+0000: 34498176000: info : libvirt version: 4.4.0 2018-06-01 13:58:07.041+0000: 34498176000: info : hostname: libvirt-freebsd-10 2018-06-01 13:58:07.041+0000: 34498176000: warning : virEventRegisterImpl:245 : Ignoring attempt to replace registered event loop 2018-06-01 13:58:07.042+0000: 34498176000: warning : virEventRegisterImpl:245 : Ignoring attempt to replace registered event loop 2018-06-01 13:58:07.042+0000: 34498176000: warning : virEventRegisterImpl:245 : Ignoring attempt to replace registered event loop Missing function 'virConnectBaselineHypervisorCPU' Missing function 'virConnectCompareHypervisorCPU' Missing function 'virDomainDetachDeviceAlias' --- FAIL: TestAPICoverage (0.23s) panic: Missing symbols found [recovered] panic: Missing symbols found goroutine 5 [running]: testing.tRunner.func1(0xc4200b60f0) /usr/local/go/src/testing/testing.go:742 +0x29d panic(0x5ae480, 0x6116b0) /usr/local/go/src/runtime/panic.go:502 +0x229 _/usr<https://ci.centos.org/job/libvirt-go-master-check/systems=libvirt-freebsd-10/ws/.TestAPICoverage(0xc4200b60f0)> /usr<https://ci.centos.org/job/libvirt-go-master-check/systems=libvirt-freebsd-10/ws/api_test.go>:504 +0x548 testing.tRunner(0xc4200b60f0, 0x5fc908) /usr/local/go/src/testing/testing.go:777 +0xd0 created by testing.(*T).Run /usr/local/go/src/testing/testing.go:824 +0x2e0 exit status 2 FAIL _/usr<https://ci.centos.org/job/libvirt-go-master-check/systems=libvirt-freebsd-10/ws/> 0.313s Build step 'Execute shell' marked build as failure

See <https://ci.centos.org/job/libvirt-go-master-check/systems=libvirt-freebsd-10/1074/display/redirect> ------------------------------------------ Started by upstream project "libvirt-go-master-check" build number 1074 originally caused by: Started by upstream project "libvirt-go-master-build" build number 1085 originally caused by: Started by upstream project "libvirt-master-build" build number 1482 originally caused by: Started by an SCM change [EnvInject] - Loading node environment variables. Building remotely on libvirt-freebsd-10 (libvirt) in workspace <https://ci.centos.org/job/libvirt-go-master-check/systems=libvirt-freebsd-10/ws/> [libvirt-go-master] $ /bin/sh -xe /tmp/jenkins2093307177108105342.sh + export 'TEST_ARGS=-tags api' + go test -tags api 2018-06-01 16:29:57.470+0000: 34498176000: info : libvirt version: 4.4.0 2018-06-01 16:29:57.470+0000: 34498176000: info : hostname: libvirt-freebsd-10 2018-06-01 16:29:57.470+0000: 34498176000: warning : virEventRegisterImpl:245 : Ignoring attempt to replace registered event loop 2018-06-01 16:29:57.471+0000: 34498176000: warning : virEventRegisterImpl:245 : Ignoring attempt to replace registered event loop 2018-06-01 16:29:57.471+0000: 34498176000: warning : virEventRegisterImpl:245 : Ignoring attempt to replace registered event loop Missing function 'virConnectBaselineHypervisorCPU' Missing function 'virConnectCompareHypervisorCPU' Missing function 'virDomainDetachDeviceAlias' --- FAIL: TestAPICoverage (0.86s) panic: Missing symbols found [recovered] panic: Missing symbols found goroutine 19 [running]: testing.tRunner.func1(0xc4200cc0f0) /usr/local/go/src/testing/testing.go:742 +0x29d panic(0x5ae480, 0x6116b0) /usr/local/go/src/runtime/panic.go:502 +0x229 _/usr<https://ci.centos.org/job/libvirt-go-master-check/systems=libvirt-freebsd-10/ws/.TestAPICoverage(0xc4200cc0f0)> /usr<https://ci.centos.org/job/libvirt-go-master-check/systems=libvirt-freebsd-10/ws/api_test.go>:504 +0x548 testing.tRunner(0xc4200cc0f0, 0x5fc908) /usr/local/go/src/testing/testing.go:777 +0xd0 created by testing.(*T).Run /usr/local/go/src/testing/testing.go:824 +0x2e0 exit status 2 FAIL _/usr<https://ci.centos.org/job/libvirt-go-master-check/systems=libvirt-freebsd-10/ws/> 1.006s Build step 'Execute shell' marked build as failure

participants (1)
-
ci@centos.org