[Libvirt-ci] Build failed in Jenkins: virt-manager-check » libvirt-fedora-27 #71

See <https://ci.centos.org/job/virt-manager-check/systems=libvirt-fedora-27/71/display/redirect> ------------------------------------------ Started by upstream project "virt-manager-check" build number 71 originally caused by: Started by upstream project "virt-manager-build" build number 71 originally caused by: Started by upstream project "libosinfo-build" build number 13 originally caused by: Started by upstream project "osinfo-db-build" build number 9 originally caused by: Started by an SCM change [EnvInject] - Loading node environment variables. Building remotely on libvirt-fedora-27 (libvirt) in workspace <https://ci.centos.org/job/virt-manager-check/systems=libvirt-fedora-27/ws/> [virt-manager] $ /bin/sh -xe /tmp/jenkins3669462318477617169.sh + /usr/bin/python3 ./setup.py test running test ....................................................................................................................................................................................................................................................s..FF..................................................................................................................................................................................s ====================================================================== FAIL: testCLI0125virt_install_kvm_rhel7 (tests.clitest.CLITests) ---------------------------------------------------------------------- Traceback (most recent call last): File "<https://ci.centos.org/job/virt-manager-check/systems=libvirt-fedora-27/ws/tests/clitest.py",> line 1047, in <lambda> return lambda s: cmdtemplate(s, cmd) File "<https://ci.centos.org/job/virt-manager-check/systems=libvirt-fedora-27/ws/tests/clitest.py",> line 1046, in cmdtemplate _cmdobj.run(self) File "<https://ci.centos.org/job/virt-manager-check/systems=libvirt-fedora-27/ws/tests/clitest.py",> line 223, in run tests.fail(err) AssertionError: ./virt-install --name foobar --ram 64 --print-step all --connect __virtinst_test__test://<https://ci.centos.org/job/virt-manager-check/systems=libvirt-fedora-27/ws/tests/testdriver.xml,predictable,qemu,domcaps=/home/jenkins/virt-manager/tests/capabilities-xml/kvm-x86_64-domcaps.xml,caps=/home/jenkins/virt-manager/tests/capabilities-xml/kvm-x86_64.xml> --noautoconsole --disk /dev/default-pool/testvol1.img --pxe --os-variant rhel7.0 Conversion outputs did not match. --- tests/cli-test-xml/compare/virt-install-kvm-rhel7.xml +++ Generated Output @@ -72,6 +72,9 @@ </video> <redirdev bus="usb" type="spicevmc"/> <redirdev bus="usb" type="spicevmc"/> + <rng model="virtio"> + <backend model="random">/dev/urandom</backend> + </rng> </devices> </domain> <domain type="kvm"> @@ -146,5 +149,8 @@ </video> <redirdev bus="usb" type="spicevmc"/> <redirdev bus="usb" type="spicevmc"/> + <rng model="virtio"> + <backend model="random">/dev/urandom</backend> + </rng> </devices> </domain> ====================================================================== FAIL: testCLI0126virt_install_kvm_centos7 (tests.clitest.CLITests) ---------------------------------------------------------------------- Traceback (most recent call last): File "<https://ci.centos.org/job/virt-manager-check/systems=libvirt-fedora-27/ws/tests/clitest.py",> line 1047, in <lambda> return lambda s: cmdtemplate(s, cmd) File "<https://ci.centos.org/job/virt-manager-check/systems=libvirt-fedora-27/ws/tests/clitest.py",> line 1046, in cmdtemplate _cmdobj.run(self) File "<https://ci.centos.org/job/virt-manager-check/systems=libvirt-fedora-27/ws/tests/clitest.py",> line 223, in run tests.fail(err) AssertionError: ./virt-install --name foobar --ram 64 --print-step all --connect __virtinst_test__test://<https://ci.centos.org/job/virt-manager-check/systems=libvirt-fedora-27/ws/tests/testdriver.xml,predictable,qemu,domcaps=/home/jenkins/virt-manager/tests/capabilities-xml/kvm-x86_64-domcaps.xml,caps=/home/jenkins/virt-manager/tests/capabilities-xml/kvm-x86_64.xml> --noautoconsole --disk /dev/default-pool/testvol1.img --pxe --os-variant centos7.0 Conversion outputs did not match. --- tests/cli-test-xml/compare/virt-install-kvm-centos7.xml +++ Generated Output @@ -72,6 +72,9 @@ </video> <redirdev bus="usb" type="spicevmc"/> <redirdev bus="usb" type="spicevmc"/> + <rng model="virtio"> + <backend model="random">/dev/urandom</backend> + </rng> </devices> </domain> <domain type="kvm"> @@ -146,5 +149,8 @@ </video> <redirdev bus="usb" type="spicevmc"/> <redirdev bus="usb" type="spicevmc"/> + <rng model="virtio"> + <backend model="random">/dev/urandom</backend> + </rng> </devices> </domain> ---------------------------------------------------------------------- Ran 428 tests in 52.403s FAILED (failures=2, skipped=2) Build step 'Execute shell' marked build as failure

See <https://ci.centos.org/job/virt-manager-check/systems=libvirt-fedora-27/72/display/redirect> ------------------------------------------ Started by upstream project "virt-manager-check" build number 72 originally caused by: Started by upstream project "virt-manager-build" build number 72 originally caused by: Started by upstream project "libvirt-python-build" build number 49 originally caused by: Started by upstream project "libvirt-build" build number 71 originally caused by: Started by an SCM change [EnvInject] - Loading node environment variables. Building remotely on libvirt-fedora-27 (libvirt) in workspace <https://ci.centos.org/job/virt-manager-check/systems=libvirt-fedora-27/ws/> [virt-manager] $ /bin/sh -xe /tmp/jenkins4836294920176873874.sh + /usr/bin/python3 ./setup.py test running test ....................................................................................................................................................................................................................................................s..FF..................................................................................................................................................................................s ====================================================================== FAIL: testCLI0125virt_install_kvm_rhel7 (tests.clitest.CLITests) ---------------------------------------------------------------------- Traceback (most recent call last): File "<https://ci.centos.org/job/virt-manager-check/systems=libvirt-fedora-27/ws/tests/clitest.py",> line 1047, in <lambda> return lambda s: cmdtemplate(s, cmd) File "<https://ci.centos.org/job/virt-manager-check/systems=libvirt-fedora-27/ws/tests/clitest.py",> line 1046, in cmdtemplate _cmdobj.run(self) File "<https://ci.centos.org/job/virt-manager-check/systems=libvirt-fedora-27/ws/tests/clitest.py",> line 223, in run tests.fail(err) AssertionError: ./virt-install --name foobar --ram 64 --print-step all --connect __virtinst_test__test://<https://ci.centos.org/job/virt-manager-check/systems=libvirt-fedora-27/ws/tests/testdriver.xml,predictable,qemu,domcaps=/home/jenkins/virt-manager/tests/capabilities-xml/kvm-x86_64-domcaps.xml,caps=/home/jenkins/virt-manager/tests/capabilities-xml/kvm-x86_64.xml> --noautoconsole --disk /dev/default-pool/testvol1.img --pxe --os-variant rhel7.0 Conversion outputs did not match. --- tests/cli-test-xml/compare/virt-install-kvm-rhel7.xml +++ Generated Output @@ -72,6 +72,9 @@ </video> <redirdev bus="usb" type="spicevmc"/> <redirdev bus="usb" type="spicevmc"/> + <rng model="virtio"> + <backend model="random">/dev/urandom</backend> + </rng> </devices> </domain> <domain type="kvm"> @@ -146,5 +149,8 @@ </video> <redirdev bus="usb" type="spicevmc"/> <redirdev bus="usb" type="spicevmc"/> + <rng model="virtio"> + <backend model="random">/dev/urandom</backend> + </rng> </devices> </domain> ====================================================================== FAIL: testCLI0126virt_install_kvm_centos7 (tests.clitest.CLITests) ---------------------------------------------------------------------- Traceback (most recent call last): File "<https://ci.centos.org/job/virt-manager-check/systems=libvirt-fedora-27/ws/tests/clitest.py",> line 1047, in <lambda> return lambda s: cmdtemplate(s, cmd) File "<https://ci.centos.org/job/virt-manager-check/systems=libvirt-fedora-27/ws/tests/clitest.py",> line 1046, in cmdtemplate _cmdobj.run(self) File "<https://ci.centos.org/job/virt-manager-check/systems=libvirt-fedora-27/ws/tests/clitest.py",> line 223, in run tests.fail(err) AssertionError: ./virt-install --name foobar --ram 64 --print-step all --connect __virtinst_test__test://<https://ci.centos.org/job/virt-manager-check/systems=libvirt-fedora-27/ws/tests/testdriver.xml,predictable,qemu,domcaps=/home/jenkins/virt-manager/tests/capabilities-xml/kvm-x86_64-domcaps.xml,caps=/home/jenkins/virt-manager/tests/capabilities-xml/kvm-x86_64.xml> --noautoconsole --disk /dev/default-pool/testvol1.img --pxe --os-variant centos7.0 Conversion outputs did not match. --- tests/cli-test-xml/compare/virt-install-kvm-centos7.xml +++ Generated Output @@ -72,6 +72,9 @@ </video> <redirdev bus="usb" type="spicevmc"/> <redirdev bus="usb" type="spicevmc"/> + <rng model="virtio"> + <backend model="random">/dev/urandom</backend> + </rng> </devices> </domain> <domain type="kvm"> @@ -146,5 +149,8 @@ </video> <redirdev bus="usb" type="spicevmc"/> <redirdev bus="usb" type="spicevmc"/> + <rng model="virtio"> + <backend model="random">/dev/urandom</backend> + </rng> </devices> </domain> ---------------------------------------------------------------------- Ran 428 tests in 48.868s FAILED (failures=2, skipped=2) Build step 'Execute shell' marked build as failure

See <https://ci.centos.org/job/virt-manager-check/systems=libvirt-fedora-27/73/display/redirect> ------------------------------------------ Started by upstream project "virt-manager-check" build number 73 originally caused by: Started by upstream project "virt-manager-build" build number 73 originally caused by: Started by upstream project "libvirt-python-build" build number 50 originally caused by: Started by upstream project "libvirt-build" build number 72 originally caused by: Started by an SCM change [EnvInject] - Loading node environment variables. Building remotely on libvirt-fedora-27 (libvirt) in workspace <https://ci.centos.org/job/virt-manager-check/systems=libvirt-fedora-27/ws/> [virt-manager] $ /bin/sh -xe /tmp/jenkins8954034929136181913.sh + /usr/bin/python3 ./setup.py test running test ....................................................................................................................................................................................................................................................s..FF..................................................................................................................................................................................s ====================================================================== FAIL: testCLI0125virt_install_kvm_rhel7 (tests.clitest.CLITests) ---------------------------------------------------------------------- Traceback (most recent call last): File "<https://ci.centos.org/job/virt-manager-check/systems=libvirt-fedora-27/ws/tests/clitest.py",> line 1047, in <lambda> return lambda s: cmdtemplate(s, cmd) File "<https://ci.centos.org/job/virt-manager-check/systems=libvirt-fedora-27/ws/tests/clitest.py",> line 1046, in cmdtemplate _cmdobj.run(self) File "<https://ci.centos.org/job/virt-manager-check/systems=libvirt-fedora-27/ws/tests/clitest.py",> line 223, in run tests.fail(err) AssertionError: ./virt-install --name foobar --ram 64 --print-step all --connect __virtinst_test__test://<https://ci.centos.org/job/virt-manager-check/systems=libvirt-fedora-27/ws/tests/testdriver.xml,predictable,qemu,domcaps=/home/jenkins/virt-manager/tests/capabilities-xml/kvm-x86_64-domcaps.xml,caps=/home/jenkins/virt-manager/tests/capabilities-xml/kvm-x86_64.xml> --noautoconsole --disk /dev/default-pool/testvol1.img --pxe --os-variant rhel7.0 Conversion outputs did not match. --- tests/cli-test-xml/compare/virt-install-kvm-rhel7.xml +++ Generated Output @@ -72,6 +72,9 @@ </video> <redirdev bus="usb" type="spicevmc"/> <redirdev bus="usb" type="spicevmc"/> + <rng model="virtio"> + <backend model="random">/dev/urandom</backend> + </rng> </devices> </domain> <domain type="kvm"> @@ -146,5 +149,8 @@ </video> <redirdev bus="usb" type="spicevmc"/> <redirdev bus="usb" type="spicevmc"/> + <rng model="virtio"> + <backend model="random">/dev/urandom</backend> + </rng> </devices> </domain> ====================================================================== FAIL: testCLI0126virt_install_kvm_centos7 (tests.clitest.CLITests) ---------------------------------------------------------------------- Traceback (most recent call last): File "<https://ci.centos.org/job/virt-manager-check/systems=libvirt-fedora-27/ws/tests/clitest.py",> line 1047, in <lambda> return lambda s: cmdtemplate(s, cmd) File "<https://ci.centos.org/job/virt-manager-check/systems=libvirt-fedora-27/ws/tests/clitest.py",> line 1046, in cmdtemplate _cmdobj.run(self) File "<https://ci.centos.org/job/virt-manager-check/systems=libvirt-fedora-27/ws/tests/clitest.py",> line 223, in run tests.fail(err) AssertionError: ./virt-install --name foobar --ram 64 --print-step all --connect __virtinst_test__test://<https://ci.centos.org/job/virt-manager-check/systems=libvirt-fedora-27/ws/tests/testdriver.xml,predictable,qemu,domcaps=/home/jenkins/virt-manager/tests/capabilities-xml/kvm-x86_64-domcaps.xml,caps=/home/jenkins/virt-manager/tests/capabilities-xml/kvm-x86_64.xml> --noautoconsole --disk /dev/default-pool/testvol1.img --pxe --os-variant centos7.0 Conversion outputs did not match. --- tests/cli-test-xml/compare/virt-install-kvm-centos7.xml +++ Generated Output @@ -72,6 +72,9 @@ </video> <redirdev bus="usb" type="spicevmc"/> <redirdev bus="usb" type="spicevmc"/> + <rng model="virtio"> + <backend model="random">/dev/urandom</backend> + </rng> </devices> </domain> <domain type="kvm"> @@ -146,5 +149,8 @@ </video> <redirdev bus="usb" type="spicevmc"/> <redirdev bus="usb" type="spicevmc"/> + <rng model="virtio"> + <backend model="random">/dev/urandom</backend> + </rng> </devices> </domain> ---------------------------------------------------------------------- Ran 428 tests in 128.705s FAILED (failures=2, skipped=2) Build step 'Execute shell' marked build as failure

participants (1)
-
ci@centos.org