Build failed in Jenkins: virt-manager-check » libvirt-fedora-30 #1456

See <https://ci.centos.org/job/virt-manager-check/systems=libvirt-fedora-30/1456/display/redirect> ------------------------------------------ Started by upstream project "virt-manager-check" build number 1456 originally caused by: Started by upstream project "virt-manager-build" build number 1460 originally caused by: Started by an SCM change Running as SYSTEM [EnvInject] - Loading node environment variables. Building remotely on libvirt-fedora-30 (libvirt) in workspace <https://ci.centos.org/job/virt-manager-check/systems=libvirt-fedora-30/ws/> [virt-manager] $ /bin/sh -xe /tmp/jenkins13999224590799386200.sh + /usr/bin/python3 ./setup.py test running test ............................................................F........................................................................................................................................................................................................................................................................................................................................................................................................................................................................................................................sssssssssssssssss ====================================================================== FAIL: test_dir_searchable (tests.test_xmlconfig.TestXMLMisc) ---------------------------------------------------------------------- Traceback (most recent call last): File "<https://ci.centos.org/job/virt-manager-check/systems=libvirt-fedora-30/ws/tests/utils.py",> line 230, in wrapper_cb return cb(*args, **kwargs) File "<https://ci.centos.org/job/virt-manager-check/systems=libvirt-fedora-30/ws/tests/test_xmlconfig.py",> line 204, in test_dir_searchable self.assertTrue(bool(searchdata.fixlist)) AssertionError: False is not true ---------------------------------------------------------------------- Ran 582 tests in 106.038s FAILED (failures=1, skipped=17) Build step 'Execute shell' marked build as failure

See <https://ci.centos.org/job/virt-manager-check/systems=libvirt-fedora-30/1457/display/redirect> ------------------------------------------ Started by upstream project "virt-manager-check" build number 1457 originally caused by: Started by upstream project "virt-manager-build" build number 1461 originally caused by: Started by an SCM change Running as SYSTEM [EnvInject] - Loading node environment variables. Building remotely on libvirt-fedora-30 (libvirt) in workspace <https://ci.centos.org/job/virt-manager-check/systems=libvirt-fedora-30/ws/> [virt-manager] $ /bin/sh -xe /tmp/jenkins3961932851212311621.sh + /usr/bin/python3 ./setup.py test running test ............................................................F.......................................................................................................................................................................................................................................................................................................................................................................................................................................................................................................................sssssssssssssssss ====================================================================== FAIL: test_dir_searchable (tests.test_xmlconfig.TestXMLMisc) ---------------------------------------------------------------------- Traceback (most recent call last): File "<https://ci.centos.org/job/virt-manager-check/systems=libvirt-fedora-30/ws/tests/utils.py",> line 230, in wrapper_cb return cb(*args, **kwargs) File "<https://ci.centos.org/job/virt-manager-check/systems=libvirt-fedora-30/ws/tests/test_xmlconfig.py",> line 204, in test_dir_searchable self.assertTrue(bool(searchdata.fixlist)) AssertionError: False is not true ---------------------------------------------------------------------- Ran 581 tests in 65.549s FAILED (failures=1, skipped=17) Build step 'Execute shell' marked build as failure

See <https://ci.centos.org/job/virt-manager-check/systems=libvirt-fedora-30/1458/display/redirect> ------------------------------------------ Started by upstream project "virt-manager-check" build number 1458 originally caused by: Started by upstream project "virt-manager-build" build number 1462 originally caused by: Started by upstream project "libvirt-python-build" build number 988 originally caused by: Started by upstream project "libvirt-build" build number 1143 originally caused by: Started by an SCM change Running as SYSTEM [EnvInject] - Loading node environment variables. Building remotely on libvirt-fedora-30 (libvirt) in workspace <https://ci.centos.org/job/virt-manager-check/systems=libvirt-fedora-30/ws/> [virt-manager] $ /bin/sh -xe /tmp/jenkins7306917614330748962.sh + /usr/bin/python3 ./setup.py test running test ............................................................F.......................................................................................................................................................................................................................................................................................................................................................................................................................................................................................................................sssssssssssssssss ====================================================================== FAIL: test_dir_searchable (tests.test_xmlconfig.TestXMLMisc) ---------------------------------------------------------------------- Traceback (most recent call last): File "<https://ci.centos.org/job/virt-manager-check/systems=libvirt-fedora-30/ws/tests/utils.py",> line 230, in wrapper_cb return cb(*args, **kwargs) File "<https://ci.centos.org/job/virt-manager-check/systems=libvirt-fedora-30/ws/tests/test_xmlconfig.py",> line 204, in test_dir_searchable self.assertTrue(bool(searchdata.fixlist)) AssertionError: False is not true ---------------------------------------------------------------------- Ran 581 tests in 200.328s FAILED (failures=1, skipped=17) Build step 'Execute shell' marked build as failure

See <https://ci.centos.org/job/virt-manager-check/systems=libvirt-fedora-30/1459/display/redirect> ------------------------------------------ Started by upstream project "virt-manager-check" build number 1459 originally caused by: Started by upstream project "virt-manager-build" build number 1463 originally caused by: Started by upstream project "libvirt-python-build" build number 989 originally caused by: Started by upstream project "libvirt-build" build number 1144 originally caused by: Started by an SCM change Running as SYSTEM [EnvInject] - Loading node environment variables. Building remotely on libvirt-fedora-30 (libvirt) in workspace <https://ci.centos.org/job/virt-manager-check/systems=libvirt-fedora-30/ws/> [virt-manager] $ /bin/sh -xe /tmp/jenkins9958975027073142718.sh + /usr/bin/python3 ./setup.py test running test ............................................................F.......................................................................................................................................................................................................................................................................................................................................................................................................................................................................................................................sssssssssssssssss ====================================================================== FAIL: test_dir_searchable (tests.test_xmlconfig.TestXMLMisc) ---------------------------------------------------------------------- Traceback (most recent call last): File "<https://ci.centos.org/job/virt-manager-check/systems=libvirt-fedora-30/ws/tests/utils.py",> line 230, in wrapper_cb return cb(*args, **kwargs) File "<https://ci.centos.org/job/virt-manager-check/systems=libvirt-fedora-30/ws/tests/test_xmlconfig.py",> line 204, in test_dir_searchable self.assertTrue(bool(searchdata.fixlist)) AssertionError: False is not true ---------------------------------------------------------------------- Ran 581 tests in 174.809s FAILED (failures=1, skipped=17) Build step 'Execute shell' marked build as failure

See <https://ci.centos.org/job/virt-manager-check/systems=libvirt-fedora-30/1460/display/redirect> ------------------------------------------ Started by upstream project "virt-manager-check" build number 1460 originally caused by: Started by upstream project "virt-manager-build" build number 1464 originally caused by: Started by upstream project "libvirt-python-build" build number 990 originally caused by: Started by upstream project "libvirt-build" build number 1145 originally caused by: Started by an SCM change Running as SYSTEM [EnvInject] - Loading node environment variables. Building remotely on libvirt-fedora-30 (libvirt) in workspace <https://ci.centos.org/job/virt-manager-check/systems=libvirt-fedora-30/ws/> [virt-manager] $ /bin/sh -xe /tmp/jenkins10804979290949542225.sh + /usr/bin/python3 ./setup.py test running test ............................................................F.......................................................................................................................................................................................................................................................................................................................................................................................................................................................................................................................sssssssssssssssss ====================================================================== FAIL: test_dir_searchable (tests.test_xmlconfig.TestXMLMisc) ---------------------------------------------------------------------- Traceback (most recent call last): File "<https://ci.centos.org/job/virt-manager-check/systems=libvirt-fedora-30/ws/tests/utils.py",> line 230, in wrapper_cb return cb(*args, **kwargs) File "<https://ci.centos.org/job/virt-manager-check/systems=libvirt-fedora-30/ws/tests/test_xmlconfig.py",> line 204, in test_dir_searchable self.assertTrue(bool(searchdata.fixlist)) AssertionError: False is not true ---------------------------------------------------------------------- Ran 581 tests in 208.719s FAILED (failures=1, skipped=17) Build step 'Execute shell' marked build as failure

See <https://ci.centos.org/job/virt-manager-check/systems=libvirt-fedora-30/1461/display/redirect> ------------------------------------------ Started by upstream project "virt-manager-check" build number 1461 originally caused by: Started by upstream project "virt-manager-build" build number 1465 originally caused by: Started by an SCM change Running as SYSTEM [EnvInject] - Loading node environment variables. Building remotely on libvirt-fedora-30 (libvirt) in workspace <https://ci.centos.org/job/virt-manager-check/systems=libvirt-fedora-30/ws/> [virt-manager] $ /bin/sh -xe /tmp/jenkins12010867067320608029.sh + /usr/bin/python3 ./setup.py test running test ............................................................F.......................................................................................................................................................................................................................................................................................................................................................................................................................................................................................................................sssssssssssssssss ====================================================================== FAIL: test_dir_searchable (tests.test_xmlconfig.TestXMLMisc) ---------------------------------------------------------------------- Traceback (most recent call last): File "<https://ci.centos.org/job/virt-manager-check/systems=libvirt-fedora-30/ws/tests/utils.py",> line 230, in wrapper_cb return cb(*args, **kwargs) File "<https://ci.centos.org/job/virt-manager-check/systems=libvirt-fedora-30/ws/tests/test_xmlconfig.py",> line 204, in test_dir_searchable self.assertTrue(bool(searchdata.fixlist)) AssertionError: False is not true ---------------------------------------------------------------------- Ran 581 tests in 67.104s FAILED (failures=1, skipped=17) Build step 'Execute shell' marked build as failure

See <https://ci.centos.org/job/virt-manager-check/systems=libvirt-fedora-30/1462/display/redirect> ------------------------------------------ Started by upstream project "virt-manager-check" build number 1462 originally caused by: Started by upstream project "virt-manager-build" build number 1466 originally caused by: Started by upstream project "libvirt-python-build" build number 991 originally caused by: Started by upstream project "libvirt-build" build number 1146 originally caused by: Started by an SCM change Running as SYSTEM [EnvInject] - Loading node environment variables. Building remotely on libvirt-fedora-30 (libvirt) in workspace <https://ci.centos.org/job/virt-manager-check/systems=libvirt-fedora-30/ws/> [virt-manager] $ /bin/sh -xe /tmp/jenkins3226122296271479003.sh + /usr/bin/python3 ./setup.py test running test ............................................................F.......................................................................................................................................................................................................................................................................................................................................................................................................................................................................................................................sssssssssssssssss ====================================================================== FAIL: test_dir_searchable (tests.test_xmlconfig.TestXMLMisc) ---------------------------------------------------------------------- Traceback (most recent call last): File "<https://ci.centos.org/job/virt-manager-check/systems=libvirt-fedora-30/ws/tests/utils.py",> line 230, in wrapper_cb return cb(*args, **kwargs) File "<https://ci.centos.org/job/virt-manager-check/systems=libvirt-fedora-30/ws/tests/test_xmlconfig.py",> line 204, in test_dir_searchable self.assertTrue(bool(searchdata.fixlist)) AssertionError: False is not true ---------------------------------------------------------------------- Ran 581 tests in 210.556s FAILED (failures=1, skipped=17) Build step 'Execute shell' marked build as failure

participants (1)
-
ci@centos.org