Build failed in Jenkins: virt-manager-check » libvirt-freebsd-11 #1456

See <https://ci.centos.org/job/virt-manager-check/systems=libvirt-freebsd-11/1456/display/redirect> ------------------------------------------ Started by upstream project "virt-manager-check" build number 1456 originally caused by: Started by upstream project "virt-manager-build" build number 1460 originally caused by: Started by an SCM change Running as SYSTEM [EnvInject] - Loading node environment variables. Building remotely on libvirt-freebsd-11 (libvirt) in workspace <https://ci.centos.org/job/virt-manager-check/systems=libvirt-freebsd-11/ws/> [virt-manager] $ /bin/sh -xe /tmp/jenkins14796128689004324296.sh + /usr/local/bin/python3 ./setup.py test running test ............................................................F......................................................................................................................................................GLib-GIO-Message: 00:05:01.192: Using the 'memory' GSettings backend. Your settings will not be saved or shared with other applications. ..................................................................................................................................................................................................................................................................................................................................................................sssssssssssssssss ====================================================================== FAIL: test_dir_searchable (tests.test_xmlconfig.TestXMLMisc) ---------------------------------------------------------------------- Traceback (most recent call last): File "/usr<https://ci.centos.org/job/virt-manager-check/systems=libvirt-freebsd-11/ws/tests/utils.py",> line 230, in wrapper_cb return cb(*args, **kwargs) File "/usr<https://ci.centos.org/job/virt-manager-check/systems=libvirt-freebsd-11/ws/tests/test_xmlconfig.py",> line 204, in test_dir_searchable self.assertTrue(bool(searchdata.fixlist)) AssertionError: False is not true ---------------------------------------------------------------------- Ran 582 tests in 118.174s FAILED (failures=1, skipped=17) Build step 'Execute shell' marked build as failure

See <https://ci.centos.org/job/virt-manager-check/systems=libvirt-freebsd-11/1457/display/redirect> ------------------------------------------ Started by upstream project "virt-manager-check" build number 1457 originally caused by: Started by upstream project "virt-manager-build" build number 1461 originally caused by: Started by an SCM change Running as SYSTEM [EnvInject] - Loading node environment variables. Building remotely on libvirt-freebsd-11 (libvirt) in workspace <https://ci.centos.org/job/virt-manager-check/systems=libvirt-freebsd-11/ws/> [virt-manager] $ /bin/sh -xe /tmp/jenkins16626008942446168219.sh + /usr/local/bin/python3 ./setup.py test running test ............................................................F......................................................................................................................................................GLib-GIO-Message: 00:24:17.243: Using the 'memory' GSettings backend. Your settings will not be saved or shared with other applications. .................................................................................................................................................................................................................................................................................................................................................................sssssssssssssssss ====================================================================== FAIL: test_dir_searchable (tests.test_xmlconfig.TestXMLMisc) ---------------------------------------------------------------------- Traceback (most recent call last): File "/usr<https://ci.centos.org/job/virt-manager-check/systems=libvirt-freebsd-11/ws/tests/utils.py",> line 230, in wrapper_cb return cb(*args, **kwargs) File "/usr<https://ci.centos.org/job/virt-manager-check/systems=libvirt-freebsd-11/ws/tests/test_xmlconfig.py",> line 204, in test_dir_searchable self.assertTrue(bool(searchdata.fixlist)) AssertionError: False is not true ---------------------------------------------------------------------- Ran 581 tests in 78.985s FAILED (failures=1, skipped=17) Build step 'Execute shell' marked build as failure

See <https://ci.centos.org/job/virt-manager-check/systems=libvirt-freebsd-11/1458/display/redirect> ------------------------------------------ Started by upstream project "virt-manager-check" build number 1458 originally caused by: Started by upstream project "virt-manager-build" build number 1462 originally caused by: Started by upstream project "libvirt-python-build" build number 988 originally caused by: Started by upstream project "libvirt-build" build number 1143 originally caused by: Started by an SCM change Running as SYSTEM [EnvInject] - Loading node environment variables. Building remotely on libvirt-freebsd-11 (libvirt) in workspace <https://ci.centos.org/job/virt-manager-check/systems=libvirt-freebsd-11/ws/> [virt-manager] $ /bin/sh -xe /tmp/jenkins12336446447241630655.sh + /usr/local/bin/python3 ./setup.py test running test ............................................................F......................................................................................................................................................GLib-GIO-Message: 01:38:42.319: Using the 'memory' GSettings backend. Your settings will not be saved or shared with other applications. .................................................................................................................................................................................................................................................................................................................................................................sssssssssssssssss ====================================================================== FAIL: test_dir_searchable (tests.test_xmlconfig.TestXMLMisc) ---------------------------------------------------------------------- Traceback (most recent call last): File "/usr<https://ci.centos.org/job/virt-manager-check/systems=libvirt-freebsd-11/ws/tests/utils.py",> line 230, in wrapper_cb return cb(*args, **kwargs) File "/usr<https://ci.centos.org/job/virt-manager-check/systems=libvirt-freebsd-11/ws/tests/test_xmlconfig.py",> line 204, in test_dir_searchable self.assertTrue(bool(searchdata.fixlist)) AssertionError: False is not true ---------------------------------------------------------------------- Ran 581 tests in 142.297s FAILED (failures=1, skipped=17) Build step 'Execute shell' marked build as failure

See <https://ci.centos.org/job/virt-manager-check/systems=libvirt-freebsd-11/1459/display/redirect> ------------------------------------------ Started by upstream project "virt-manager-check" build number 1459 originally caused by: Started by upstream project "virt-manager-build" build number 1463 originally caused by: Started by upstream project "libvirt-python-build" build number 989 originally caused by: Started by upstream project "libvirt-build" build number 1144 originally caused by: Started by an SCM change Running as SYSTEM [EnvInject] - Loading node environment variables. Building remotely on libvirt-freebsd-11 (libvirt) in workspace <https://ci.centos.org/job/virt-manager-check/systems=libvirt-freebsd-11/ws/> [virt-manager] $ /bin/sh -xe /tmp/jenkins12652259062799359340.sh + /usr/local/bin/python3 ./setup.py test running test ............................................................F......................................................................................................................................................GLib-GIO-Message: 09:11:53.896: Using the 'memory' GSettings backend. Your settings will not be saved or shared with other applications. .................................................................................................................................................................................................................................................................................................................................................................sssssssssssssssss ====================================================================== FAIL: test_dir_searchable (tests.test_xmlconfig.TestXMLMisc) ---------------------------------------------------------------------- Traceback (most recent call last): File "/usr<https://ci.centos.org/job/virt-manager-check/systems=libvirt-freebsd-11/ws/tests/utils.py",> line 230, in wrapper_cb return cb(*args, **kwargs) File "/usr<https://ci.centos.org/job/virt-manager-check/systems=libvirt-freebsd-11/ws/tests/test_xmlconfig.py",> line 204, in test_dir_searchable self.assertTrue(bool(searchdata.fixlist)) AssertionError: False is not true ---------------------------------------------------------------------- Ran 581 tests in 154.310s FAILED (failures=1, skipped=17) Build step 'Execute shell' marked build as failure

See <https://ci.centos.org/job/virt-manager-check/systems=libvirt-freebsd-11/1460/display/redirect> ------------------------------------------ Started by upstream project "virt-manager-check" build number 1460 originally caused by: Started by upstream project "virt-manager-build" build number 1464 originally caused by: Started by upstream project "libvirt-python-build" build number 990 originally caused by: Started by upstream project "libvirt-build" build number 1145 originally caused by: Started by an SCM change Running as SYSTEM [EnvInject] - Loading node environment variables. Building remotely on libvirt-freebsd-11 (libvirt) in workspace <https://ci.centos.org/job/virt-manager-check/systems=libvirt-freebsd-11/ws/> [virt-manager] $ /bin/sh -xe /tmp/jenkins10034026009291487933.sh + /usr/local/bin/python3 ./setup.py test running test ............................................................F......................................................................................................................................................GLib-GIO-Message: 12:43:45.926: Using the 'memory' GSettings backend. Your settings will not be saved or shared with other applications. .................................................................................................................................................................................................................................................................................................................................................................sssssssssssssssss ====================================================================== FAIL: test_dir_searchable (tests.test_xmlconfig.TestXMLMisc) ---------------------------------------------------------------------- Traceback (most recent call last): File "/usr<https://ci.centos.org/job/virt-manager-check/systems=libvirt-freebsd-11/ws/tests/utils.py",> line 230, in wrapper_cb return cb(*args, **kwargs) File "/usr<https://ci.centos.org/job/virt-manager-check/systems=libvirt-freebsd-11/ws/tests/test_xmlconfig.py",> line 204, in test_dir_searchable self.assertTrue(bool(searchdata.fixlist)) AssertionError: False is not true ---------------------------------------------------------------------- Ran 581 tests in 113.766s FAILED (failures=1, skipped=17) Build step 'Execute shell' marked build as failure

See <https://ci.centos.org/job/virt-manager-check/systems=libvirt-freebsd-11/1461/display/redirect> ------------------------------------------ Started by upstream project "virt-manager-check" build number 1461 originally caused by: Started by upstream project "virt-manager-build" build number 1465 originally caused by: Started by an SCM change Running as SYSTEM [EnvInject] - Loading node environment variables. Building remotely on libvirt-freebsd-11 (libvirt) in workspace <https://ci.centos.org/job/virt-manager-check/systems=libvirt-freebsd-11/ws/> [virt-manager] $ /bin/sh -xe /tmp/jenkins10309608464536168346.sh + /usr/local/bin/python3 ./setup.py test running test ............................................................F......................................................................................................................................................GLib-GIO-Message: 15:24:18.473: Using the 'memory' GSettings backend. Your settings will not be saved or shared with other applications. .................................................................................................................................................................................................................................................................................................................................................................sssssssssssssssss ====================================================================== FAIL: test_dir_searchable (tests.test_xmlconfig.TestXMLMisc) ---------------------------------------------------------------------- Traceback (most recent call last): File "/usr<https://ci.centos.org/job/virt-manager-check/systems=libvirt-freebsd-11/ws/tests/utils.py",> line 230, in wrapper_cb return cb(*args, **kwargs) File "/usr<https://ci.centos.org/job/virt-manager-check/systems=libvirt-freebsd-11/ws/tests/test_xmlconfig.py",> line 204, in test_dir_searchable self.assertTrue(bool(searchdata.fixlist)) AssertionError: False is not true ---------------------------------------------------------------------- Ran 581 tests in 80.413s FAILED (failures=1, skipped=17) Build step 'Execute shell' marked build as failure

See <https://ci.centos.org/job/virt-manager-check/systems=libvirt-freebsd-11/1462/display/redirect> ------------------------------------------ Started by upstream project "virt-manager-check" build number 1462 originally caused by: Started by upstream project "virt-manager-build" build number 1466 originally caused by: Started by upstream project "libvirt-python-build" build number 991 originally caused by: Started by upstream project "libvirt-build" build number 1146 originally caused by: Started by an SCM change Running as SYSTEM [EnvInject] - Loading node environment variables. Building remotely on libvirt-freebsd-11 (libvirt) in workspace <https://ci.centos.org/job/virt-manager-check/systems=libvirt-freebsd-11/ws/> [virt-manager] $ /bin/sh -xe /tmp/jenkins10765952681212036780.sh + /usr/local/bin/python3 ./setup.py test running test ............................................................F......................................................................................................................................................GLib-GIO-Message: 16:42:16.959: Using the 'memory' GSettings backend. Your settings will not be saved or shared with other applications. .................................................................................................................................................................................................................................................................................................................................................................sssssssssssssssss ====================================================================== FAIL: test_dir_searchable (tests.test_xmlconfig.TestXMLMisc) ---------------------------------------------------------------------- Traceback (most recent call last): File "/usr<https://ci.centos.org/job/virt-manager-check/systems=libvirt-freebsd-11/ws/tests/utils.py",> line 230, in wrapper_cb return cb(*args, **kwargs) File "/usr<https://ci.centos.org/job/virt-manager-check/systems=libvirt-freebsd-11/ws/tests/test_xmlconfig.py",> line 204, in test_dir_searchable self.assertTrue(bool(searchdata.fixlist)) AssertionError: False is not true ---------------------------------------------------------------------- Ran 581 tests in 110.396s FAILED (failures=1, skipped=17) Build step 'Execute shell' marked build as failure

participants (1)
-
ci@centos.org