[Libvirt-ci] Build failed in Jenkins: libosinfo-check » libvirt-freebsd-10 #21

See <https://ci.centos.org/job/libosinfo-check/systems=libvirt-freebsd-10/21/display/redirect> ------------------------------------------ Started by upstream project "libosinfo-check" build number 21 originally caused by: Started by upstream project "libosinfo-syntax-check" build number 21 originally caused by: Started by upstream project "libosinfo-build" build number 21 originally caused by: Started by an SCM change [EnvInject] - Loading node environment variables. Building remotely on libvirt-freebsd-10 (libvirt) in workspace <https://ci.centos.org/job/libosinfo-check/systems=libvirt-freebsd-10/ws/> [libosinfo] $ /bin/sh -xe /tmp/jenkins3629950241586827448.sh + export LIBOSINFO_NETWORK_TESTS=1 + cd build + /usr/local/bin/gmake check Making check in osinfo GEN public-submodule-commit gmake[1]: Entering directory '/usr<https://ci.centos.org/job/libosinfo-check/systems=libvirt-freebsd-10/ws/build/osinfo'> /usr/local/bin/gmake check-am gmake[2]: Entering directory '/usr<https://ci.centos.org/job/libosinfo-check/systems=libvirt-freebsd-10/ws/build/osinfo'> /usr/local/bin/gmake check-local gmake[3]: Entering directory '/usr<https://ci.centos.org/job/libosinfo-check/systems=libvirt-freebsd-10/ws/build/osinfo'> GEN check-symsorting gmake[3]: Leaving directory '/usr<https://ci.centos.org/job/libosinfo-check/systems=libvirt-freebsd-10/ws/build/osinfo'> gmake[2]: Leaving directory '/usr<https://ci.centos.org/job/libosinfo-check/systems=libvirt-freebsd-10/ws/build/osinfo'> gmake[1]: Leaving directory '/usr<https://ci.centos.org/job/libosinfo-check/systems=libvirt-freebsd-10/ws/build/osinfo'> Making check in tools gmake[1]: Entering directory '/usr<https://ci.centos.org/job/libosinfo-check/systems=libvirt-freebsd-10/ws/build/tools'> gmake[1]: Nothing to be done for 'check'. gmake[1]: Leaving directory '/usr<https://ci.centos.org/job/libosinfo-check/systems=libvirt-freebsd-10/ws/build/tools'> Making check in docs gmake[1]: Entering directory '/usr<https://ci.centos.org/job/libosinfo-check/systems=libvirt-freebsd-10/ws/build/docs'> Making check in reference gmake[2]: Entering directory '/usr<https://ci.centos.org/job/libosinfo-check/systems=libvirt-freebsd-10/ws/build/docs/reference'> gmake[2]: Nothing to be done for 'check'. gmake[2]: Leaving directory '/usr<https://ci.centos.org/job/libosinfo-check/systems=libvirt-freebsd-10/ws/build/docs/reference'> gmake[2]: Entering directory '/usr<https://ci.centos.org/job/libosinfo-check/systems=libvirt-freebsd-10/ws/build/docs'> gmake[2]: Nothing to be done for 'check-am'. gmake[2]: Leaving directory '/usr<https://ci.centos.org/job/libosinfo-check/systems=libvirt-freebsd-10/ws/build/docs'> gmake[1]: Leaving directory '/usr<https://ci.centos.org/job/libosinfo-check/systems=libvirt-freebsd-10/ws/build/docs'> Making check in po gmake[1]: Entering directory '/usr<https://ci.centos.org/job/libosinfo-check/systems=libvirt-freebsd-10/ws/build/po'> INTLTOOL_EXTRACT="/usr/local/bin/intltool-extract" XGETTEXT="/usr/local/bin/xgettext" srcdir=../../po /usr/local/bin/intltool-update --gettext-package libosinfo --pot rm -f missing notexist srcdir=../../po /usr/local/bin/intltool-update -m if [ -r missing -o -r notexist ]; then \ exit 1; \ fi gmake[1]: Leaving directory '/usr<https://ci.centos.org/job/libosinfo-check/systems=libvirt-freebsd-10/ws/build/po'> Making check in examples gmake[1]: Entering directory '/usr<https://ci.centos.org/job/libosinfo-check/systems=libvirt-freebsd-10/ws/build/examples'> gmake[1]: Nothing to be done for 'check'. gmake[1]: Leaving directory '/usr<https://ci.centos.org/job/libosinfo-check/systems=libvirt-freebsd-10/ws/build/examples'> Making check in tests gmake[1]: Entering directory '/usr<https://ci.centos.org/job/libosinfo-check/systems=libvirt-freebsd-10/ws/build/tests'> /usr/local/bin/gmake test-entity test-device test-list test-devicelist test-filter test-product test-os test-oslist test-productfilter test-platform test-platformlist test-db test-loader test-isodetect test-install-script test-os-resources test-mediauris test-treeuris gmake[2]: Entering directory '/usr<https://ci.centos.org/job/libosinfo-check/systems=libvirt-freebsd-10/ws/build/tests'> CC test_entity-test-entity.o CC test_device-test-device.o CC test_list-test-list.o CC test_devicelist-test-devicelist.o CC test_filter-test-filter.o CC test_product-test-product.o CC test_os-test-os.o CC test_oslist-test-oslist.o CC test_productfilter-test-productfilter.o CC test_platform-test-platform.o CC test_platformlist-test-platformlist.o CC test_db-test-db.o CC test_loader-test-loader.o CC test_isodetect-test-isodetect.o CC test_install_script-test-install-script.o CC test_os_resources-test-os-resources.o CC test_mediauris-test-mediauris.o CC test_treeuris-test-treeuris.o CCLD test-entity CCLD test-device CCLD test-list CCLD test-devicelist CCLD test-filter CCLD test-product CCLD test-os CCLD test-oslist CCLD test-productfilter CCLD test-platform CCLD test-platformlist CCLD test-db CCLD test-loader CCLD test-isodetect CCLD test-install-script CCLD test-os-resources CCLD test-mediauris CCLD test-treeuris gmake[2]: Leaving directory '/usr<https://ci.centos.org/job/libosinfo-check/systems=libvirt-freebsd-10/ws/build/tests'> /usr/local/bin/gmake check-TESTS gmake[2]: Entering directory '/usr<https://ci.centos.org/job/libosinfo-check/systems=libvirt-freebsd-10/ws/build/tests'> gmake[3]: Entering directory '/usr<https://ci.centos.org/job/libosinfo-check/systems=libvirt-freebsd-10/ws/build/tests'> PASS: test-list PASS: test-entity PASS: test-device PASS: test-devicelist PASS: test-product PASS: test-filter PASS: test-os PASS: test-oslist PASS: test-productfilter PASS: test-platform PASS: test-platformlist PASS: test-db PASS: test-install-script PASS: test-loader PASS: test-os-resources PASS: test-treeuris Abort trap (core dumped) FAIL: test-isodetect Abort trap (core dumped) FAIL: test-mediauris ============================================================================ Testsuite summary for libosinfo 1.3.0 ============================================================================ # TOTAL: 18 # PASS: 16 # SKIP: 0 # XFAIL: 0 # FAIL: 2 # XPASS: 0 # ERROR: 0 ============================================================================ See tests/test-suite.log Please report to libosinfo@redhat.com ============================================================================ gmake[3]: *** [Makefile:1313: test-suite.log] Error 1 gmake[3]: Leaving directory '/usr<https://ci.centos.org/job/libosinfo-check/systems=libvirt-freebsd-10/ws/build/tests'> gmake[2]: *** [Makefile:1421: check-TESTS] Error 2 gmake[2]: Leaving directory '/usr<https://ci.centos.org/job/libosinfo-check/systems=libvirt-freebsd-10/ws/build/tests'> gmake[1]: *** [Makefile:1614: check-am] Error 2 gmake[1]: Leaving directory '/usr<https://ci.centos.org/job/libosinfo-check/systems=libvirt-freebsd-10/ws/build/tests'> gmake: *** [Makefile:594: check-recursive] Error 1 + cat tests/test-suite.log =========================================== libosinfo 1.3.0: tests/test-suite.log =========================================== # TOTAL: 18 # PASS: 16 # SKIP: 0 # XFAIL: 0 # FAIL: 2 # XPASS: 0 # ERROR: 0 .. contents:: :depth: 2 FAIL: test-isodetect ==================== /isodetect/windows: OK /isodetect/ubuntu: OK /isodetect/sles: OK /isodetect/sled: OK /isodetect/rhel: OK /isodetect/popos: OK /isodetect/opensuse: OK /isodetect/openbsd: OK /isodetect/netbsd: OK /isodetect/mageia: OK /isodetect/gnome: OK /isodetect/freedos: OK /isodetect/freebsd: OK /isodetect/fedora: ** ERROR:../../tests/test-isodetect.c:408:test_one: assertion failed (shortid == info->shortid): ("fedora-unknown" == "fedora29") FAIL test-isodetect (exit status: 134) FAIL: test-mediauris ==================== /mediauris/uris: ** ERROR:../../tests/test-mediauris.c:50:test_media: assertion failed (res == CURLE_OK): (28 == 0) FAIL test-mediauris (exit status: 134) + exit 1 Build step 'Execute shell' marked build as failure

See <https://ci.centos.org/job/libosinfo-check/systems=libvirt-freebsd-10/22/display/redirect> ------------------------------------------ Started by upstream project "libosinfo-check" build number 22 originally caused by: Started by upstream project "libosinfo-syntax-check" build number 22 originally caused by: Started by upstream project "libosinfo-build" build number 22 originally caused by: Started by upstream project "osinfo-db-build" build number 15 originally caused by: Started by upstream project "osinfo-db-tools-build" build number 4 originally caused by: Started by an SCM change [EnvInject] - Loading node environment variables. Building remotely on libvirt-freebsd-10 (libvirt) in workspace <https://ci.centos.org/job/libosinfo-check/systems=libvirt-freebsd-10/ws/> [libosinfo] $ /bin/sh -xe /tmp/jenkins3215568832372202462.sh + export LIBOSINFO_NETWORK_TESTS=1 + cd build + /usr/local/bin/gmake check Making check in osinfo GEN public-submodule-commit gmake[1]: Entering directory '/usr<https://ci.centos.org/job/libosinfo-check/systems=libvirt-freebsd-10/ws/build/osinfo'> /usr/local/bin/gmake check-am gmake[2]: Entering directory '/usr<https://ci.centos.org/job/libosinfo-check/systems=libvirt-freebsd-10/ws/build/osinfo'> /usr/local/bin/gmake check-local gmake[3]: Entering directory '/usr<https://ci.centos.org/job/libosinfo-check/systems=libvirt-freebsd-10/ws/build/osinfo'> GEN check-symsorting gmake[3]: Leaving directory '/usr<https://ci.centos.org/job/libosinfo-check/systems=libvirt-freebsd-10/ws/build/osinfo'> gmake[2]: Leaving directory '/usr<https://ci.centos.org/job/libosinfo-check/systems=libvirt-freebsd-10/ws/build/osinfo'> gmake[1]: Leaving directory '/usr<https://ci.centos.org/job/libosinfo-check/systems=libvirt-freebsd-10/ws/build/osinfo'> Making check in tools gmake[1]: Entering directory '/usr<https://ci.centos.org/job/libosinfo-check/systems=libvirt-freebsd-10/ws/build/tools'> gmake[1]: Nothing to be done for 'check'. gmake[1]: Leaving directory '/usr<https://ci.centos.org/job/libosinfo-check/systems=libvirt-freebsd-10/ws/build/tools'> Making check in docs gmake[1]: Entering directory '/usr<https://ci.centos.org/job/libosinfo-check/systems=libvirt-freebsd-10/ws/build/docs'> Making check in reference gmake[2]: Entering directory '/usr<https://ci.centos.org/job/libosinfo-check/systems=libvirt-freebsd-10/ws/build/docs/reference'> gmake[2]: Nothing to be done for 'check'. gmake[2]: Leaving directory '/usr<https://ci.centos.org/job/libosinfo-check/systems=libvirt-freebsd-10/ws/build/docs/reference'> gmake[2]: Entering directory '/usr<https://ci.centos.org/job/libosinfo-check/systems=libvirt-freebsd-10/ws/build/docs'> gmake[2]: Nothing to be done for 'check-am'. gmake[2]: Leaving directory '/usr<https://ci.centos.org/job/libosinfo-check/systems=libvirt-freebsd-10/ws/build/docs'> gmake[1]: Leaving directory '/usr<https://ci.centos.org/job/libosinfo-check/systems=libvirt-freebsd-10/ws/build/docs'> Making check in po gmake[1]: Entering directory '/usr<https://ci.centos.org/job/libosinfo-check/systems=libvirt-freebsd-10/ws/build/po'> INTLTOOL_EXTRACT="/usr/local/bin/intltool-extract" XGETTEXT="/usr/local/bin/xgettext" srcdir=../../po /usr/local/bin/intltool-update --gettext-package libosinfo --pot rm -f missing notexist srcdir=../../po /usr/local/bin/intltool-update -m if [ -r missing -o -r notexist ]; then \ exit 1; \ fi gmake[1]: Leaving directory '/usr<https://ci.centos.org/job/libosinfo-check/systems=libvirt-freebsd-10/ws/build/po'> Making check in examples gmake[1]: Entering directory '/usr<https://ci.centos.org/job/libosinfo-check/systems=libvirt-freebsd-10/ws/build/examples'> gmake[1]: Nothing to be done for 'check'. gmake[1]: Leaving directory '/usr<https://ci.centos.org/job/libosinfo-check/systems=libvirt-freebsd-10/ws/build/examples'> Making check in tests gmake[1]: Entering directory '/usr<https://ci.centos.org/job/libosinfo-check/systems=libvirt-freebsd-10/ws/build/tests'> /usr/local/bin/gmake test-entity test-device test-list test-devicelist test-filter test-product test-os test-oslist test-productfilter test-platform test-platformlist test-db test-loader test-isodetect test-install-script test-os-resources test-mediauris test-treeuris gmake[2]: Entering directory '/usr<https://ci.centos.org/job/libosinfo-check/systems=libvirt-freebsd-10/ws/build/tests'> CC test_entity-test-entity.o CC test_device-test-device.o CC test_list-test-list.o CC test_devicelist-test-devicelist.o CC test_product-test-product.o CC test_filter-test-filter.o CC test_os-test-os.o CC test_oslist-test-oslist.o CC test_productfilter-test-productfilter.o CC test_platform-test-platform.o CC test_platformlist-test-platformlist.o CC test_db-test-db.o CC test_loader-test-loader.o CC test_isodetect-test-isodetect.o CC test_install_script-test-install-script.o CC test_os_resources-test-os-resources.o CC test_mediauris-test-mediauris.o CC test_treeuris-test-treeuris.o CCLD test-entity CCLD test-device CCLD test-list CCLD test-devicelist CCLD test-filter CCLD test-product CCLD test-os CCLD test-oslist CCLD test-productfilter CCLD test-platform CCLD test-platformlist CCLD test-db CCLD test-loader CCLD test-isodetect CCLD test-install-script CCLD test-os-resources CCLD test-mediauris CCLD test-treeuris gmake[2]: Leaving directory '/usr<https://ci.centos.org/job/libosinfo-check/systems=libvirt-freebsd-10/ws/build/tests'> /usr/local/bin/gmake check-TESTS gmake[2]: Entering directory '/usr<https://ci.centos.org/job/libosinfo-check/systems=libvirt-freebsd-10/ws/build/tests'> gmake[3]: Entering directory '/usr<https://ci.centos.org/job/libosinfo-check/systems=libvirt-freebsd-10/ws/build/tests'> PASS: test-entity PASS: test-device PASS: test-list PASS: test-devicelist PASS: test-filter PASS: test-product PASS: test-os PASS: test-productfilter PASS: test-oslist PASS: test-platform PASS: test-db PASS: test-platformlist PASS: test-install-script PASS: test-loader PASS: test-os-resources PASS: test-treeuris PASS: test-isodetect Abort trap (core dumped) FAIL: test-mediauris ============================================================================ Testsuite summary for libosinfo 1.3.0 ============================================================================ # TOTAL: 18 # PASS: 17 # SKIP: 0 # XFAIL: 0 # FAIL: 1 # XPASS: 0 # ERROR: 0 ============================================================================ See tests/test-suite.log Please report to libosinfo@redhat.com ============================================================================ gmake[3]: *** [Makefile:1313: test-suite.log] Error 1 gmake[3]: Leaving directory '/usr<https://ci.centos.org/job/libosinfo-check/systems=libvirt-freebsd-10/ws/build/tests'> gmake[2]: *** [Makefile:1421: check-TESTS] Error 2 gmake[2]: Leaving directory '/usr<https://ci.centos.org/job/libosinfo-check/systems=libvirt-freebsd-10/ws/build/tests'> gmake[1]: *** [Makefile:1614: check-am] Error 2 gmake[1]: Leaving directory '/usr<https://ci.centos.org/job/libosinfo-check/systems=libvirt-freebsd-10/ws/build/tests'> gmake: *** [Makefile:594: check-recursive] Error 1 + cat tests/test-suite.log =========================================== libosinfo 1.3.0: tests/test-suite.log =========================================== # TOTAL: 18 # PASS: 17 # SKIP: 0 # XFAIL: 0 # FAIL: 1 # XPASS: 0 # ERROR: 0 .. contents:: :depth: 2 FAIL: test-mediauris ==================== /mediauris/uris: ** ERROR:../../tests/test-mediauris.c:50:test_media: assertion failed (res == CURLE_OK): (28 == 0) FAIL test-mediauris (exit status: 134) + exit 1 Build step 'Execute shell' marked build as failure

See <https://ci.centos.org/job/libosinfo-check/systems=libvirt-freebsd-10/23/display/redirect> ------------------------------------------ Started by upstream project "libosinfo-check" build number 23 originally caused by: Started by upstream project "libosinfo-syntax-check" build number 23 originally caused by: Started by upstream project "libosinfo-build" build number 23 originally caused by: Started by upstream project "osinfo-db-build" build number 16 originally caused by: Started by an SCM change [EnvInject] - Loading node environment variables. Building remotely on libvirt-freebsd-10 (libvirt) in workspace <https://ci.centos.org/job/libosinfo-check/systems=libvirt-freebsd-10/ws/> [libosinfo] $ /bin/sh -xe /tmp/jenkins3059141723157413431.sh + export LIBOSINFO_NETWORK_TESTS=1 + cd build + /usr/local/bin/gmake check Making check in osinfo GEN public-submodule-commit gmake[1]: Entering directory '/usr<https://ci.centos.org/job/libosinfo-check/systems=libvirt-freebsd-10/ws/build/osinfo'> /usr/local/bin/gmake check-am gmake[2]: Entering directory '/usr<https://ci.centos.org/job/libosinfo-check/systems=libvirt-freebsd-10/ws/build/osinfo'> /usr/local/bin/gmake check-local gmake[3]: Entering directory '/usr<https://ci.centos.org/job/libosinfo-check/systems=libvirt-freebsd-10/ws/build/osinfo'> GEN check-symsorting gmake[3]: Leaving directory '/usr<https://ci.centos.org/job/libosinfo-check/systems=libvirt-freebsd-10/ws/build/osinfo'> gmake[2]: Leaving directory '/usr<https://ci.centos.org/job/libosinfo-check/systems=libvirt-freebsd-10/ws/build/osinfo'> gmake[1]: Leaving directory '/usr<https://ci.centos.org/job/libosinfo-check/systems=libvirt-freebsd-10/ws/build/osinfo'> Making check in tools gmake[1]: Entering directory '/usr<https://ci.centos.org/job/libosinfo-check/systems=libvirt-freebsd-10/ws/build/tools'> gmake[1]: Nothing to be done for 'check'. gmake[1]: Leaving directory '/usr<https://ci.centos.org/job/libosinfo-check/systems=libvirt-freebsd-10/ws/build/tools'> Making check in docs gmake[1]: Entering directory '/usr<https://ci.centos.org/job/libosinfo-check/systems=libvirt-freebsd-10/ws/build/docs'> Making check in reference gmake[2]: Entering directory '/usr<https://ci.centos.org/job/libosinfo-check/systems=libvirt-freebsd-10/ws/build/docs/reference'> gmake[2]: Nothing to be done for 'check'. gmake[2]: Leaving directory '/usr<https://ci.centos.org/job/libosinfo-check/systems=libvirt-freebsd-10/ws/build/docs/reference'> gmake[2]: Entering directory '/usr<https://ci.centos.org/job/libosinfo-check/systems=libvirt-freebsd-10/ws/build/docs'> gmake[2]: Nothing to be done for 'check-am'. gmake[2]: Leaving directory '/usr<https://ci.centos.org/job/libosinfo-check/systems=libvirt-freebsd-10/ws/build/docs'> gmake[1]: Leaving directory '/usr<https://ci.centos.org/job/libosinfo-check/systems=libvirt-freebsd-10/ws/build/docs'> Making check in po gmake[1]: Entering directory '/usr<https://ci.centos.org/job/libosinfo-check/systems=libvirt-freebsd-10/ws/build/po'> INTLTOOL_EXTRACT="/usr/local/bin/intltool-extract" XGETTEXT="/usr/local/bin/xgettext" srcdir=../../po /usr/local/bin/intltool-update --gettext-package libosinfo --pot rm -f missing notexist srcdir=../../po /usr/local/bin/intltool-update -m if [ -r missing -o -r notexist ]; then \ exit 1; \ fi gmake[1]: Leaving directory '/usr<https://ci.centos.org/job/libosinfo-check/systems=libvirt-freebsd-10/ws/build/po'> Making check in examples gmake[1]: Entering directory '/usr<https://ci.centos.org/job/libosinfo-check/systems=libvirt-freebsd-10/ws/build/examples'> gmake[1]: Nothing to be done for 'check'. gmake[1]: Leaving directory '/usr<https://ci.centos.org/job/libosinfo-check/systems=libvirt-freebsd-10/ws/build/examples'> Making check in tests gmake[1]: Entering directory '/usr<https://ci.centos.org/job/libosinfo-check/systems=libvirt-freebsd-10/ws/build/tests'> /usr/local/bin/gmake test-entity test-device test-list test-devicelist test-filter test-product test-os test-oslist test-productfilter test-platform test-platformlist test-db test-loader test-isodetect test-install-script test-os-resources test-mediauris test-treeuris gmake[2]: Entering directory '/usr<https://ci.centos.org/job/libosinfo-check/systems=libvirt-freebsd-10/ws/build/tests'> CC test_device-test-device.o CC test_entity-test-entity.o CC test_list-test-list.o CC test_devicelist-test-devicelist.o CC test_filter-test-filter.o CC test_product-test-product.o CC test_os-test-os.o CC test_oslist-test-oslist.o CC test_productfilter-test-productfilter.o CC test_platform-test-platform.o CC test_platformlist-test-platformlist.o CC test_db-test-db.o CC test_loader-test-loader.o CC test_isodetect-test-isodetect.o CC test_install_script-test-install-script.o CC test_os_resources-test-os-resources.o CC test_mediauris-test-mediauris.o CC test_treeuris-test-treeuris.o CCLD test-entity CCLD test-device CCLD test-list CCLD test-devicelist CCLD test-filter CCLD test-product CCLD test-os CCLD test-oslist CCLD test-productfilter CCLD test-platform CCLD test-platformlist CCLD test-db CCLD test-loader CCLD test-install-script CCLD test-isodetect CCLD test-os-resources CCLD test-mediauris CCLD test-treeuris gmake[2]: Leaving directory '/usr<https://ci.centos.org/job/libosinfo-check/systems=libvirt-freebsd-10/ws/build/tests'> /usr/local/bin/gmake check-TESTS gmake[2]: Entering directory '/usr<https://ci.centos.org/job/libosinfo-check/systems=libvirt-freebsd-10/ws/build/tests'> gmake[3]: Entering directory '/usr<https://ci.centos.org/job/libosinfo-check/systems=libvirt-freebsd-10/ws/build/tests'> PASS: test-entity PASS: test-device PASS: test-devicelist PASS: test-list PASS: test-filter PASS: test-product PASS: test-os PASS: test-oslist PASS: test-productfilter PASS: test-platform PASS: test-platformlist PASS: test-db PASS: test-install-script PASS: test-loader PASS: test-os-resources PASS: test-treeuris PASS: test-isodetect Abort trap (core dumped) FAIL: test-mediauris ============================================================================ Testsuite summary for libosinfo 1.3.0 ============================================================================ # TOTAL: 18 # PASS: 17 # SKIP: 0 # XFAIL: 0 # FAIL: 1 # XPASS: 0 # ERROR: 0 ============================================================================ See tests/test-suite.log Please report to libosinfo@redhat.com ============================================================================ gmake[3]: *** [Makefile:1313: test-suite.log] Error 1 gmake[3]: Leaving directory '/usr<https://ci.centos.org/job/libosinfo-check/systems=libvirt-freebsd-10/ws/build/tests'> gmake[2]: *** [Makefile:1421: check-TESTS] Error 2 gmake[2]: Leaving directory '/usr<https://ci.centos.org/job/libosinfo-check/systems=libvirt-freebsd-10/ws/build/tests'> gmake[1]: *** [Makefile:1614: check-am] Error 2 gmake[1]: Leaving directory '/usr<https://ci.centos.org/job/libosinfo-check/systems=libvirt-freebsd-10/ws/build/tests'> gmake: *** [Makefile:594: check-recursive] Error 1 + cat tests/test-suite.log =========================================== libosinfo 1.3.0: tests/test-suite.log =========================================== # TOTAL: 18 # PASS: 17 # SKIP: 0 # XFAIL: 0 # FAIL: 1 # XPASS: 0 # ERROR: 0 .. contents:: :depth: 2 FAIL: test-mediauris ==================== /mediauris/uris: ** ERROR:../../tests/test-mediauris.c:50:test_media: assertion failed (res == CURLE_OK): (28 == 0) FAIL test-mediauris (exit status: 134) + exit 1 Build step 'Execute shell' marked build as failure

participants (1)
-
ci@centos.org