[Libvirt-ci] Build failed in Jenkins: libvirt-go-check » libvirt-fedora-rawhide #257

See <https://ci.centos.org/job/libvirt-go-check/systems=libvirt-fedora-rawhide/257/display/redirect> ------------------------------------------ Started by upstream project "libvirt-go-check" build number 257 originally caused by: Started by upstream project "libvirt-go-build" build number 261 originally caused by: Started by upstream project "libvirt-build" build number 323 originally caused by: Started by an SCM change [EnvInject] - Loading node environment variables. Building remotely on libvirt-fedora-rawhide (libvirt) in workspace <https://ci.centos.org/job/libvirt-go-check/systems=libvirt-fedora-rawhide/ws/> [libvirt-go] $ /bin/sh -xe /tmp/jenkins3926659834677798696.sh + export 'TEST_ARGS=-tags api' + TEST_ARGS='-tags api' + go test -tags api Missing enum 'VIR_DOMAIN_SAVE_IMAGE_XML_SECURE' Missing enum 'VIR_DOMAIN_SNAPSHOT_XML_SECURE' --- FAIL: TestAPICoverage (1.62s) panic: Missing symbols found [recovered] panic: Missing symbols found goroutine 19 [running]: testing.tRunner.func1(0xc0000c0100) /usr/lib/golang/src/testing/testing.go:827 +0x388 panic(0x5cd4e0, 0x642bb0) /usr/lib/golang/src/runtime/panic.go:522 +0x1b5 _<https://ci.centos.org/job/libvirt-go-check/systems=libvirt-fedora-rawhide/ws/.TestAPICoverage(0xc0000c0100)> <https://ci.centos.org/job/libvirt-go-check/systems=libvirt-fedora-rawhide/ws/api_test.go>:501 +0x551 testing.tRunner(0xc0000c0100, 0x61d0d8) /usr/lib/golang/src/testing/testing.go:862 +0xc0 created by testing.(*T).Run /usr/lib/golang/src/testing/testing.go:913 +0x357 exit status 2 FAIL _<https://ci.centos.org/job/libvirt-go-check/systems=libvirt-fedora-rawhide/ws/> 2.650s Build step 'Execute shell' marked build as failure

See <https://ci.centos.org/job/libvirt-go-check/systems=libvirt-fedora-rawhide/258/display/redirect> ------------------------------------------ Started by upstream project "libvirt-go-check" build number 258 originally caused by: Started by upstream project "libvirt-go-build" build number 262 originally caused by: Started by upstream project "libvirt-build" build number 324 originally caused by: Started by an SCM change [EnvInject] - Loading node environment variables. Building remotely on libvirt-fedora-rawhide (libvirt) in workspace <https://ci.centos.org/job/libvirt-go-check/systems=libvirt-fedora-rawhide/ws/> [libvirt-go] $ /bin/sh -xe /tmp/jenkins2109662308559269806.sh + export 'TEST_ARGS=-tags api' + TEST_ARGS='-tags api' + go test -tags api Missing enum 'VIR_DOMAIN_SAVE_IMAGE_XML_SECURE' Missing enum 'VIR_DOMAIN_SNAPSHOT_XML_SECURE' --- FAIL: TestAPICoverage (0.46s) panic: Missing symbols found [recovered] panic: Missing symbols found goroutine 5 [running]: testing.tRunner.func1(0xc0000aa100) /usr/lib/golang/src/testing/testing.go:827 +0x388 panic(0x5cd4e0, 0x642bb0) /usr/lib/golang/src/runtime/panic.go:522 +0x1b5 _<https://ci.centos.org/job/libvirt-go-check/systems=libvirt-fedora-rawhide/ws/.TestAPICoverage(0xc0000aa100)> <https://ci.centos.org/job/libvirt-go-check/systems=libvirt-fedora-rawhide/ws/api_test.go>:501 +0x551 testing.tRunner(0xc0000aa100, 0x61d0d8) /usr/lib/golang/src/testing/testing.go:862 +0xc0 created by testing.(*T).Run /usr/lib/golang/src/testing/testing.go:913 +0x357 exit status 2 FAIL _<https://ci.centos.org/job/libvirt-go-check/systems=libvirt-fedora-rawhide/ws/> 0.736s Build step 'Execute shell' marked build as failure

See <https://ci.centos.org/job/libvirt-go-check/systems=libvirt-fedora-rawhide/259/display/redirect> ------------------------------------------ Started by upstream project "libvirt-go-check" build number 259 originally caused by: Started by upstream project "libvirt-go-build" build number 263 originally caused by: Started by upstream project "libvirt-build" build number 325 originally caused by: Started by an SCM change [EnvInject] - Loading node environment variables. Building remotely on libvirt-fedora-rawhide (libvirt) in workspace <https://ci.centos.org/job/libvirt-go-check/systems=libvirt-fedora-rawhide/ws/> [libvirt-go] $ /bin/sh -xe /tmp/jenkins2537200324533193966.sh + export 'TEST_ARGS=-tags api' + TEST_ARGS='-tags api' + go test -tags api Missing enum 'VIR_DOMAIN_SAVE_IMAGE_XML_SECURE' Missing enum 'VIR_DOMAIN_SNAPSHOT_XML_SECURE' --- FAIL: TestAPICoverage (1.41s) panic: Missing symbols found [recovered] panic: Missing symbols found goroutine 5 [running]: testing.tRunner.func1(0xc0000aa100) /usr/lib/golang/src/testing/testing.go:827 +0x388 panic(0x5cd4e0, 0x642bb0) /usr/lib/golang/src/runtime/panic.go:522 +0x1b5 _<https://ci.centos.org/job/libvirt-go-check/systems=libvirt-fedora-rawhide/ws/.TestAPICoverage(0xc0000aa100)> <https://ci.centos.org/job/libvirt-go-check/systems=libvirt-fedora-rawhide/ws/api_test.go>:501 +0x551 testing.tRunner(0xc0000aa100, 0x61d0d8) /usr/lib/golang/src/testing/testing.go:862 +0xc0 created by testing.(*T).Run /usr/lib/golang/src/testing/testing.go:913 +0x357 exit status 2 FAIL _<https://ci.centos.org/job/libvirt-go-check/systems=libvirt-fedora-rawhide/ws/> 2.181s Build step 'Execute shell' marked build as failure

See <https://ci.centos.org/job/libvirt-go-check/systems=libvirt-fedora-rawhide/260/display/redirect> ------------------------------------------ Started by upstream project "libvirt-go-check" build number 260 originally caused by: Started by upstream project "libvirt-go-build" build number 264 originally caused by: Started by upstream project "libvirt-build" build number 326 originally caused by: Started by an SCM change Started by an SCM change Started by an SCM change Started by an SCM change Started by an SCM change [EnvInject] - Loading node environment variables. Building remotely on libvirt-fedora-rawhide (libvirt) in workspace <https://ci.centos.org/job/libvirt-go-check/systems=libvirt-fedora-rawhide/ws/> [libvirt-go] $ /bin/sh -xe /tmp/jenkins7420397372456934331.sh + export 'TEST_ARGS=-tags api' + TEST_ARGS='-tags api' + go test -tags api Missing enum 'VIR_DOMAIN_SAVE_IMAGE_XML_SECURE' Missing enum 'VIR_DOMAIN_SNAPSHOT_XML_SECURE' --- FAIL: TestAPICoverage (1.52s) panic: Missing symbols found [recovered] panic: Missing symbols found goroutine 4 [running]: testing.tRunner.func1(0xc0000c4100) /usr/lib/golang/src/testing/testing.go:827 +0x388 panic(0x5cd4e0, 0x642bb0) /usr/lib/golang/src/runtime/panic.go:522 +0x1b5 _<https://ci.centos.org/job/libvirt-go-check/systems=libvirt-fedora-rawhide/ws/.TestAPICoverage(0xc0000c4100)> <https://ci.centos.org/job/libvirt-go-check/systems=libvirt-fedora-rawhide/ws/api_test.go>:501 +0x551 testing.tRunner(0xc0000c4100, 0x61d0d8) /usr/lib/golang/src/testing/testing.go:862 +0xc0 created by testing.(*T).Run /usr/lib/golang/src/testing/testing.go:913 +0x357 exit status 2 FAIL _<https://ci.centos.org/job/libvirt-go-check/systems=libvirt-fedora-rawhide/ws/> 2.194s Build step 'Execute shell' marked build as failure

See <https://ci.centos.org/job/libvirt-go-check/systems=libvirt-fedora-rawhide/261/display/redirect> ------------------------------------------ Started by upstream project "libvirt-go-check" build number 261 originally caused by: Started by upstream project "libvirt-go-build" build number 265 originally caused by: Started by upstream project "libvirt-build" build number 327 originally caused by: Started by an SCM change [EnvInject] - Loading node environment variables. Building remotely on libvirt-fedora-rawhide (libvirt) in workspace <https://ci.centos.org/job/libvirt-go-check/systems=libvirt-fedora-rawhide/ws/> [libvirt-go] $ /bin/sh -xe /tmp/jenkins8756851238167080133.sh + export 'TEST_ARGS=-tags api' + TEST_ARGS='-tags api' + go test -tags api Missing enum 'VIR_DOMAIN_SAVE_IMAGE_XML_SECURE' Missing enum 'VIR_DOMAIN_SNAPSHOT_XML_SECURE' --- FAIL: TestAPICoverage (1.00s) panic: Missing symbols found [recovered] panic: Missing symbols found goroutine 5 [running]: testing.tRunner.func1(0xc0000aa100) /usr/lib/golang/src/testing/testing.go:827 +0x388 panic(0x5cd4e0, 0x642bb0) /usr/lib/golang/src/runtime/panic.go:522 +0x1b5 _<https://ci.centos.org/job/libvirt-go-check/systems=libvirt-fedora-rawhide/ws/.TestAPICoverage(0xc0000aa100)> <https://ci.centos.org/job/libvirt-go-check/systems=libvirt-fedora-rawhide/ws/api_test.go>:501 +0x551 testing.tRunner(0xc0000aa100, 0x61d0d8) /usr/lib/golang/src/testing/testing.go:862 +0xc0 created by testing.(*T).Run /usr/lib/golang/src/testing/testing.go:913 +0x357 exit status 2 FAIL _<https://ci.centos.org/job/libvirt-go-check/systems=libvirt-fedora-rawhide/ws/> 1.433s Build step 'Execute shell' marked build as failure

See <https://ci.centos.org/job/libvirt-go-check/systems=libvirt-fedora-rawhide/262/display/redirect> ------------------------------------------ Started by upstream project "libvirt-go-check" build number 262 originally caused by: Started by upstream project "libvirt-go-build" build number 266 originally caused by: Started by upstream project "libvirt-build" build number 328 originally caused by: Started by an SCM change Started by an SCM change Started by an SCM change Started by an SCM change [EnvInject] - Loading node environment variables. Building remotely on libvirt-fedora-rawhide (libvirt) in workspace <https://ci.centos.org/job/libvirt-go-check/systems=libvirt-fedora-rawhide/ws/> [libvirt-go] $ /bin/sh -xe /tmp/jenkins4160302275292883322.sh + export 'TEST_ARGS=-tags api' + TEST_ARGS='-tags api' + go test -tags api Missing enum 'VIR_DOMAIN_SAVE_IMAGE_XML_SECURE' Missing enum 'VIR_DOMAIN_SNAPSHOT_XML_SECURE' --- FAIL: TestAPICoverage (1.26s) panic: Missing symbols found [recovered] panic: Missing symbols found goroutine 19 [running]: testing.tRunner.func1(0xc0000c2100) /usr/lib/golang/src/testing/testing.go:827 +0x388 panic(0x5cd4e0, 0x642bb0) /usr/lib/golang/src/runtime/panic.go:522 +0x1b5 _<https://ci.centos.org/job/libvirt-go-check/systems=libvirt-fedora-rawhide/ws/.TestAPICoverage(0xc0000c2100)> <https://ci.centos.org/job/libvirt-go-check/systems=libvirt-fedora-rawhide/ws/api_test.go>:501 +0x551 testing.tRunner(0xc0000c2100, 0x61d0d8) /usr/lib/golang/src/testing/testing.go:862 +0xc0 created by testing.(*T).Run /usr/lib/golang/src/testing/testing.go:913 +0x357 exit status 2 FAIL _<https://ci.centos.org/job/libvirt-go-check/systems=libvirt-fedora-rawhide/ws/> 1.689s Build step 'Execute shell' marked build as failure

See <https://ci.centos.org/job/libvirt-go-check/systems=libvirt-fedora-rawhide/263/display/redirect> ------------------------------------------ Started by upstream project "libvirt-go-check" build number 263 originally caused by: Started by upstream project "libvirt-go-build" build number 267 originally caused by: Started by upstream project "libvirt-build" build number 330 originally caused by: Started by an SCM change [EnvInject] - Loading node environment variables. Building remotely on libvirt-fedora-rawhide (libvirt) in workspace <https://ci.centos.org/job/libvirt-go-check/systems=libvirt-fedora-rawhide/ws/> [libvirt-go] $ /bin/sh -xe /tmp/jenkins4346754044646335753.sh + export 'TEST_ARGS=-tags api' + TEST_ARGS='-tags api' + go test -tags api Missing enum 'VIR_DOMAIN_SAVE_IMAGE_XML_SECURE' Missing enum 'VIR_DOMAIN_SNAPSHOT_XML_SECURE' --- FAIL: TestAPICoverage (1.60s) panic: Missing symbols found [recovered] panic: Missing symbols found goroutine 5 [running]: testing.tRunner.func1(0xc0000aa100) /usr/lib/golang/src/testing/testing.go:827 +0x388 panic(0x5cd4e0, 0x642bb0) /usr/lib/golang/src/runtime/panic.go:522 +0x1b5 _<https://ci.centos.org/job/libvirt-go-check/systems=libvirt-fedora-rawhide/ws/.TestAPICoverage(0xc0000aa100)> <https://ci.centos.org/job/libvirt-go-check/systems=libvirt-fedora-rawhide/ws/api_test.go>:501 +0x551 testing.tRunner(0xc0000aa100, 0x61d0d8) /usr/lib/golang/src/testing/testing.go:862 +0xc0 created by testing.(*T).Run /usr/lib/golang/src/testing/testing.go:913 +0x357 exit status 2 FAIL _<https://ci.centos.org/job/libvirt-go-check/systems=libvirt-fedora-rawhide/ws/> 2.028s Build step 'Execute shell' marked build as failure

See <https://ci.centos.org/job/libvirt-go-check/systems=libvirt-fedora-rawhide/264/display/redirect> ------------------------------------------ Started by upstream project "libvirt-go-check" build number 264 originally caused by: Started by upstream project "libvirt-go-build" build number 268 originally caused by: Started by upstream project "libvirt-build" build number 331 originally caused by: Started by an SCM change Started by an SCM change Started by an SCM change [EnvInject] - Loading node environment variables. Building remotely on libvirt-fedora-rawhide (libvirt) in workspace <https://ci.centos.org/job/libvirt-go-check/systems=libvirt-fedora-rawhide/ws/> [libvirt-go] $ /bin/sh -xe /tmp/jenkins8200233995238809298.sh + export 'TEST_ARGS=-tags api' + TEST_ARGS='-tags api' + go test -tags api Missing enum 'VIR_DOMAIN_SAVE_IMAGE_XML_SECURE' Missing enum 'VIR_DOMAIN_SNAPSHOT_XML_SECURE' --- FAIL: TestAPICoverage (1.24s) panic: Missing symbols found [recovered] panic: Missing symbols found goroutine 19 [running]: testing.tRunner.func1(0xc0000c2100) /usr/lib/golang/src/testing/testing.go:827 +0x388 panic(0x5cd4e0, 0x642bb0) /usr/lib/golang/src/runtime/panic.go:522 +0x1b5 _<https://ci.centos.org/job/libvirt-go-check/systems=libvirt-fedora-rawhide/ws/.TestAPICoverage(0xc0000c2100)> <https://ci.centos.org/job/libvirt-go-check/systems=libvirt-fedora-rawhide/ws/api_test.go>:501 +0x551 testing.tRunner(0xc0000c2100, 0x61d0d8) /usr/lib/golang/src/testing/testing.go:862 +0xc0 created by testing.(*T).Run /usr/lib/golang/src/testing/testing.go:913 +0x357 exit status 2 FAIL _<https://ci.centos.org/job/libvirt-go-check/systems=libvirt-fedora-rawhide/ws/> 1.631s Build step 'Execute shell' marked build as failure

See <https://ci.centos.org/job/libvirt-go-check/systems=libvirt-fedora-rawhide/265/display/redirect> ------------------------------------------ Started by upstream project "libvirt-go-check" build number 265 originally caused by: Started by upstream project "libvirt-go-build" build number 269 originally caused by: Started by upstream project "libvirt-build" build number 332 originally caused by: Started by an SCM change [EnvInject] - Loading node environment variables. Building remotely on libvirt-fedora-rawhide (libvirt) in workspace <https://ci.centos.org/job/libvirt-go-check/systems=libvirt-fedora-rawhide/ws/> [libvirt-go] $ /bin/sh -xe /tmp/jenkins3295693089782585952.sh + export 'TEST_ARGS=-tags api' + TEST_ARGS='-tags api' + go test -tags api Missing enum 'VIR_DOMAIN_SAVE_IMAGE_XML_SECURE' Missing enum 'VIR_DOMAIN_SNAPSHOT_XML_SECURE' --- FAIL: TestAPICoverage (1.91s) panic: Missing symbols found [recovered] panic: Missing symbols found goroutine 5 [running]: testing.tRunner.func1(0xc0000aa100) /usr/lib/golang/src/testing/testing.go:827 +0x388 panic(0x5cd4e0, 0x642bb0) /usr/lib/golang/src/runtime/panic.go:522 +0x1b5 _<https://ci.centos.org/job/libvirt-go-check/systems=libvirt-fedora-rawhide/ws/.TestAPICoverage(0xc0000aa100)> <https://ci.centos.org/job/libvirt-go-check/systems=libvirt-fedora-rawhide/ws/api_test.go>:501 +0x551 testing.tRunner(0xc0000aa100, 0x61d0d8) /usr/lib/golang/src/testing/testing.go:862 +0xc0 created by testing.(*T).Run /usr/lib/golang/src/testing/testing.go:913 +0x357 exit status 2 FAIL _<https://ci.centos.org/job/libvirt-go-check/systems=libvirt-fedora-rawhide/ws/> 2.706s Build step 'Execute shell' marked build as failure

See <https://ci.centos.org/job/libvirt-go-check/systems=libvirt-fedora-rawhide/266/display/redirect> ------------------------------------------ Started by upstream project "libvirt-go-check" build number 266 originally caused by: Started by upstream project "libvirt-go-build" build number 270 originally caused by: Started by upstream project "libvirt-build" build number 333 originally caused by: Started by an SCM change [EnvInject] - Loading node environment variables. Building remotely on libvirt-fedora-rawhide (libvirt) in workspace <https://ci.centos.org/job/libvirt-go-check/systems=libvirt-fedora-rawhide/ws/> [libvirt-go] $ /bin/sh -xe /tmp/jenkins3360058991287102006.sh + export 'TEST_ARGS=-tags api' + TEST_ARGS='-tags api' + go test -tags api Missing enum 'VIR_DOMAIN_SAVE_IMAGE_XML_SECURE' Missing enum 'VIR_DOMAIN_SNAPSHOT_XML_SECURE' --- FAIL: TestAPICoverage (1.13s) panic: Missing symbols found [recovered] panic: Missing symbols found goroutine 19 [running]: testing.tRunner.func1(0xc0000c2100) /usr/lib/golang/src/testing/testing.go:827 +0x388 panic(0x5cd4e0, 0x642bb0) /usr/lib/golang/src/runtime/panic.go:522 +0x1b5 _<https://ci.centos.org/job/libvirt-go-check/systems=libvirt-fedora-rawhide/ws/.TestAPICoverage(0xc0000c2100)> <https://ci.centos.org/job/libvirt-go-check/systems=libvirt-fedora-rawhide/ws/api_test.go>:501 +0x551 testing.tRunner(0xc0000c2100, 0x61d0d8) /usr/lib/golang/src/testing/testing.go:862 +0xc0 created by testing.(*T).Run /usr/lib/golang/src/testing/testing.go:913 +0x357 exit status 2 FAIL _<https://ci.centos.org/job/libvirt-go-check/systems=libvirt-fedora-rawhide/ws/> 1.676s Build step 'Execute shell' marked build as failure

See <https://ci.centos.org/job/libvirt-go-check/systems=libvirt-fedora-rawhide/267/display/redirect> ------------------------------------------ Started by upstream project "libvirt-go-check" build number 267 originally caused by: Started by upstream project "libvirt-go-build" build number 271 originally caused by: Started by upstream project "libvirt-build" build number 334 originally caused by: Started by an SCM change [EnvInject] - Loading node environment variables. Building remotely on libvirt-fedora-rawhide (libvirt) in workspace <https://ci.centos.org/job/libvirt-go-check/systems=libvirt-fedora-rawhide/ws/> [libvirt-go] $ /bin/sh -xe /tmp/jenkins6537605799679015778.sh + export 'TEST_ARGS=-tags api' + TEST_ARGS='-tags api' + go test -tags api Missing enum 'VIR_DOMAIN_SAVE_IMAGE_XML_SECURE' Missing enum 'VIR_DOMAIN_SNAPSHOT_XML_SECURE' --- FAIL: TestAPICoverage (1.77s) panic: Missing symbols found [recovered] panic: Missing symbols found goroutine 5 [running]: testing.tRunner.func1(0xc0000aa100) /usr/lib/golang/src/testing/testing.go:827 +0x388 panic(0x5cd4e0, 0x642bb0) /usr/lib/golang/src/runtime/panic.go:522 +0x1b5 _<https://ci.centos.org/job/libvirt-go-check/systems=libvirt-fedora-rawhide/ws/.TestAPICoverage(0xc0000aa100)> <https://ci.centos.org/job/libvirt-go-check/systems=libvirt-fedora-rawhide/ws/api_test.go>:501 +0x551 testing.tRunner(0xc0000aa100, 0x61d0d8) /usr/lib/golang/src/testing/testing.go:862 +0xc0 created by testing.(*T).Run /usr/lib/golang/src/testing/testing.go:913 +0x357 exit status 2 FAIL _<https://ci.centos.org/job/libvirt-go-check/systems=libvirt-fedora-rawhide/ws/> 2.473s Build step 'Execute shell' marked build as failure

participants (1)
-
ci@centos.org