[Libvirt-ci] Build failed in Jenkins: libvirt-go-xml-check » libvirt-freebsd-11 #304

See <https://ci.centos.org/job/libvirt-go-xml-check/systems=libvirt-freebsd-11/304/display/redirect> ------------------------------------------ Started by upstream project "libvirt-go-xml-check" build number 304 originally caused by: Started by upstream project "libvirt-go-xml-build" build number 304 originally caused by: Started by upstream project "libvirt-build" build number 370 originally caused by: Started by an SCM change Started by an SCM change Started by an SCM change Started by an SCM change [EnvInject] - Loading node environment variables. Building remotely on libvirt-freebsd-11 (libvirt) in workspace <https://ci.centos.org/job/libvirt-go-xml-check/systems=libvirt-freebsd-11/ws/> [libvirt-go-xml] $ /bin/sh -xe /tmp/jenkins7915333388051208389.sh + export 'TEST_ARGS=-tags xmlroundtrip' + go test -tags xmlroundtrip --- FAIL: TestRoundTrip (7.16s) xml_test.go:400: testdata/libvirt/tests/qemuxml2argvdata/aarch64-virt-graphics.xml: /domain[0]/devices[0]/channel[0]/source[0]: element in expected XML missing in actual XML FAIL exit status 1 FAIL _/usr<https://ci.centos.org/job/libvirt-go-xml-check/systems=libvirt-freebsd-11/ws/> 7.217s Build step 'Execute shell' marked build as failure

See <https://ci.centos.org/job/libvirt-go-xml-check/systems=libvirt-freebsd-11/305/display/redirect> ------------------------------------------ Started by upstream project "libvirt-go-xml-check" build number 305 originally caused by: Started by upstream project "libvirt-go-xml-build" build number 305 originally caused by: Started by upstream project "libvirt-build" build number 371 originally caused by: Started by an SCM change [EnvInject] - Loading node environment variables. Building remotely on libvirt-freebsd-11 (libvirt) in workspace <https://ci.centos.org/job/libvirt-go-xml-check/systems=libvirt-freebsd-11/ws/> [libvirt-go-xml] $ /bin/sh -xe /tmp/jenkins2433059426694801023.sh + export 'TEST_ARGS=-tags xmlroundtrip' + go test -tags xmlroundtrip --- FAIL: TestRoundTrip (5.86s) xml_test.go:400: testdata/libvirt/tests/qemuxml2argvdata/aarch64-virt-graphics.xml: /domain[0]/devices[0]/channel[0]/source[0]: element in expected XML missing in actual XML FAIL exit status 1 FAIL _/usr<https://ci.centos.org/job/libvirt-go-xml-check/systems=libvirt-freebsd-11/ws/> 5.945s Build step 'Execute shell' marked build as failure

See <https://ci.centos.org/job/libvirt-go-xml-check/systems=libvirt-freebsd-11/306/display/redirect> ------------------------------------------ Started by upstream project "libvirt-go-xml-check" build number 306 originally caused by: Started by upstream project "libvirt-go-xml-build" build number 306 originally caused by: Started by upstream project "libvirt-build" build number 372 originally caused by: Started by an SCM change [EnvInject] - Loading node environment variables. Building remotely on libvirt-freebsd-11 (libvirt) in workspace <https://ci.centos.org/job/libvirt-go-xml-check/systems=libvirt-freebsd-11/ws/> [libvirt-go-xml] $ /bin/sh -xe /tmp/jenkins3752078065375149953.sh + export 'TEST_ARGS=-tags xmlroundtrip' + go test -tags xmlroundtrip --- FAIL: TestRoundTrip (26.75s) xml_test.go:400: testdata/libvirt/tests/qemuxml2argvdata/aarch64-virt-graphics.xml: /domain[0]/devices[0]/channel[0]/source[0]: element in expected XML missing in actual XML FAIL exit status 1 FAIL _/usr<https://ci.centos.org/job/libvirt-go-xml-check/systems=libvirt-freebsd-11/ws/> 26.867s Build step 'Execute shell' marked build as failure

See <https://ci.centos.org/job/libvirt-go-xml-check/systems=libvirt-freebsd-11/307/display/redirect> ------------------------------------------ Started by upstream project "libvirt-go-xml-check" build number 307 originally caused by: Started by upstream project "libvirt-go-xml-build" build number 307 originally caused by: Started by upstream project "libvirt-build" build number 373 originally caused by: Started by an SCM change [EnvInject] - Loading node environment variables. Building remotely on libvirt-freebsd-11 (libvirt) in workspace <https://ci.centos.org/job/libvirt-go-xml-check/systems=libvirt-freebsd-11/ws/> [libvirt-go-xml] $ /bin/sh -xe /tmp/jenkins7702945731298126304.sh + export 'TEST_ARGS=-tags xmlroundtrip' + go test -tags xmlroundtrip --- FAIL: TestRoundTrip (4.62s) xml_test.go:400: testdata/libvirt/tests/qemuxml2argvdata/aarch64-virt-graphics.xml: /domain[0]/devices[0]/channel[0]/source[0]: element in expected XML missing in actual XML FAIL exit status 1 FAIL _/usr<https://ci.centos.org/job/libvirt-go-xml-check/systems=libvirt-freebsd-11/ws/> 4.695s Build step 'Execute shell' marked build as failure

See <https://ci.centos.org/job/libvirt-go-xml-check/systems=libvirt-freebsd-11/308/display/redirect> ------------------------------------------ Started by upstream project "libvirt-go-xml-check" build number 308 originally caused by: Started by upstream project "libvirt-go-xml-build" build number 308 originally caused by: Started by upstream project "libvirt-build" build number 374 originally caused by: Started by an SCM change Started by an SCM change Started by an SCM change Started by an SCM change [EnvInject] - Loading node environment variables. Building remotely on libvirt-freebsd-11 (libvirt) in workspace <https://ci.centos.org/job/libvirt-go-xml-check/systems=libvirt-freebsd-11/ws/> [libvirt-go-xml] $ /bin/sh -xe /tmp/jenkins76983464766861487.sh + export 'TEST_ARGS=-tags xmlroundtrip' + go test -tags xmlroundtrip --- FAIL: TestRoundTrip (9.76s) xml_test.go:400: testdata/libvirt/tests/qemuxml2argvdata/aarch64-os-firmware-efi.xml: /domain[0]/os[0]/@firmware: attribute 'efi' in expected XML missing in actual XML FAIL exit status 1 FAIL _/usr<https://ci.centos.org/job/libvirt-go-xml-check/systems=libvirt-freebsd-11/ws/> 9.899s Build step 'Execute shell' marked build as failure

See <https://ci.centos.org/job/libvirt-go-xml-check/systems=libvirt-freebsd-11/309/display/redirect> ------------------------------------------ Started by upstream project "libvirt-go-xml-check" build number 309 originally caused by: Started by upstream project "libvirt-go-xml-build" build number 309 originally caused by: Started by upstream project "libvirt-build" build number 375 originally caused by: Started by an SCM change Started by an SCM change Started by an SCM change Started by an SCM change Started by an SCM change Started by an SCM change [EnvInject] - Loading node environment variables. Building remotely on libvirt-freebsd-11 (libvirt) in workspace <https://ci.centos.org/job/libvirt-go-xml-check/systems=libvirt-freebsd-11/ws/> [libvirt-go-xml] $ /bin/sh -xe /tmp/jenkins6648503838602688407.sh + export 'TEST_ARGS=-tags xmlroundtrip' + go test -tags xmlroundtrip --- FAIL: TestRoundTrip (4.82s) xml_test.go:400: testdata/libvirt/tests/qemuxml2argvdata/aarch64-os-firmware-efi.xml: /domain[0]/os[0]/@firmware: attribute 'efi' in expected XML missing in actual XML FAIL exit status 1 FAIL _/usr<https://ci.centos.org/job/libvirt-go-xml-check/systems=libvirt-freebsd-11/ws/> 4.903s Build step 'Execute shell' marked build as failure

See <https://ci.centos.org/job/libvirt-go-xml-check/systems=libvirt-freebsd-11/310/display/redirect> ------------------------------------------ Started by upstream project "libvirt-go-xml-check" build number 310 originally caused by: Started by upstream project "libvirt-go-xml-build" build number 310 originally caused by: Started by an SCM change [EnvInject] - Loading node environment variables. Building remotely on libvirt-freebsd-11 (libvirt) in workspace <https://ci.centos.org/job/libvirt-go-xml-check/systems=libvirt-freebsd-11/ws/> [libvirt-go-xml] $ /bin/sh -xe /tmp/jenkins2009840735205339255.sh + export 'TEST_ARGS=-tags xmlroundtrip' + go test -tags xmlroundtrip --- FAIL: TestRoundTrip (6.66s) xml_test.go:400: testdata/libvirt/tests/qemuxml2argvdata/aarch64-virt-graphics.xml: /domain[0]/devices[0]/channel[0]/source[0]: element in expected XML missing in actual XML FAIL exit status 1 FAIL _/usr<https://ci.centos.org/job/libvirt-go-xml-check/systems=libvirt-freebsd-11/ws/> 6.684s Build step 'Execute shell' marked build as failure

See <https://ci.centos.org/job/libvirt-go-xml-check/systems=libvirt-freebsd-11/311/display/redirect> ------------------------------------------ Started by upstream project "libvirt-go-xml-check" build number 311 originally caused by: Started by upstream project "libvirt-go-xml-build" build number 311 originally caused by: Started by an SCM change [EnvInject] - Loading node environment variables. Building remotely on libvirt-freebsd-11 (libvirt) in workspace <https://ci.centos.org/job/libvirt-go-xml-check/systems=libvirt-freebsd-11/ws/> [libvirt-go-xml] $ /bin/sh -xe /tmp/jenkins7659810453663428209.sh + export 'TEST_ARGS=-tags xmlroundtrip' + go test -tags xmlroundtrip --- FAIL: TestRoundTrip (4.98s) xml_test.go:400: testdata/libvirt/tests/qemuxml2argvdata/aarch64-virt-graphics.xml: /domain[0]/devices[0]/channel[0]/source[0]: element in expected XML missing in actual XML FAIL exit status 1 FAIL _/usr<https://ci.centos.org/job/libvirt-go-xml-check/systems=libvirt-freebsd-11/ws/> 5.167s Build step 'Execute shell' marked build as failure

See <https://ci.centos.org/job/libvirt-go-xml-check/systems=libvirt-freebsd-11/312/display/redirect> ------------------------------------------ Started by upstream project "libvirt-go-xml-check" build number 312 originally caused by: Started by upstream project "libvirt-go-xml-build" build number 312 originally caused by: Started by upstream project "libvirt-build" build number 377 originally caused by: Started by an SCM change [EnvInject] - Loading node environment variables. Building remotely on libvirt-freebsd-11 (libvirt) in workspace <https://ci.centos.org/job/libvirt-go-xml-check/systems=libvirt-freebsd-11/ws/> [libvirt-go-xml] $ /bin/sh -xe /tmp/jenkins1013077766458546251.sh + export 'TEST_ARGS=-tags xmlroundtrip' + go test -tags xmlroundtrip --- FAIL: TestRoundTrip (3.34s) xml_test.go:400: testdata/libvirt/tests/qemuxml2argvdata/aarch64-virt-graphics.xml: /domain[0]/devices[0]/channel[0]/source[0]: element in expected XML missing in actual XML FAIL exit status 1 FAIL _/usr<https://ci.centos.org/job/libvirt-go-xml-check/systems=libvirt-freebsd-11/ws/> 3.418s Build step 'Execute shell' marked build as failure

participants (1)
-
ci@centos.org