[Libvirt-ci] Build failed in Jenkins: libvirt-go-xml-master-check » libvirt-fedora-28 #459

See <https://ci.centos.org/job/libvirt-go-xml-master-check/systems=libvirt-fedora-28/459/display/redirect> ------------------------------------------ Started by upstream project "libvirt-go-xml-master-check" build number 459 originally caused by: Started by upstream project "libvirt-go-xml-master-build" build number 467 originally caused by: Started by upstream project "libvirt-master-build" build number 1519 originally caused by: Started by an SCM change Started by an SCM change [EnvInject] - Loading node environment variables. Building remotely on libvirt-fedora-28 (libvirt) in workspace <https://ci.centos.org/job/libvirt-go-xml-master-check/systems=libvirt-fedora-28/ws/> [libvirt-go-xml-master] $ /bin/sh -xe /tmp/jenkins3582368661003813582.sh + export 'TEST_ARGS=-tags xmlroundtrip' + TEST_ARGS='-tags xmlroundtrip' + go test -tags xmlroundtrip --- FAIL: TestRoundTrip (13.90s) xml_test.go:383: testdata/libvirt/tests/genericxml2xmlindata/launch-security-sev.xml: /domain[0]/launch-security[0]: element in expected XML missing in actual XML FAIL exit status 1 FAIL _<https://ci.centos.org/job/libvirt-go-xml-master-check/systems=libvirt-fedora-28/ws/> 13.947s Build step 'Execute shell' marked build as failure

See <https://ci.centos.org/job/libvirt-go-xml-master-check/systems=libvirt-fedora-28/460/display/redirect> ------------------------------------------ Started by upstream project "libvirt-go-xml-master-check" build number 460 originally caused by: Started by upstream project "libvirt-go-xml-master-build" build number 468 originally caused by: Started by upstream project "libvirt-master-build" build number 1520 originally caused by: Started by an SCM change Started by an SCM change Started by an SCM change Started by an SCM change [EnvInject] - Loading node environment variables. Building remotely on libvirt-fedora-28 (libvirt) in workspace <https://ci.centos.org/job/libvirt-go-xml-master-check/systems=libvirt-fedora-28/ws/> [libvirt-go-xml-master] $ /bin/sh -xe /tmp/jenkins938546231397615761.sh + export 'TEST_ARGS=-tags xmlroundtrip' + TEST_ARGS='-tags xmlroundtrip' + go test -tags xmlroundtrip --- FAIL: TestRoundTrip (4.28s) xml_test.go:383: testdata/libvirt/tests/genericxml2xmlindata/launch-security-sev.xml: /domain[0]/launch-security[0]: element in expected XML missing in actual XML FAIL exit status 1 FAIL _<https://ci.centos.org/job/libvirt-go-xml-master-check/systems=libvirt-fedora-28/ws/> 4.543s Build step 'Execute shell' marked build as failure

See <https://ci.centos.org/job/libvirt-go-xml-master-check/systems=libvirt-fedora-28/461/display/redirect> ------------------------------------------ Started by upstream project "libvirt-go-xml-master-check" build number 461 originally caused by: Started by upstream project "libvirt-go-xml-master-build" build number 469 originally caused by: Started by upstream project "libvirt-master-build" build number 1521 originally caused by: Started by an SCM change [EnvInject] - Loading node environment variables. Building remotely on libvirt-fedora-28 (libvirt) in workspace <https://ci.centos.org/job/libvirt-go-xml-master-check/systems=libvirt-fedora-28/ws/> [libvirt-go-xml-master] $ /bin/sh -xe /tmp/jenkins5531184646298424672.sh + export 'TEST_ARGS=-tags xmlroundtrip' + TEST_ARGS='-tags xmlroundtrip' + go test -tags xmlroundtrip --- FAIL: TestRoundTrip (9.31s) xml_test.go:383: testdata/libvirt/tests/genericxml2xmlindata/launch-security-sev.xml: /domain[0]/launch-security[0]: element in expected XML missing in actual XML FAIL exit status 1 FAIL _<https://ci.centos.org/job/libvirt-go-xml-master-check/systems=libvirt-fedora-28/ws/> 9.536s Build step 'Execute shell' marked build as failure

See <https://ci.centos.org/job/libvirt-go-xml-master-check/systems=libvirt-fedora-28/462/display/redirect> ------------------------------------------ Started by upstream project "libvirt-go-xml-master-check" build number 462 originally caused by: Started by upstream project "libvirt-go-xml-master-build" build number 470 originally caused by: Started by upstream project "libvirt-master-build" build number 1522 originally caused by: Started by an SCM change [EnvInject] - Loading node environment variables. Building remotely on libvirt-fedora-28 (libvirt) in workspace <https://ci.centos.org/job/libvirt-go-xml-master-check/systems=libvirt-fedora-28/ws/> [libvirt-go-xml-master] $ /bin/sh -xe /tmp/jenkins7410374754543792645.sh + export 'TEST_ARGS=-tags xmlroundtrip' + TEST_ARGS='-tags xmlroundtrip' + go test -tags xmlroundtrip --- FAIL: TestRoundTrip (7.36s) xml_test.go:383: testdata/libvirt/tests/genericxml2xmlindata/launch-security-sev.xml: /domain[0]/launch-security[0]: element in expected XML missing in actual XML FAIL exit status 1 FAIL _<https://ci.centos.org/job/libvirt-go-xml-master-check/systems=libvirt-fedora-28/ws/> 7.534s Build step 'Execute shell' marked build as failure

See <https://ci.centos.org/job/libvirt-go-xml-master-check/systems=libvirt-fedora-28/463/display/redirect> ------------------------------------------ Started by upstream project "libvirt-go-xml-master-check" build number 463 originally caused by: Started by upstream project "libvirt-go-xml-master-build" build number 471 originally caused by: Started by upstream project "libvirt-master-build" build number 1523 originally caused by: Started by an SCM change [EnvInject] - Loading node environment variables. Building remotely on libvirt-fedora-28 (libvirt) in workspace <https://ci.centos.org/job/libvirt-go-xml-master-check/systems=libvirt-fedora-28/ws/> [libvirt-go-xml-master] $ /bin/sh -xe /tmp/jenkins5066809082190639088.sh + export 'TEST_ARGS=-tags xmlroundtrip' + TEST_ARGS='-tags xmlroundtrip' + go test -tags xmlroundtrip --- FAIL: TestRoundTrip (9.96s) xml_test.go:383: testdata/libvirt/tests/genericxml2xmlindata/launch-security-sev.xml: /domain[0]/launch-security[0]: element in expected XML missing in actual XML FAIL exit status 1 FAIL _<https://ci.centos.org/job/libvirt-go-xml-master-check/systems=libvirt-fedora-28/ws/> 10.245s Build step 'Execute shell' marked build as failure

See <https://ci.centos.org/job/libvirt-go-xml-master-check/systems=libvirt-fedora-28/464/display/redirect> ------------------------------------------ Started by upstream project "libvirt-go-xml-master-check" build number 464 originally caused by: Started by upstream project "libvirt-go-xml-master-build" build number 472 originally caused by: Started by upstream project "libvirt-master-build" build number 1524 originally caused by: Started by an SCM change Started by an SCM change Started by an SCM change [EnvInject] - Loading node environment variables. Building remotely on libvirt-fedora-28 (libvirt) in workspace <https://ci.centos.org/job/libvirt-go-xml-master-check/systems=libvirt-fedora-28/ws/> [libvirt-go-xml-master] $ /bin/sh -xe /tmp/jenkins4616887674714768638.sh + export 'TEST_ARGS=-tags xmlroundtrip' + TEST_ARGS='-tags xmlroundtrip' + go test -tags xmlroundtrip --- FAIL: TestRoundTrip (6.37s) xml_test.go:383: testdata/libvirt/tests/genericxml2xmlindata/launch-security-sev.xml: /domain[0]/launch-security[0]: element in expected XML missing in actual XML FAIL exit status 1 FAIL _<https://ci.centos.org/job/libvirt-go-xml-master-check/systems=libvirt-fedora-28/ws/> 6.605s Build step 'Execute shell' marked build as failure

See <https://ci.centos.org/job/libvirt-go-xml-master-check/systems=libvirt-fedora-28/465/display/redirect> ------------------------------------------ Started by upstream project "libvirt-go-xml-master-check" build number 465 originally caused by: Started by upstream project "libvirt-go-xml-master-build" build number 473 originally caused by: Started by upstream project "libvirt-master-build" build number 1525 originally caused by: Started by an SCM change [EnvInject] - Loading node environment variables. Building remotely on libvirt-fedora-28 (libvirt) in workspace <https://ci.centos.org/job/libvirt-go-xml-master-check/systems=libvirt-fedora-28/ws/> [libvirt-go-xml-master] $ /bin/sh -xe /tmp/jenkins306225367517163252.sh + export 'TEST_ARGS=-tags xmlroundtrip' + TEST_ARGS='-tags xmlroundtrip' + go test -tags xmlroundtrip --- FAIL: TestRoundTrip (12.73s) xml_test.go:383: testdata/libvirt/tests/genericxml2xmlindata/launch-security-sev.xml: /domain[0]/launch-security[0]: element in expected XML missing in actual XML FAIL exit status 1 FAIL _<https://ci.centos.org/job/libvirt-go-xml-master-check/systems=libvirt-fedora-28/ws/> 12.894s Build step 'Execute shell' marked build as failure

See <https://ci.centos.org/job/libvirt-go-xml-master-check/systems=libvirt-fedora-28/466/display/redirect> ------------------------------------------ Started by upstream project "libvirt-go-xml-master-check" build number 466 originally caused by: Started by upstream project "libvirt-go-xml-master-build" build number 474 originally caused by: Started by upstream project "libvirt-master-build" build number 1526 originally caused by: Started by an SCM change [EnvInject] - Loading node environment variables. Building remotely on libvirt-fedora-28 (libvirt) in workspace <https://ci.centos.org/job/libvirt-go-xml-master-check/systems=libvirt-fedora-28/ws/> [libvirt-go-xml-master] $ /bin/sh -xe /tmp/jenkins6487064609962002532.sh + export 'TEST_ARGS=-tags xmlroundtrip' + TEST_ARGS='-tags xmlroundtrip' + go test -tags xmlroundtrip --- FAIL: TestRoundTrip (8.11s) xml_test.go:383: testdata/libvirt/tests/genericxml2xmlindata/launch-security-sev.xml: /domain[0]/launchSecurity[0]: element in expected XML missing in actual XML FAIL exit status 1 FAIL _<https://ci.centos.org/job/libvirt-go-xml-master-check/systems=libvirt-fedora-28/ws/> 8.280s Build step 'Execute shell' marked build as failure

See <https://ci.centos.org/job/libvirt-go-xml-master-check/systems=libvirt-fedora-28/467/display/redirect> ------------------------------------------ Started by upstream project "libvirt-go-xml-master-check" build number 467 originally caused by: Started by upstream project "libvirt-go-xml-master-build" build number 475 originally caused by: Started by upstream project "libvirt-master-build" build number 1527 originally caused by: Started by an SCM change [EnvInject] - Loading node environment variables. Building remotely on libvirt-fedora-28 (libvirt) in workspace <https://ci.centos.org/job/libvirt-go-xml-master-check/systems=libvirt-fedora-28/ws/> [libvirt-go-xml-master] $ /bin/sh -xe /tmp/jenkins2761337371600866256.sh + export 'TEST_ARGS=-tags xmlroundtrip' + TEST_ARGS='-tags xmlroundtrip' + go test -tags xmlroundtrip --- FAIL: TestRoundTrip (9.80s) xml_test.go:383: testdata/libvirt/tests/genericxml2xmlindata/launch-security-sev.xml: /domain[0]/launchSecurity[0]: element in expected XML missing in actual XML FAIL exit status 1 FAIL _<https://ci.centos.org/job/libvirt-go-xml-master-check/systems=libvirt-fedora-28/ws/> 10.008s Build step 'Execute shell' marked build as failure

See <https://ci.centos.org/job/libvirt-go-xml-master-check/systems=libvirt-fedora-28/468/display/redirect> ------------------------------------------ Started by upstream project "libvirt-go-xml-master-check" build number 468 originally caused by: Started by upstream project "libvirt-go-xml-master-build" build number 476 originally caused by: Started by upstream project "libvirt-master-build" build number 1528 originally caused by: Started by an SCM change [EnvInject] - Loading node environment variables. Building remotely on libvirt-fedora-28 (libvirt) in workspace <https://ci.centos.org/job/libvirt-go-xml-master-check/systems=libvirt-fedora-28/ws/> [libvirt-go-xml-master] $ /bin/sh -xe /tmp/jenkins214719967550851863.sh + export 'TEST_ARGS=-tags xmlroundtrip' + TEST_ARGS='-tags xmlroundtrip' + go test -tags xmlroundtrip --- FAIL: TestRoundTrip (11.88s) xml_test.go:383: testdata/libvirt/tests/genericxml2xmlindata/launch-security-sev.xml: /domain[0]/launchSecurity[0]: element in expected XML missing in actual XML FAIL exit status 1 FAIL _<https://ci.centos.org/job/libvirt-go-xml-master-check/systems=libvirt-fedora-28/ws/> 12.033s Build step 'Execute shell' marked build as failure

See <https://ci.centos.org/job/libvirt-go-xml-master-check/systems=libvirt-fedora-28/469/display/redirect> ------------------------------------------ Started by upstream project "libvirt-go-xml-master-check" build number 469 originally caused by: Started by upstream project "libvirt-go-xml-master-build" build number 477 originally caused by: Started by upstream project "libvirt-master-build" build number 1529 originally caused by: Started by an SCM change Started by an SCM change Started by an SCM change [EnvInject] - Loading node environment variables. Building remotely on libvirt-fedora-28 (libvirt) in workspace <https://ci.centos.org/job/libvirt-go-xml-master-check/systems=libvirt-fedora-28/ws/> [libvirt-go-xml-master] $ /bin/sh -xe /tmp/jenkins7698606637610192087.sh + export 'TEST_ARGS=-tags xmlroundtrip' + TEST_ARGS='-tags xmlroundtrip' + go test -tags xmlroundtrip --- FAIL: TestRoundTrip (6.13s) xml_test.go:383: testdata/libvirt/tests/genericxml2xmlindata/launch-security-sev.xml: /domain[0]/launchSecurity[0]: element in expected XML missing in actual XML FAIL exit status 1 FAIL _<https://ci.centos.org/job/libvirt-go-xml-master-check/systems=libvirt-fedora-28/ws/> 6.377s Build step 'Execute shell' marked build as failure

See <https://ci.centos.org/job/libvirt-go-xml-master-check/systems=libvirt-fedora-28/470/display/redirect> ------------------------------------------ Started by upstream project "libvirt-go-xml-master-check" build number 470 originally caused by: Started by upstream project "libvirt-go-xml-master-build" build number 478 originally caused by: Started by upstream project "libvirt-master-build" build number 1530 originally caused by: Started by an SCM change [EnvInject] - Loading node environment variables. Building remotely on libvirt-fedora-28 (libvirt) in workspace <https://ci.centos.org/job/libvirt-go-xml-master-check/systems=libvirt-fedora-28/ws/> [libvirt-go-xml-master] $ /bin/sh -xe /tmp/jenkins8733149498240830889.sh + export 'TEST_ARGS=-tags xmlroundtrip' + TEST_ARGS='-tags xmlroundtrip' + go test -tags xmlroundtrip --- FAIL: TestRoundTrip (11.54s) xml_test.go:383: testdata/libvirt/tests/genericxml2xmlindata/launch-security-sev.xml: /domain[0]/launchSecurity[0]: element in expected XML missing in actual XML FAIL exit status 1 FAIL _<https://ci.centos.org/job/libvirt-go-xml-master-check/systems=libvirt-fedora-28/ws/> 11.775s Build step 'Execute shell' marked build as failure

See <https://ci.centos.org/job/libvirt-go-xml-master-check/systems=libvirt-fedora-28/471/display/redirect> ------------------------------------------ Started by upstream project "libvirt-go-xml-master-check" build number 471 originally caused by: Started by upstream project "libvirt-go-xml-master-build" build number 479 originally caused by: Started by upstream project "libvirt-master-build" build number 1531 originally caused by: Started by an SCM change [EnvInject] - Loading node environment variables. Building remotely on libvirt-fedora-28 (libvirt) in workspace <https://ci.centos.org/job/libvirt-go-xml-master-check/systems=libvirt-fedora-28/ws/> [libvirt-go-xml-master] $ /bin/sh -xe /tmp/jenkins6512036118439531130.sh + export 'TEST_ARGS=-tags xmlroundtrip' + TEST_ARGS='-tags xmlroundtrip' + go test -tags xmlroundtrip --- FAIL: TestRoundTrip (8.03s) xml_test.go:383: testdata/libvirt/tests/genericxml2xmlindata/launch-security-sev.xml: /domain[0]/launchSecurity[0]: element in expected XML missing in actual XML FAIL exit status 1 FAIL _<https://ci.centos.org/job/libvirt-go-xml-master-check/systems=libvirt-fedora-28/ws/> 8.226s Build step 'Execute shell' marked build as failure

See <https://ci.centos.org/job/libvirt-go-xml-master-check/systems=libvirt-fedora-28/472/display/redirect> ------------------------------------------ Started by upstream project "libvirt-go-xml-master-check" build number 472 originally caused by: Started by upstream project "libvirt-go-xml-master-build" build number 480 originally caused by: Started by upstream project "libvirt-master-build" build number 1532 originally caused by: Started by an SCM change [EnvInject] - Loading node environment variables. Building remotely on libvirt-fedora-28 (libvirt) in workspace <https://ci.centos.org/job/libvirt-go-xml-master-check/systems=libvirt-fedora-28/ws/> [libvirt-go-xml-master] $ /bin/sh -xe /tmp/jenkins7034510691640832423.sh + export 'TEST_ARGS=-tags xmlroundtrip' + TEST_ARGS='-tags xmlroundtrip' + go test -tags xmlroundtrip --- FAIL: TestRoundTrip (8.60s) xml_test.go:383: testdata/libvirt/tests/genericxml2xmlindata/launch-security-sev.xml: /domain[0]/launchSecurity[0]: element in expected XML missing in actual XML FAIL exit status 1 FAIL _<https://ci.centos.org/job/libvirt-go-xml-master-check/systems=libvirt-fedora-28/ws/> 8.832s Build step 'Execute shell' marked build as failure

See <https://ci.centos.org/job/libvirt-go-xml-master-check/systems=libvirt-fedora-28/473/display/redirect> ------------------------------------------ Started by upstream project "libvirt-go-xml-master-check" build number 473 originally caused by: Started by upstream project "libvirt-go-xml-master-build" build number 481 originally caused by: Started by upstream project "libvirt-master-build" build number 1533 originally caused by: Started by an SCM change [EnvInject] - Loading node environment variables. Building remotely on libvirt-fedora-28 (libvirt) in workspace <https://ci.centos.org/job/libvirt-go-xml-master-check/systems=libvirt-fedora-28/ws/> [libvirt-go-xml-master] $ /bin/sh -xe /tmp/jenkins7971388838563345436.sh + export 'TEST_ARGS=-tags xmlroundtrip' + TEST_ARGS='-tags xmlroundtrip' + go test -tags xmlroundtrip --- FAIL: TestRoundTrip (9.78s) xml_test.go:383: testdata/libvirt/tests/genericxml2xmlindata/launch-security-sev.xml: /domain[0]/launchSecurity[0]: element in expected XML missing in actual XML FAIL exit status 1 FAIL _<https://ci.centos.org/job/libvirt-go-xml-master-check/systems=libvirt-fedora-28/ws/> 9.932s Build step 'Execute shell' marked build as failure

See <https://ci.centos.org/job/libvirt-go-xml-master-check/systems=libvirt-fedora-28/474/display/redirect> ------------------------------------------ Started by upstream project "libvirt-go-xml-master-check" build number 474 originally caused by: Started by upstream project "libvirt-go-xml-master-build" build number 482 originally caused by: Started by upstream project "libvirt-master-build" build number 1534 originally caused by: Started by an SCM change [EnvInject] - Loading node environment variables. Building remotely on libvirt-fedora-28 (libvirt) in workspace <https://ci.centos.org/job/libvirt-go-xml-master-check/systems=libvirt-fedora-28/ws/> [libvirt-go-xml-master] $ /bin/sh -xe /tmp/jenkins5683961400346627547.sh + export 'TEST_ARGS=-tags xmlroundtrip' + TEST_ARGS='-tags xmlroundtrip' + go test -tags xmlroundtrip --- FAIL: TestRoundTrip (10.47s) xml_test.go:383: testdata/libvirt/tests/domaincapsschemadata/basic.xml: /domainCapabilities[0]/features[0]/sev[0]: element in expected XML missing in actual XML FAIL exit status 1 FAIL _<https://ci.centos.org/job/libvirt-go-xml-master-check/systems=libvirt-fedora-28/ws/> 10.694s Build step 'Execute shell' marked build as failure

See <https://ci.centos.org/job/libvirt-go-xml-master-check/systems=libvirt-fedora-28/475/display/redirect> ------------------------------------------ Started by upstream project "libvirt-go-xml-master-check" build number 475 originally caused by: Started by upstream project "libvirt-go-xml-master-build" build number 483 originally caused by: Started by upstream project "libvirt-master-build" build number 1535 originally caused by: Started by an SCM change [EnvInject] - Loading node environment variables. Building remotely on libvirt-fedora-28 (libvirt) in workspace <https://ci.centos.org/job/libvirt-go-xml-master-check/systems=libvirt-fedora-28/ws/> [libvirt-go-xml-master] $ /bin/sh -xe /tmp/jenkins1480666877218119610.sh + export 'TEST_ARGS=-tags xmlroundtrip' + TEST_ARGS='-tags xmlroundtrip' + go test -tags xmlroundtrip --- FAIL: TestRoundTrip (6.83s) xml_test.go:383: testdata/libvirt/tests/domaincapsschemadata/basic.xml: /domainCapabilities[0]/features[0]/sev[0]: element in expected XML missing in actual XML FAIL exit status 1 FAIL _<https://ci.centos.org/job/libvirt-go-xml-master-check/systems=libvirt-fedora-28/ws/> 7.038s Build step 'Execute shell' marked build as failure

See <https://ci.centos.org/job/libvirt-go-xml-master-check/systems=libvirt-fedora-28/476/display/redirect> ------------------------------------------ Started by upstream project "libvirt-go-xml-master-check" build number 476 originally caused by: Started by upstream project "libvirt-go-xml-master-build" build number 485 originally caused by: Started by upstream project "libvirt-master-build" build number 1537 originally caused by: Started by user Libvirt [EnvInject] - Loading node environment variables. Building remotely on libvirt-fedora-28 (libvirt) in workspace <https://ci.centos.org/job/libvirt-go-xml-master-check/systems=libvirt-fedora-28/ws/> [libvirt-go-xml-master] $ /bin/sh -xe /tmp/jenkins2801343221285387751.sh + export 'TEST_ARGS=-tags xmlroundtrip' + TEST_ARGS='-tags xmlroundtrip' + go test -tags xmlroundtrip --- FAIL: TestRoundTrip (27.88s) xml_test.go:383: testdata/libvirt/tests/qemuxml2argvdata/name-escape.xml: /domain[0]/devices[0]/smartcard[0]/database[0]: element in expected XML missing in actual XML FAIL exit status 1 FAIL _<https://ci.centos.org/job/libvirt-go-xml-master-check/systems=libvirt-fedora-28/ws/> 27.976s Build step 'Execute shell' marked build as failure

See <https://ci.centos.org/job/libvirt-go-xml-master-check/systems=libvirt-fedora-28/477/display/redirect> ------------------------------------------ Started by upstream project "libvirt-go-xml-master-check" build number 477 originally caused by: Started by upstream project "libvirt-go-xml-master-build" build number 486 originally caused by: Started by upstream project "libvirt-master-build" build number 1538 originally caused by: Started by an SCM change Started by an SCM change [EnvInject] - Loading node environment variables. Building remotely on libvirt-fedora-28 (libvirt) in workspace <https://ci.centos.org/job/libvirt-go-xml-master-check/systems=libvirt-fedora-28/ws/> [libvirt-go-xml-master] $ /bin/sh -xe /tmp/jenkins1505115891606143163.sh + export 'TEST_ARGS=-tags xmlroundtrip' + TEST_ARGS='-tags xmlroundtrip' + go test -tags xmlroundtrip --- FAIL: TestRoundTrip (23.43s) xml_test.go:383: testdata/libvirt/tests/qemuxml2argvdata/name-escape.xml: /domain[0]/devices[0]/smartcard[0]/database[0]: element in expected XML missing in actual XML FAIL exit status 1 FAIL _<https://ci.centos.org/job/libvirt-go-xml-master-check/systems=libvirt-fedora-28/ws/> 23.752s Build step 'Execute shell' marked build as failure

participants (1)
-
ci@centos.org