[Libvirt-ci] Build failed in Jenkins: libvirt-dbus-check » libvirt-fedora-rawhide #52

See <https://ci.centos.org/job/libvirt-dbus-check/systems=libvirt-fedora-rawhide/52/display/redirect> ------------------------------------------ Started by upstream project "libvirt-dbus-check" build number 52 originally caused by: Started by upstream project "libvirt-dbus-syntax-check" build number 52 originally caused by: Started by upstream project "libvirt-dbus-build" build number 52 originally caused by: Started by upstream project "libvirt-glib-build" build number 52 originally caused by: Started by upstream project "libvirt-build" build number 75 originally caused by: Started by an SCM change Started by an SCM change Started by an SCM change [EnvInject] - Loading node environment variables. Building remotely on libvirt-fedora-rawhide (libvirt) in workspace <https://ci.centos.org/job/libvirt-dbus-check/systems=libvirt-fedora-rawhide/ws/> [libvirt-dbus] $ /bin/sh -xe /tmp/jenkins2485057074200914624.sh + cd build + /usr/bin/gmake check Making check in data gmake[1]: Entering directory '<https://ci.centos.org/job/libvirt-dbus-check/systems=libvirt-fedora-rawhide/ws/build/data'> gmake[1]: Nothing to be done for 'check'. gmake[1]: Leaving directory '<https://ci.centos.org/job/libvirt-dbus-check/systems=libvirt-fedora-rawhide/ws/build/data'> Making check in docs gmake[1]: Entering directory '<https://ci.centos.org/job/libvirt-dbus-check/systems=libvirt-fedora-rawhide/ws/build/docs'> gmake[1]: Nothing to be done for 'check'. gmake[1]: Leaving directory '<https://ci.centos.org/job/libvirt-dbus-check/systems=libvirt-fedora-rawhide/ws/build/docs'> Making check in src gmake[1]: Entering directory '<https://ci.centos.org/job/libvirt-dbus-check/systems=libvirt-fedora-rawhide/ws/build/src'> gmake[1]: Nothing to be done for 'check'. gmake[1]: Leaving directory '<https://ci.centos.org/job/libvirt-dbus-check/systems=libvirt-fedora-rawhide/ws/build/src'> Making check in tests gmake[1]: Entering directory '<https://ci.centos.org/job/libvirt-dbus-check/systems=libvirt-fedora-rawhide/ws/build/tests'> /usr/bin/gmake test_util gmake[2]: Entering directory '<https://ci.centos.org/job/libvirt-dbus-check/systems=libvirt-fedora-rawhide/ws/build/tests'> CC test_util-test_util.o CCLD test_util gmake[2]: Leaving directory '<https://ci.centos.org/job/libvirt-dbus-check/systems=libvirt-fedora-rawhide/ws/build/tests'> /usr/bin/gmake check-TESTS gmake[2]: Entering directory '<https://ci.centos.org/job/libvirt-dbus-check/systems=libvirt-fedora-rawhide/ws/build/tests'> gmake[3]: Entering directory '<https://ci.centos.org/job/libvirt-dbus-check/systems=libvirt-fedora-rawhide/ws/build/tests'> PASS: test_util PASS: test_interface.py PASS: test_domain.py FAIL: test_network.py PASS: test_nodedev.py PASS: test_connect.py PASS: test_storage.py ============================================================================ Testsuite summary for libvirt-dbus 1.3.0 ============================================================================ # TOTAL: 7 # PASS: 6 # SKIP: 0 # XFAIL: 0 # FAIL: 1 # XPASS: 0 # ERROR: 0 ============================================================================ See tests/test-suite.log Please report to libvir-list@redhat.com ============================================================================ gmake[3]: *** [Makefile:766: test-suite.log] Error 1 gmake[3]: Leaving directory '<https://ci.centos.org/job/libvirt-dbus-check/systems=libvirt-fedora-rawhide/ws/build/tests'> gmake[2]: *** [Makefile:874: check-TESTS] Error 2 gmake[2]: Leaving directory '<https://ci.centos.org/job/libvirt-dbus-check/systems=libvirt-fedora-rawhide/ws/build/tests'> gmake[1]: *** [Makefile:990: check-am] Error 2 gmake[1]: Leaving directory '<https://ci.centos.org/job/libvirt-dbus-check/systems=libvirt-fedora-rawhide/ws/build/tests'> gmake: *** [Makefile:460: check-recursive] Error 1 + cat tests/test-suite.log ============================================== libvirt-dbus 1.3.0: tests/test-suite.log ============================================== # TOTAL: 7 # PASS: 6 # SKIP: 0 # XFAIL: 0 # FAIL: 1 # XPASS: 0 # ERROR: 0 .. contents:: :depth: 2 FAIL: test_network.py ===================== ============================= test session starts ============================== platform linux -- Python 3.7.0, pytest-3.6.3, py-1.5.4, pluggy-0.6.0 rootdir: <https://ci.centos.org/job/libvirt-dbus-check/systems=libvirt-fedora-rawhide/ws/,> inifile: collected 7 items ../../tests/test_network.py E.....F [100%] ==================================== ERRORS ==================================== __________ ERROR at setup of TestNetwork.test_network_properties_type __________ self = <test_network.TestNetwork object at 0x7f0b9ca2ff98> request = <SubRequest 'libvirt_dbus_setup' for <Function 'test_network_properties_type'>> @pytest.fixture(autouse=True) def libvirt_dbus_setup(self, request): """Start libvirt-dbus for each test function """ os.environ['LIBVIRT_DEBUG'] = '3' self.libvirt_dbus = subprocess.Popen([exe, '--session']) self.bus = dbus.SessionBus() for i in range(10): if self.bus.name_has_owner('org.libvirt'): break time.sleep(0.1) else:
raise TimeoutError('error starting libvirt-dbus')
E TimeoutError: error starting libvirt-dbus ../../tests/libvirttest.py:44: TimeoutError ---------------------------- Captured stderr setup ----------------------------- dbus-daemon[23669]: Cannot setup inotify for '/home/jenkins/.local/share/dbus-1/services'; error 'Permission denied' =================================== FAILURES =================================== TestNetwork.test_network_update[4-4-0-\n <host mac='00:16:3e:77:e2:ed' name='foo.example.com' ip='192.168.122.10'/>\n -0] self = <test_network.TestNetwork object at 0x7f0b9ca1f4a8>, command = '4' section = '4', parentIndex = 0 xml_str = "\n <host mac='00:16:3e:77:e2:ed' name='foo.example.com' ip='192.168.122.10'/>\n " flags = 0 @pytest.mark.parametrize("command, section, parentIndex, xml_str, flags", [ ('4', '4', 0, ip_dhcp_host_xml, 0), # add-first, ip-dhcp-host ]) def test_network_update(self, command, section, parentIndex, xml_str, flags):
_, test_network = self.get_test_network()
../../tests/test_network.py:91: _ _ _ _ _ _ _ _ _ _ _ _ _ _ _ _ _ _ _ _ _ _ _ _ _ _ _ _ _ _ _ _ _ _ _ _ _ _ _ _ self = <test_network.TestNetwork object at 0x7f0b9ca1f4a8> def get_test_network(self): """Fetch information for the test network from test driver Returns: (dbus.proxies.ProxyObject, dbus.proxies.ProxyObject): Test Network Object, Local proxy for the test Network Object. """
path = self.connect.ListNetworks(0)[0]
E IndexError: list index out of range ../../tests/libvirttest.py:138: IndexError ================= 1 failed, 5 passed, 1 error in 3.17 seconds ================== FAIL test_network.py (exit status: 1) + exit 1 Build step 'Execute shell' marked build as failure

participants (1)
-
ci@centos.org