[Libvirt-ci] Build failed in Jenkins: libvirt-build » libvirt-fedora-rawhide #549

See <https://ci.centos.org/job/libvirt-build/systems=libvirt-fedora-rawhide/549/display/redirect?page=changes> Changes: [eskultet] docs: Link the relevant SEV formatdomain section from formatdomaincaps ------------------------------------------ [...truncated 169.03 KB...] GEN hooks.html GEN formatnwfilter.html GEN virshcmdref.html GEN firewall.html GEN apps.html GEN news-2014.html GEN support.html GEN java.html GEN drvtest.html GEN drvvbox.html GEN drvphyp.html GEN formatstoragecaps.html GEN docs.html GEN goals.html GEN 404.html GEN news-2005.html GEN storage.html GEN formatdomain.html GEN formatstorageencryption.html GEN formatsecret.html GEN windows.html GEN formatnode.html GEN architecture.html GEN news-2009.html GEN platforms.html GEN nss.html GEN bindings.html GEN aclpolkit.html GEN news-2012.html GEN logging.html GEN drvopenvz.html GEN formatnetwork.html GEN testapi.html GEN bugs.html GEN formatsnapshot.html GEN formatcaps.html GEN api.html GEN news-2011.html GEN drvbhyve.html GEN locking.html GEN internals.html GEN news-2016.html GEN pci-hotplug.html GEN csharp.html GEN contact.html GEN hacking.html GEN formatdomaincaps.html GEN internals/locking.html GEN internals/rpc.html GEN internals/eventloop.html GEN internals/command.html GEN internals/oomtesting.html GEN ../../docs/hvsupport.html.in GEN news.html GEN html/index.html GEN ../../docs/devhelp/index.html GEN hvsupport.html.tmp GEN hvsupport.html rm drvopenvz.html.tmp logging.html.tmp aclpolkit.html.tmp support.html.tmp formatnwfilter.html.tmp news-2014.html.tmp internals/rpc.html.tmp php.html.tmp locking.html.tmp formatstorageencryption.html.tmp drvhyperv.html.tmp format.html.tmp errors.html.tmp api_extension.html.tmp formatstoragecaps.html.tmp virshcmdref.html.tmp platforms.html.tmp news-2006.html.tmp formatcaps.html.tmp internals.html.tmp dbus.html.tmp auditlog.html.tmp downloads.html.tmp internals/oomtesting.html.tmp bugs.html.tmp drvphyp.html.tmp java.html.tmp testapi.html.tmp bindings.html.tmp contribute.html.tmp drvesx.html.tmp locking-lockd.html.tmp devguide.html.tmp formatsecret.html.tmp drvqemu.html.tmp news-2008.html.tmp drvvmware.html.tmp architecture.html.tmp drvvirtuozzo.html.tmp formatdomaincaps.html.tmp index.html.tmp formatsnapshot.html.tmp acl.html.tmp news-2005.html.tmp drvxen.html.tmp securityprocess.html.tmp 404.html.tmp news-2015.html.tmp drvremote.html.tmp internals/locking.html.tmp remote.html.tmp drivers.html.tmp testtck.html.tmp compiling.html.tmp hooks.html.tmp news.html.tmp internals/eventloop.html.tmp goals.html.tmp news-2007.html.tmp apps.html.tmp internals/command.html.tmp drvvbox.html.tmp csharp.html.tmp firewall.html.tmp secureusage.html.tmp formatstorage.html.tmp governance.html.tmp hacking.html.tmp cgroups.html.tmp news-2013.html.tmp api.html.tmp news-2016.html.tmp windows.html.tmp news-2010.html.tmp contact.html.tmp news-2011.html.tmp formatnetwork.html.tmp auth.html.tmp drvlxc.html.tmp uri.html.tmp pci-hotplug.html.tmp formatdomain.html.tmp news-2012.html.tmp hvsupport.html.tmp locking-sanlock.html.tmp drvtest.html.tmp python.html.tmp drvnodedev.html.tmp docs.html.tmp drvbhyve.html.tmp news-2009.html.tmp testsuites.html.tmp nss.html.tmp migration.html.tmp storage.html.tmp formatnode.html.tmp gmake[2]: Leaving directory '/home/jenkins/libvirt/build/docs' Making all in gnulib/tests gmake[2]: Entering directory '/home/jenkins/libvirt/build/gnulib/tests' GEN ctype.h GEN inttypes.h GEN math.h GEN test-posix_spawn1.sh GEN test-posix_spawn2.sh GEN spawn.h /usr/bin/gmake all-recursive gmake[3]: Entering directory '/home/jenkins/libvirt/build/gnulib/tests' Making all in . gmake[4]: Entering directory '/home/jenkins/libvirt/build/gnulib/tests' CC test-localcharset.o CC exitfail.o CC fatal-signal.o CC getprogname.o CC localename.o CC localename-table.o CC math.o CC wait-process.o CC xmalloc.o CC xalloc-die.o CC nanosleep.o CC glthread/thread.o AR libtests.a CCLD test-localcharset gmake[4]: Leaving directory '/home/jenkins/libvirt/build/gnulib/tests' gmake[3]: Leaving directory '/home/jenkins/libvirt/build/gnulib/tests' gmake[2]: Leaving directory '/home/jenkins/libvirt/build/gnulib/tests' Making all in tests gmake[2]: Entering directory '/home/jenkins/libvirt/build/tests' CC virshtest.o CC testutils.o CC sockettest.o CC virhostcputest.o CC virfilewrapper.o CC virbuftest.o CC commandtest.o CC seclabeltest.o CC virhashtest.o CC virconftest.o CC viratomictest.o CC utiltest.o CC shunloadtest.o CC shunloadhelper.lo CC virtimetest.o CC viruritest.o CC virkeyfiletest.o CC viralloctest.o CC virauthconfigtest.o CC virbitmaptest.o CC vircgrouptest.o CC vircryptotest.o CC virpcitest.o CC virendiantest.o CC virfiletest.o CC virfilecachetest.o CC virfirewalltest-virfirewalltest.o CC virfirewalltest-testutils.o CC viriscsitest.o CC virkeycodetest.o CC virlockspacetest.o CC virlogtest.o CC virrotatingfiletest.o CC virschematest.o CC virstringtest.o CC virportallocatortest.o CC sysinfotest.o CC virkmodtest.o CC vircapstest.o CC testutilslxc.o CC testutilsqemu.o CC domaincapstest.o CC testutilsxen.o CCLD libqemutestdriver.la CCLD libxltestdriver.la CC domainconftest.o CC virhostdevtest.o CC virnetdevtest-virnetdevtest.o CC virnetdevtest-testutils.o CC virtypedparamtest.o CC vshtabletest.o CC virerrortest.o CC virnetmessagetest.o CC virnetsockettest.o CC virnetdaemontest.o CC virnetserverclienttest.o CC virnettlscontexttest.o CC virnettlshelpers.o CC pkix_asn1_tab.o CC virnettlssessiontest.o CC fchosttest.o CC scsihosttest.o CC vircaps2xmltest.o CC virresctrltest.o CC fdstreamtest.o CC virdbustest-virdbustest.o CC virdbustest-testutils.o CC virsystemdtest-virsystemdtest.o CC virsystemdtest-testutils.o CC virpolkittest-virpolkittest.o CC virpolkittest-testutils.o CC securityselinuxtest.o CC securityselinuxhelper.lo CC viridentitytest.o CC securityselinuxlabeltest.o CC xlconfigtest.o CC xml2sexprtest.o CC sexpr2xmltest.o CC xmconfigtest.o CC libxlxml2domconfigtest.o CC qemuxml2argvtest.o CC qemuxml2xmltest.o CC qemuargv2xmltest.o CC domainsnapshotxml2xmltest.o CC qemumonitorjsontest.o FATAL: command execution failed java.nio.channels.ClosedChannelException at org.jenkinsci.remoting.protocol.NetworkLayer.onRecvClosed(NetworkLayer.java:154) at org.jenkinsci.remoting.protocol.impl.NIONetworkLayer.ready(NIONetworkLayer.java:142) at org.jenkinsci.remoting.protocol.IOHub$OnReady.run(IOHub.java:795) at jenkins.util.ContextResettingExecutorService$1.run(ContextResettingExecutorService.java:28) at jenkins.security.ImpersonatingExecutorService$1.run(ImpersonatingExecutorService.java:59) at java.util.concurrent.ThreadPoolExecutor.runWorker(ThreadPoolExecutor.java:1149) at java.util.concurrent.ThreadPoolExecutor$Worker.run(ThreadPoolExecutor.java:624) at java.lang.Thread.run(Thread.java:748) Caused: java.io.IOException: Backing channel 'JNLP4-connect connection from n64.gusty.ci.centos.org/172.19.2.192:47340' is disconnected. at hudson.remoting.RemoteInvocationHandler.channelOrFail(RemoteInvocationHandler.java:214) at hudson.remoting.RemoteInvocationHandler.invoke(RemoteInvocationHandler.java:283) at com.sun.proxy.$Proxy89.isAlive(Unknown Source) at hudson.Launcher$RemoteLauncher$ProcImpl.isAlive(Launcher.java:1144) at hudson.Launcher$RemoteLauncher$ProcImpl.join(Launcher.java:1136) at hudson.tasks.CommandInterpreter.join(CommandInterpreter.java:155) at hudson.tasks.CommandInterpreter.perform(CommandInterpreter.java:109) at hudson.tasks.CommandInterpreter.perform(CommandInterpreter.java:66) at hudson.tasks.BuildStepMonitor$1.perform(BuildStepMonitor.java:20) at hudson.model.AbstractBuild$AbstractBuildExecution.perform(AbstractBuild.java:744) at hudson.model.Build$BuildExecution.build(Build.java:206) at hudson.model.Build$BuildExecution.doRun(Build.java:163) at hudson.model.AbstractBuild$AbstractBuildExecution.run(AbstractBuild.java:504) at hudson.model.Run.execute(Run.java:1816) at hudson.matrix.MatrixRun.run(MatrixRun.java:153) at hudson.model.ResourceController.execute(ResourceController.java:97) at hudson.model.Executor.run(Executor.java:429) FATAL: Unable to delete script file /tmp/jenkins6279948475561332160.sh java.nio.channels.ClosedChannelException at org.jenkinsci.remoting.protocol.NetworkLayer.onRecvClosed(NetworkLayer.java:154) at org.jenkinsci.remoting.protocol.impl.NIONetworkLayer.ready(NIONetworkLayer.java:142) at org.jenkinsci.remoting.protocol.IOHub$OnReady.run(IOHub.java:795) at jenkins.util.ContextResettingExecutorService$1.run(ContextResettingExecutorService.java:28) at jenkins.security.ImpersonatingExecutorService$1.run(ImpersonatingExecutorService.java:59) at java.util.concurrent.ThreadPoolExecutor.runWorker(ThreadPoolExecutor.java:1149) at java.util.concurrent.ThreadPoolExecutor$Worker.run(ThreadPoolExecutor.java:624) at java.lang.Thread.run(Thread.java:748) Caused: hudson.remoting.ChannelClosedException: Channel "unknown": Remote call on JNLP4-connect connection from n64.gusty.ci.centos.org/172.19.2.192:47340 failed. The channel is closing down or has closed down at hudson.remoting.Channel.call(Channel.java:950) at hudson.FilePath.act(FilePath.java:1069) at hudson.FilePath.act(FilePath.java:1058) at hudson.FilePath.delete(FilePath.java:1539) at hudson.tasks.CommandInterpreter.perform(CommandInterpreter.java:123) at hudson.tasks.CommandInterpreter.perform(CommandInterpreter.java:66) at hudson.tasks.BuildStepMonitor$1.perform(BuildStepMonitor.java:20) at hudson.model.AbstractBuild$AbstractBuildExecution.perform(AbstractBuild.java:744) at hudson.model.Build$BuildExecution.build(Build.java:206) at hudson.model.Build$BuildExecution.doRun(Build.java:163) at hudson.model.AbstractBuild$AbstractBuildExecution.run(AbstractBuild.java:504) at hudson.model.Run.execute(Run.java:1816) at hudson.matrix.MatrixRun.run(MatrixRun.java:153) at hudson.model.ResourceController.execute(ResourceController.java:97) at hudson.model.Executor.run(Executor.java:429) Build step 'Execute shell' marked build as failure FATAL: Channel "unknown": Remote call on JNLP4-connect connection from n64.gusty.ci.centos.org/172.19.2.192:47340 failed. The channel is closing down or has closed down java.nio.channels.ClosedChannelException at org.jenkinsci.remoting.protocol.NetworkLayer.onRecvClosed(NetworkLayer.java:154) at org.jenkinsci.remoting.protocol.impl.NIONetworkLayer.ready(NIONetworkLayer.java:142) at org.jenkinsci.remoting.protocol.IOHub$OnReady.run(IOHub.java:795) at jenkins.util.ContextResettingExecutorService$1.run(ContextResettingExecutorService.java:28) at jenkins.security.ImpersonatingExecutorService$1.run(ImpersonatingExecutorService.java:59) at java.util.concurrent.ThreadPoolExecutor.runWorker(ThreadPoolExecutor.java:1149) at java.util.concurrent.ThreadPoolExecutor$Worker.run(ThreadPoolExecutor.java:624) at java.lang.Thread.run(Thread.java:748) Caused: hudson.remoting.ChannelClosedException: Channel "unknown": Remote call on JNLP4-connect connection from n64.gusty.ci.centos.org/172.19.2.192:47340 failed. The channel is closing down or has closed down at hudson.remoting.Channel.call(Channel.java:950) at hudson.Launcher$RemoteLauncher.kill(Launcher.java:1085) at hudson.model.AbstractBuild$AbstractBuildExecution.run(AbstractBuild.java:510) at hudson.model.Run.execute(Run.java:1816) at hudson.matrix.MatrixRun.run(MatrixRun.java:153) at hudson.model.ResourceController.execute(ResourceController.java:97) at hudson.model.Executor.run(Executor.java:429)

participants (1)
-
ci@centos.org