[Libvirt-ci] Build failed in Jenkins: libosinfo-check » libvirt-fedora-rawhide #93

See <https://ci.centos.org/job/libosinfo-check/systems=libvirt-fedora-rawhide/93/display/redirect> ------------------------------------------ Started by upstream project "libosinfo-check" build number 93 originally caused by: Started by upstream project "libosinfo-syntax-check" build number 94 originally caused by: Started by upstream project "libosinfo-build" build number 97 originally caused by: Started by an SCM change [EnvInject] - Loading node environment variables. Building remotely on libvirt-fedora-rawhide (libvirt) in workspace <https://ci.centos.org/job/libosinfo-check/systems=libvirt-fedora-rawhide/ws/> [libosinfo] $ /bin/sh -xe /tmp/jenkins6012909466857481289.sh + cd build + /usr/bin/gmake check GEN public-submodule-commit Making check in osinfo gmake[1]: Entering directory '<https://ci.centos.org/job/libosinfo-check/systems=libvirt-fedora-rawhide/ws/build/osinfo'> /usr/bin/gmake check-am gmake[2]: Entering directory '<https://ci.centos.org/job/libosinfo-check/systems=libvirt-fedora-rawhide/ws/build/osinfo'> /usr/bin/gmake check-local gmake[3]: Entering directory '<https://ci.centos.org/job/libosinfo-check/systems=libvirt-fedora-rawhide/ws/build/osinfo'> GEN check-symfile GEN check-symsorting gmake[3]: Leaving directory '<https://ci.centos.org/job/libosinfo-check/systems=libvirt-fedora-rawhide/ws/build/osinfo'> gmake[2]: Leaving directory '<https://ci.centos.org/job/libosinfo-check/systems=libvirt-fedora-rawhide/ws/build/osinfo'> gmake[1]: Leaving directory '<https://ci.centos.org/job/libosinfo-check/systems=libvirt-fedora-rawhide/ws/build/osinfo'> Making check in tools gmake[1]: Entering directory '<https://ci.centos.org/job/libosinfo-check/systems=libvirt-fedora-rawhide/ws/build/tools'> gmake[1]: Nothing to be done for 'check'. gmake[1]: Leaving directory '<https://ci.centos.org/job/libosinfo-check/systems=libvirt-fedora-rawhide/ws/build/tools'> Making check in docs gmake[1]: Entering directory '<https://ci.centos.org/job/libosinfo-check/systems=libvirt-fedora-rawhide/ws/build/docs'> Making check in reference gmake[2]: Entering directory '<https://ci.centos.org/job/libosinfo-check/systems=libvirt-fedora-rawhide/ws/build/docs/reference'> gmake[2]: Nothing to be done for 'check'. gmake[2]: Leaving directory '<https://ci.centos.org/job/libosinfo-check/systems=libvirt-fedora-rawhide/ws/build/docs/reference'> gmake[2]: Entering directory '<https://ci.centos.org/job/libosinfo-check/systems=libvirt-fedora-rawhide/ws/build/docs'> gmake[2]: Nothing to be done for 'check-am'. gmake[2]: Leaving directory '<https://ci.centos.org/job/libosinfo-check/systems=libvirt-fedora-rawhide/ws/build/docs'> gmake[1]: Leaving directory '<https://ci.centos.org/job/libosinfo-check/systems=libvirt-fedora-rawhide/ws/build/docs'> Making check in po gmake[1]: Entering directory '<https://ci.centos.org/job/libosinfo-check/systems=libvirt-fedora-rawhide/ws/build/po'> INTLTOOL_EXTRACT="/usr/bin/intltool-extract" XGETTEXT="/usr/bin/xgettext" srcdir=../../po /usr/bin/intltool-update --gettext-package libosinfo --pot rm -f missing notexist srcdir=../../po /usr/bin/intltool-update -m if [ -r missing -o -r notexist ]; then \ exit 1; \ fi gmake[1]: Leaving directory '<https://ci.centos.org/job/libosinfo-check/systems=libvirt-fedora-rawhide/ws/build/po'> Making check in examples gmake[1]: Entering directory '<https://ci.centos.org/job/libosinfo-check/systems=libvirt-fedora-rawhide/ws/build/examples'> gmake[1]: Nothing to be done for 'check'. gmake[1]: Leaving directory '<https://ci.centos.org/job/libosinfo-check/systems=libvirt-fedora-rawhide/ws/build/examples'> Making check in tests gmake[1]: Entering directory '<https://ci.centos.org/job/libosinfo-check/systems=libvirt-fedora-rawhide/ws/build/tests'> /usr/bin/gmake test-entity test-device test-list test-devicelist test-devicelinklist test-filter test-media test-product test-os test-oslist test-productfilter test-platform test-platformlist test-db test-loader test-isodetect test-install-script test-image test-imagelist test-mediauris test-treeuris test-imageuris gmake[2]: Entering directory '<https://ci.centos.org/job/libosinfo-check/systems=libvirt-fedora-rawhide/ws/build/tests'> CC test_list-test-list.o CC test_entity-test-entity.o CC test_device-test-device.o CC test_devicelist-test-devicelist.o CC test_devicelinklist-test-devicelinklist.o CC test_filter-test-filter.o CC test_media-test-media.o CC test_product-test-product.o CC test_os-test-os.o CC test_oslist-test-oslist.o CC test_productfilter-test-productfilter.o CC test_platform-test-platform.o CC test_platformlist-test-platformlist.o CC test_db-test-db.o CC test_loader-test-loader.o CC test_isodetect-test-isodetect.o CC test_install_script-test-install-script.o CC test_image-test-image.o CC test_imagelist-test-imagelist.o CC test_mediauris-test-mediauris.o CC test_treeuris-test-treeuris.o CC test_imageuris-test-imageuris.o CCLD test-entity CCLD test-device CCLD test-list CCLD test-devicelist CCLD test-devicelinklist CCLD test-filter CCLD test-media CCLD test-product CCLD test-os CCLD test-oslist CCLD test-productfilter CCLD test-platform CCLD test-platformlist CCLD test-db CCLD test-loader CCLD test-isodetect CCLD test-install-script CCLD test-image CCLD test-imagelist CCLD test-mediauris CCLD test-treeuris CCLD test-imageuris gmake[2]: Leaving directory '<https://ci.centos.org/job/libosinfo-check/systems=libvirt-fedora-rawhide/ws/build/tests'> /usr/bin/gmake check-TESTS gmake[2]: Entering directory '<https://ci.centos.org/job/libosinfo-check/systems=libvirt-fedora-rawhide/ws/build/tests'> gmake[3]: Entering directory '<https://ci.centos.org/job/libosinfo-check/systems=libvirt-fedora-rawhide/ws/build/tests'> PASS: test-list PASS: test-device PASS: test-entity PASS: test-devicelist PASS: test-devicelinklist PASS: test-filter PASS: test-product PASS: test-oslist PASS: test-media PASS: test-productfilter PASS: test-platform PASS: test-platformlist PASS: test-db PASS: test-loader PASS: test-install-script PASS: test-image PASS: test-imagelist SKIP: test-mediauris SKIP: test-treeuris SKIP: test-imageuris PASS: test-os FAIL: test-isodetect ============================================================================ Testsuite summary for libosinfo 1.4.0 ============================================================================ # TOTAL: 22 # PASS: 18 # SKIP: 3 # XFAIL: 0 # FAIL: 1 # XPASS: 0 # ERROR: 0 ============================================================================ See tests/test-suite.log Please report to libosinfo@redhat.com ============================================================================ gmake[3]: *** [Makefile:1440: test-suite.log] Error 1 gmake[3]: Leaving directory '<https://ci.centos.org/job/libosinfo-check/systems=libvirt-fedora-rawhide/ws/build/tests'> gmake[2]: *** [Makefile:1548: check-TESTS] Error 2 gmake[2]: Leaving directory '<https://ci.centos.org/job/libosinfo-check/systems=libvirt-fedora-rawhide/ws/build/tests'> gmake[1]: *** [Makefile:1769: check-am] Error 2 gmake[1]: Leaving directory '<https://ci.centos.org/job/libosinfo-check/systems=libvirt-fedora-rawhide/ws/build/tests'> gmake: *** [Makefile:594: check-recursive] Error 1 + cat tests/test-suite.log =========================================== libosinfo 1.4.0: tests/test-suite.log =========================================== # TOTAL: 22 # PASS: 18 # SKIP: 3 # XFAIL: 0 # FAIL: 1 # XPASS: 0 # ERROR: 0 .. contents:: :depth: 2 FAIL: test-isodetect ==================== /isodetect/pureos: OK /isodetect/eos: OK /isodetect/windows: OK /isodetect/ubuntu: ISO ubuntu-18.04.1.0-live-server-amd64.iso.txt was not matched by OS ubuntu18.04 /isodetect/ubuntu: FAIL /isodetect/sles: OK /isodetect/sled: OK /isodetect/rhel: OK /isodetect/popos: OK /isodetect/opensuse: OK /isodetect/openbsd: OK /isodetect/netbsd: OK /isodetect/mageia: OK /isodetect/haiku: OK /isodetect/gnome: OK /isodetect/freedos: OK /isodetect/freebsd: OK /isodetect/fedora: OK /isodetect/dragonflybsd: OK /isodetect/debian: OK /isodetect/centos: OK /isodetect/asianux: OK /isodetect/android-x86: OK /isodetect/altlinux: OK /isodetect/alpinelinux: OK FAIL test-isodetect (exit status: 1) SKIP: test-mediauris ==================== SKIP test-mediauris (exit status: 77) SKIP: test-treeuris =================== SKIP test-treeuris (exit status: 77) SKIP: test-imageuris ==================== SKIP test-imageuris (exit status: 77) + exit 1 Build step 'Execute shell' marked build as failure

participants (1)
-
ci@centos.org