[Libvirt-ci] Build failed in Jenkins: libvirt-go-xml-check » libvirt-freebsd-12 #318

See <https://ci.centos.org/job/libvirt-go-xml-check/systems=libvirt-freebsd-12/318/display/redirect> ------------------------------------------ Started by upstream project "libvirt-go-xml-check" build number 318 originally caused by: Started by upstream project "libvirt-go-xml-build" build number 318 originally caused by: Started by upstream project "libvirt-build" build number 402 originally caused by: Started by an SCM change [EnvInject] - Loading node environment variables. Building remotely on libvirt-freebsd-12 (libvirt) in workspace <https://ci.centos.org/job/libvirt-go-xml-check/systems=libvirt-freebsd-12/ws/> [libvirt-go-xml] $ /bin/sh -xe /tmp/jenkins3378721668986868405.sh + export 'TEST_ARGS=-tags xmlroundtrip' + go test -tags xmlroundtrip --- FAIL: TestRoundTrip (7.23s) xml_test.go:394: testdata/libvirt/tests/domaincapsschemadata/empty.xml: /domainCapabilities[0]/os[0]: element in actual XML missing in expected XML FAIL exit status 1 FAIL _/usr<https://ci.centos.org/job/libvirt-go-xml-check/systems=libvirt-freebsd-12/ws/> 7.281s Build step 'Execute shell' marked build as failure

See <https://ci.centos.org/job/libvirt-go-xml-check/systems=libvirt-freebsd-12/319/display/redirect> ------------------------------------------ Started by upstream project "libvirt-go-xml-check" build number 319 originally caused by: Started by upstream project "libvirt-go-xml-build" build number 319 originally caused by: Started by upstream project "libvirt-build" build number 403 originally caused by: Started by an SCM change Started by an SCM change Started by an SCM change Started by an SCM change Started by an SCM change Started by an SCM change Started by an SCM change Started by an SCM change [EnvInject] - Loading node environment variables. Building remotely on libvirt-freebsd-12 (libvirt) in workspace <https://ci.centos.org/job/libvirt-go-xml-check/systems=libvirt-freebsd-12/ws/> [libvirt-go-xml] $ /bin/sh -xe /tmp/jenkins1454073633431676331.sh + export 'TEST_ARGS=-tags xmlroundtrip' + go test -tags xmlroundtrip --- FAIL: TestRoundTrip (2.83s) xml_test.go:394: testdata/libvirt/tests/domaincapsschemadata/empty.xml: /domainCapabilities[0]/os[0]: element in actual XML missing in expected XML FAIL exit status 1 FAIL _/usr<https://ci.centos.org/job/libvirt-go-xml-check/systems=libvirt-freebsd-12/ws/> 2.932s Build step 'Execute shell' marked build as failure

See <https://ci.centos.org/job/libvirt-go-xml-check/systems=libvirt-freebsd-12/321/display/redirect> ------------------------------------------ Started by upstream project "libvirt-go-xml-check" build number 321 originally caused by: Started by upstream project "libvirt-go-xml-build" build number 323 originally caused by: Started by upstream project "libvirt-build" build number 406 originally caused by: Started by an SCM change Started by an SCM change [EnvInject] - Loading node environment variables. Building remotely on libvirt-freebsd-12 (libvirt) in workspace <https://ci.centos.org/job/libvirt-go-xml-check/systems=libvirt-freebsd-12/ws/> [libvirt-go-xml] $ /bin/sh -xe /tmp/jenkins977028004111077044.sh + export 'TEST_ARGS=-tags xmlroundtrip' + go test -tags xmlroundtrip --- FAIL: TestRoundTrip (13.87s) xml_test.go:394: testdata/libvirt/tests/storagepoolxml2xmlin/pool-rbd-refresh-volume-allocation.xml: /pool[0]/refresh[0]: element in expected XML missing in actual XML FAIL exit status 1 FAIL _/usr<https://ci.centos.org/job/libvirt-go-xml-check/systems=libvirt-freebsd-12/ws/> 13.906s Build step 'Execute shell' marked build as failure

See <https://ci.centos.org/job/libvirt-go-xml-check/systems=libvirt-freebsd-12/322/display/redirect> ------------------------------------------ Started by upstream project "libvirt-go-xml-check" build number 322 originally caused by: Started by upstream project "libvirt-go-xml-build" build number 324 originally caused by: Started by upstream project "libvirt-build" build number 408 originally caused by: Started by an SCM change [EnvInject] - Loading node environment variables. Building remotely on libvirt-freebsd-12 (libvirt) in workspace <https://ci.centos.org/job/libvirt-go-xml-check/systems=libvirt-freebsd-12/ws/> [libvirt-go-xml] $ /bin/sh -xe /tmp/jenkins1068109487770664821.sh + export 'TEST_ARGS=-tags xmlroundtrip' + go test -tags xmlroundtrip --- FAIL: TestRoundTrip (37.66s) xml_test.go:394: testdata/libvirt/tests/storagepoolxml2xmlin/pool-rbd-refresh-volume-allocation.xml: /pool[0]/refresh[0]: element in expected XML missing in actual XML FAIL exit status 1 FAIL _/usr<https://ci.centos.org/job/libvirt-go-xml-check/systems=libvirt-freebsd-12/ws/> 37.766s Build step 'Execute shell' marked build as failure

participants (1)
-
ci@centos.org