[Libvirt-ci] Build failed in Jenkins: libvirt-go-master-check » libvirt-freebsd-11 #1109

See <https://ci.centos.org/job/libvirt-go-master-check/systems=libvirt-freebsd-11/1109/display/redirect> ------------------------------------------ Started by upstream project "libvirt-go-master-check" build number 1109 originally caused by: Started by upstream project "libvirt-go-master-build" build number 1120 originally caused by: Started by upstream project "libvirt-master-build" build number 1519 originally caused by: Started by an SCM change Started by an SCM change [EnvInject] - Loading node environment variables. Building remotely on libvirt-freebsd-11 (libvirt) in workspace <https://ci.centos.org/job/libvirt-go-master-check/systems=libvirt-freebsd-11/ws/> [libvirt-go-master] $ /bin/sh -xe /tmp/jenkins4109029476943945793.sh + export 'TEST_ARGS=-tags api' + go test -tags api Missing function 'virDomainGetLaunchSecurityInfo' Missing function 'virNodeGetSEVInfo' Missing macro 'VIR_DOMAIN_LAUNCH_SECURITY_SEV_MEASUREMENT' Missing macro 'VIR_NODE_SEV_CBITPOS' Missing macro 'VIR_NODE_SEV_CERT_CHAIN' Missing macro 'VIR_NODE_SEV_PDH' Missing macro 'VIR_NODE_SEV_REDUCED_PHYS_BITS' --- FAIL: TestAPICoverage (0.43s) panic: Missing symbols found [recovered] panic: Missing symbols found goroutine 20 [running]: testing.tRunner.func1(0xc4200ca0f0) /usr/local/go/src/testing/testing.go:742 +0x29d panic(0x5adb00, 0x610d90) /usr/local/go/src/runtime/panic.go:502 +0x229 _/usr<https://ci.centos.org/job/libvirt-go-master-check/systems=libvirt-freebsd-11/ws/.TestAPICoverage(0xc4200ca0f0)> /usr<https://ci.centos.org/job/libvirt-go-master-check/systems=libvirt-freebsd-11/ws/api_test.go>:506 +0x548 testing.tRunner(0xc4200ca0f0, 0x5fbfe0) /usr/local/go/src/testing/testing.go:777 +0xd0 created by testing.(*T).Run /usr/local/go/src/testing/testing.go:824 +0x2e0 exit status 2 FAIL _/usr<https://ci.centos.org/job/libvirt-go-master-check/systems=libvirt-freebsd-11/ws/> 0.530s Build step 'Execute shell' marked build as failure

See <https://ci.centos.org/job/libvirt-go-master-check/systems=libvirt-freebsd-11/1110/display/redirect> ------------------------------------------ Started by upstream project "libvirt-go-master-check" build number 1110 originally caused by: Started by upstream project "libvirt-go-master-build" build number 1121 originally caused by: Started by upstream project "libvirt-master-build" build number 1520 originally caused by: Started by an SCM change Started by an SCM change Started by an SCM change Started by an SCM change [EnvInject] - Loading node environment variables. Building remotely on libvirt-freebsd-11 (libvirt) in workspace <https://ci.centos.org/job/libvirt-go-master-check/systems=libvirt-freebsd-11/ws/> [libvirt-go-master] $ /bin/sh -xe /tmp/jenkins6416227497181223130.sh + export 'TEST_ARGS=-tags api' + go test -tags api Missing function 'virDomainGetLaunchSecurityInfo' Missing function 'virNodeGetSEVInfo' Missing macro 'VIR_DOMAIN_LAUNCH_SECURITY_SEV_MEASUREMENT' Missing macro 'VIR_NODE_SEV_CBITPOS' Missing macro 'VIR_NODE_SEV_CERT_CHAIN' Missing macro 'VIR_NODE_SEV_PDH' Missing macro 'VIR_NODE_SEV_REDUCED_PHYS_BITS' --- FAIL: TestAPICoverage (1.39s) panic: Missing symbols found [recovered] panic: Missing symbols found goroutine 4 [running]: testing.tRunner.func1(0xc4200ce0f0) /usr/local/go/src/testing/testing.go:742 +0x29d panic(0x5adb00, 0x610d90) /usr/local/go/src/runtime/panic.go:502 +0x229 _/usr<https://ci.centos.org/job/libvirt-go-master-check/systems=libvirt-freebsd-11/ws/.TestAPICoverage(0xc4200ce0f0)> /usr<https://ci.centos.org/job/libvirt-go-master-check/systems=libvirt-freebsd-11/ws/api_test.go>:506 +0x548 testing.tRunner(0xc4200ce0f0, 0x5fbfe0) /usr/local/go/src/testing/testing.go:777 +0xd0 created by testing.(*T).Run /usr/local/go/src/testing/testing.go:824 +0x2e0 exit status 2 FAIL _/usr<https://ci.centos.org/job/libvirt-go-master-check/systems=libvirt-freebsd-11/ws/> 1.832s Build step 'Execute shell' marked build as failure

See <https://ci.centos.org/job/libvirt-go-master-check/systems=libvirt-freebsd-11/1111/display/redirect> ------------------------------------------ Started by upstream project "libvirt-go-master-check" build number 1111 originally caused by: Started by upstream project "libvirt-go-master-build" build number 1122 originally caused by: Started by upstream project "libvirt-master-build" build number 1521 originally caused by: Started by an SCM change [EnvInject] - Loading node environment variables. Building remotely on libvirt-freebsd-11 (libvirt) in workspace <https://ci.centos.org/job/libvirt-go-master-check/systems=libvirt-freebsd-11/ws/> [libvirt-go-master] $ /bin/sh -xe /tmp/jenkins7383564184091261070.sh + export 'TEST_ARGS=-tags api' + go test -tags api Missing function 'virDomainGetLaunchSecurityInfo' Missing function 'virNodeGetSEVInfo' Missing macro 'VIR_DOMAIN_LAUNCH_SECURITY_SEV_MEASUREMENT' Missing macro 'VIR_NODE_SEV_CBITPOS' Missing macro 'VIR_NODE_SEV_CERT_CHAIN' Missing macro 'VIR_NODE_SEV_PDH' Missing macro 'VIR_NODE_SEV_REDUCED_PHYS_BITS' --- FAIL: TestAPICoverage (0.32s) panic: Missing symbols found [recovered] panic: Missing symbols found goroutine 4 [running]: testing.tRunner.func1(0xc4200b40f0) /usr/local/go/src/testing/testing.go:742 +0x29d panic(0x5adb00, 0x610d90) /usr/local/go/src/runtime/panic.go:502 +0x229 _/usr<https://ci.centos.org/job/libvirt-go-master-check/systems=libvirt-freebsd-11/ws/.TestAPICoverage(0xc4200b40f0)> /usr<https://ci.centos.org/job/libvirt-go-master-check/systems=libvirt-freebsd-11/ws/api_test.go>:506 +0x548 testing.tRunner(0xc4200b40f0, 0x5fbfe0) /usr/local/go/src/testing/testing.go:777 +0xd0 created by testing.(*T).Run /usr/local/go/src/testing/testing.go:824 +0x2e0 exit status 2 FAIL _/usr<https://ci.centos.org/job/libvirt-go-master-check/systems=libvirt-freebsd-11/ws/> 0.424s Build step 'Execute shell' marked build as failure

See <https://ci.centos.org/job/libvirt-go-master-check/systems=libvirt-freebsd-11/1112/display/redirect> ------------------------------------------ Started by upstream project "libvirt-go-master-check" build number 1112 originally caused by: Started by upstream project "libvirt-go-master-build" build number 1123 originally caused by: Started by upstream project "libvirt-master-build" build number 1522 originally caused by: Started by an SCM change [EnvInject] - Loading node environment variables. Building remotely on libvirt-freebsd-11 (libvirt) in workspace <https://ci.centos.org/job/libvirt-go-master-check/systems=libvirt-freebsd-11/ws/> [libvirt-go-master] $ /bin/sh -xe /tmp/jenkins7513719661151188096.sh + export 'TEST_ARGS=-tags api' + go test -tags api Missing function 'virDomainGetLaunchSecurityInfo' Missing function 'virNodeGetSEVInfo' Missing macro 'VIR_DOMAIN_LAUNCH_SECURITY_SEV_MEASUREMENT' Missing macro 'VIR_NODE_SEV_CBITPOS' Missing macro 'VIR_NODE_SEV_CERT_CHAIN' Missing macro 'VIR_NODE_SEV_PDH' Missing macro 'VIR_NODE_SEV_REDUCED_PHYS_BITS' --- FAIL: TestAPICoverage (0.50s) panic: Missing symbols found [recovered] panic: Missing symbols found goroutine 19 [running]: testing.tRunner.func1(0xc4200cc0f0) /usr/local/go/src/testing/testing.go:742 +0x29d panic(0x5adb00, 0x610d90) /usr/local/go/src/runtime/panic.go:502 +0x229 _/usr<https://ci.centos.org/job/libvirt-go-master-check/systems=libvirt-freebsd-11/ws/.TestAPICoverage(0xc4200cc0f0)> /usr<https://ci.centos.org/job/libvirt-go-master-check/systems=libvirt-freebsd-11/ws/api_test.go>:506 +0x548 testing.tRunner(0xc4200cc0f0, 0x5fbfe0) /usr/local/go/src/testing/testing.go:777 +0xd0 created by testing.(*T).Run /usr/local/go/src/testing/testing.go:824 +0x2e0 exit status 2 FAIL _/usr<https://ci.centos.org/job/libvirt-go-master-check/systems=libvirt-freebsd-11/ws/> 0.606s Build step 'Execute shell' marked build as failure

See <https://ci.centos.org/job/libvirt-go-master-check/systems=libvirt-freebsd-11/1113/display/redirect> ------------------------------------------ Started by upstream project "libvirt-go-master-check" build number 1113 originally caused by: Started by upstream project "libvirt-go-master-build" build number 1124 originally caused by: Started by upstream project "libvirt-master-build" build number 1523 originally caused by: Started by an SCM change [EnvInject] - Loading node environment variables. Building remotely on libvirt-freebsd-11 (libvirt) in workspace <https://ci.centos.org/job/libvirt-go-master-check/systems=libvirt-freebsd-11/ws/> [libvirt-go-master] $ /bin/sh -xe /tmp/jenkins561659179196575613.sh + export 'TEST_ARGS=-tags api' + go test -tags api Missing function 'virDomainGetLaunchSecurityInfo' Missing function 'virNodeGetSEVInfo' Missing macro 'VIR_DOMAIN_LAUNCH_SECURITY_SEV_MEASUREMENT' Missing macro 'VIR_NODE_SEV_CBITPOS' Missing macro 'VIR_NODE_SEV_CERT_CHAIN' Missing macro 'VIR_NODE_SEV_PDH' Missing macro 'VIR_NODE_SEV_REDUCED_PHYS_BITS' --- FAIL: TestAPICoverage (0.46s) panic: Missing symbols found [recovered] panic: Missing symbols found goroutine 18 [running]: testing.tRunner.func1(0xc4200d00f0) /usr/local/go/src/testing/testing.go:742 +0x29d panic(0x5adb00, 0x610d90) /usr/local/go/src/runtime/panic.go:502 +0x229 _/usr<https://ci.centos.org/job/libvirt-go-master-check/systems=libvirt-freebsd-11/ws/.TestAPICoverage(0xc4200d00f0)> /usr<https://ci.centos.org/job/libvirt-go-master-check/systems=libvirt-freebsd-11/ws/api_test.go>:506 +0x548 testing.tRunner(0xc4200d00f0, 0x5fbfe0) /usr/local/go/src/testing/testing.go:777 +0xd0 created by testing.(*T).Run /usr/local/go/src/testing/testing.go:824 +0x2e0 exit status 2 FAIL _/usr<https://ci.centos.org/job/libvirt-go-master-check/systems=libvirt-freebsd-11/ws/> 0.625s Build step 'Execute shell' marked build as failure

See <https://ci.centos.org/job/libvirt-go-master-check/systems=libvirt-freebsd-11/1114/display/redirect> ------------------------------------------ Started by upstream project "libvirt-go-master-check" build number 1114 originally caused by: Started by upstream project "libvirt-go-master-build" build number 1125 originally caused by: Started by upstream project "libvirt-master-build" build number 1524 originally caused by: Started by an SCM change Started by an SCM change Started by an SCM change [EnvInject] - Loading node environment variables. Building remotely on libvirt-freebsd-11 (libvirt) in workspace <https://ci.centos.org/job/libvirt-go-master-check/systems=libvirt-freebsd-11/ws/> [libvirt-go-master] $ /bin/sh -xe /tmp/jenkins763074585475760474.sh + export 'TEST_ARGS=-tags api' + go test -tags api Missing function 'virDomainGetLaunchSecurityInfo' Missing function 'virNodeGetSEVInfo' Missing macro 'VIR_DOMAIN_LAUNCH_SECURITY_SEV_MEASUREMENT' Missing macro 'VIR_NODE_SEV_CBITPOS' Missing macro 'VIR_NODE_SEV_CERT_CHAIN' Missing macro 'VIR_NODE_SEV_PDH' Missing macro 'VIR_NODE_SEV_REDUCED_PHYS_BITS' --- FAIL: TestAPICoverage (0.64s) panic: Missing symbols found [recovered] panic: Missing symbols found goroutine 5 [running]: testing.tRunner.func1(0xc4200b60f0) /usr/local/go/src/testing/testing.go:742 +0x29d panic(0x5adb00, 0x610d90) /usr/local/go/src/runtime/panic.go:502 +0x229 _/usr<https://ci.centos.org/job/libvirt-go-master-check/systems=libvirt-freebsd-11/ws/.TestAPICoverage(0xc4200b60f0)> /usr<https://ci.centos.org/job/libvirt-go-master-check/systems=libvirt-freebsd-11/ws/api_test.go>:506 +0x548 testing.tRunner(0xc4200b60f0, 0x5fbfe0) /usr/local/go/src/testing/testing.go:777 +0xd0 created by testing.(*T).Run /usr/local/go/src/testing/testing.go:824 +0x2e0 exit status 2 FAIL _/usr<https://ci.centos.org/job/libvirt-go-master-check/systems=libvirt-freebsd-11/ws/> 0.786s Build step 'Execute shell' marked build as failure

See <https://ci.centos.org/job/libvirt-go-master-check/systems=libvirt-freebsd-11/1115/display/redirect> ------------------------------------------ Started by upstream project "libvirt-go-master-check" build number 1115 originally caused by: Started by upstream project "libvirt-go-master-build" build number 1126 originally caused by: Started by upstream project "libvirt-master-build" build number 1525 originally caused by: Started by an SCM change [EnvInject] - Loading node environment variables. Building remotely on libvirt-freebsd-11 (libvirt) in workspace <https://ci.centos.org/job/libvirt-go-master-check/systems=libvirt-freebsd-11/ws/> [libvirt-go-master] $ /bin/sh -xe /tmp/jenkins3488395534133584607.sh + export 'TEST_ARGS=-tags api' + go test -tags api Missing function 'virDomainGetLaunchSecurityInfo' Missing function 'virNodeGetSEVInfo' Missing macro 'VIR_DOMAIN_LAUNCH_SECURITY_SEV_MEASUREMENT' Missing macro 'VIR_NODE_SEV_CBITPOS' Missing macro 'VIR_NODE_SEV_CERT_CHAIN' Missing macro 'VIR_NODE_SEV_PDH' Missing macro 'VIR_NODE_SEV_REDUCED_PHYS_BITS' --- FAIL: TestAPICoverage (0.32s) panic: Missing symbols found [recovered] panic: Missing symbols found goroutine 5 [running]: testing.tRunner.func1(0xc4200b60f0) /usr/local/go/src/testing/testing.go:742 +0x29d panic(0x5adb00, 0x610d90) /usr/local/go/src/runtime/panic.go:502 +0x229 _/usr<https://ci.centos.org/job/libvirt-go-master-check/systems=libvirt-freebsd-11/ws/.TestAPICoverage(0xc4200b60f0)> /usr<https://ci.centos.org/job/libvirt-go-master-check/systems=libvirt-freebsd-11/ws/api_test.go>:506 +0x548 testing.tRunner(0xc4200b60f0, 0x5fbfe0) /usr/local/go/src/testing/testing.go:777 +0xd0 created by testing.(*T).Run /usr/local/go/src/testing/testing.go:824 +0x2e0 exit status 2 FAIL _/usr<https://ci.centos.org/job/libvirt-go-master-check/systems=libvirt-freebsd-11/ws/> 0.370s Build step 'Execute shell' marked build as failure

See <https://ci.centos.org/job/libvirt-go-master-check/systems=libvirt-freebsd-11/1116/display/redirect> ------------------------------------------ Started by upstream project "libvirt-go-master-check" build number 1116 originally caused by: Started by upstream project "libvirt-go-master-build" build number 1127 originally caused by: Started by upstream project "libvirt-master-build" build number 1526 originally caused by: Started by an SCM change [EnvInject] - Loading node environment variables. Building remotely on libvirt-freebsd-11 (libvirt) in workspace <https://ci.centos.org/job/libvirt-go-master-check/systems=libvirt-freebsd-11/ws/> [libvirt-go-master] $ /bin/sh -xe /tmp/jenkins8695000235560273098.sh + export 'TEST_ARGS=-tags api' + go test -tags api Missing function 'virDomainGetLaunchSecurityInfo' Missing function 'virNodeGetSEVInfo' Missing macro 'VIR_DOMAIN_LAUNCH_SECURITY_SEV_MEASUREMENT' Missing macro 'VIR_NODE_SEV_CBITPOS' Missing macro 'VIR_NODE_SEV_CERT_CHAIN' Missing macro 'VIR_NODE_SEV_PDH' Missing macro 'VIR_NODE_SEV_REDUCED_PHYS_BITS' --- FAIL: TestAPICoverage (0.35s) panic: Missing symbols found [recovered] panic: Missing symbols found goroutine 5 [running]: testing.tRunner.func1(0xc4200ae0f0) /usr/local/go/src/testing/testing.go:742 +0x29d panic(0x5adb00, 0x610d90) /usr/local/go/src/runtime/panic.go:502 +0x229 _/usr<https://ci.centos.org/job/libvirt-go-master-check/systems=libvirt-freebsd-11/ws/.TestAPICoverage(0xc4200ae0f0)> /usr<https://ci.centos.org/job/libvirt-go-master-check/systems=libvirt-freebsd-11/ws/api_test.go>:506 +0x548 testing.tRunner(0xc4200ae0f0, 0x5fbfe0) /usr/local/go/src/testing/testing.go:777 +0xd0 created by testing.(*T).Run /usr/local/go/src/testing/testing.go:824 +0x2e0 exit status 2 FAIL _/usr<https://ci.centos.org/job/libvirt-go-master-check/systems=libvirt-freebsd-11/ws/> 0.501s Build step 'Execute shell' marked build as failure

See <https://ci.centos.org/job/libvirt-go-master-check/systems=libvirt-freebsd-11/1117/display/redirect> ------------------------------------------ Started by upstream project "libvirt-go-master-check" build number 1117 originally caused by: Started by upstream project "libvirt-go-master-build" build number 1128 originally caused by: Started by upstream project "libvirt-master-build" build number 1527 originally caused by: Started by an SCM change [EnvInject] - Loading node environment variables. Building remotely on libvirt-freebsd-11 (libvirt) in workspace <https://ci.centos.org/job/libvirt-go-master-check/systems=libvirt-freebsd-11/ws/> [libvirt-go-master] $ /bin/sh -xe /tmp/jenkins3796059826782841188.sh + export 'TEST_ARGS=-tags api' + go test -tags api Missing function 'virDomainGetLaunchSecurityInfo' Missing function 'virNodeGetSEVInfo' Missing macro 'VIR_DOMAIN_LAUNCH_SECURITY_SEV_MEASUREMENT' Missing macro 'VIR_NODE_SEV_CBITPOS' Missing macro 'VIR_NODE_SEV_CERT_CHAIN' Missing macro 'VIR_NODE_SEV_PDH' Missing macro 'VIR_NODE_SEV_REDUCED_PHYS_BITS' --- FAIL: TestAPICoverage (0.36s) panic: Missing symbols found [recovered] panic: Missing symbols found goroutine 20 [running]: testing.tRunner.func1(0xc4200ca0f0) /usr/local/go/src/testing/testing.go:742 +0x29d panic(0x5adb00, 0x610d90) /usr/local/go/src/runtime/panic.go:502 +0x229 _/usr<https://ci.centos.org/job/libvirt-go-master-check/systems=libvirt-freebsd-11/ws/.TestAPICoverage(0xc4200ca0f0)> /usr<https://ci.centos.org/job/libvirt-go-master-check/systems=libvirt-freebsd-11/ws/api_test.go>:506 +0x548 testing.tRunner(0xc4200ca0f0, 0x5fbfe0) /usr/local/go/src/testing/testing.go:777 +0xd0 created by testing.(*T).Run /usr/local/go/src/testing/testing.go:824 +0x2e0 exit status 2 FAIL _/usr<https://ci.centos.org/job/libvirt-go-master-check/systems=libvirt-freebsd-11/ws/> 0.479s Build step 'Execute shell' marked build as failure

See <https://ci.centos.org/job/libvirt-go-master-check/systems=libvirt-freebsd-11/1118/display/redirect> ------------------------------------------ Started by upstream project "libvirt-go-master-check" build number 1118 originally caused by: Started by upstream project "libvirt-go-master-build" build number 1129 originally caused by: Started by upstream project "libvirt-master-build" build number 1528 originally caused by: Started by an SCM change [EnvInject] - Loading node environment variables. Building remotely on libvirt-freebsd-11 (libvirt) in workspace <https://ci.centos.org/job/libvirt-go-master-check/systems=libvirt-freebsd-11/ws/> [libvirt-go-master] $ /bin/sh -xe /tmp/jenkins4574409968456667146.sh + export 'TEST_ARGS=-tags api' + go test -tags api Missing function 'virDomainGetLaunchSecurityInfo' Missing function 'virNodeGetSEVInfo' Missing macro 'VIR_DOMAIN_LAUNCH_SECURITY_SEV_MEASUREMENT' Missing macro 'VIR_NODE_SEV_CBITPOS' Missing macro 'VIR_NODE_SEV_CERT_CHAIN' Missing macro 'VIR_NODE_SEV_PDH' Missing macro 'VIR_NODE_SEV_REDUCED_PHYS_BITS' --- FAIL: TestAPICoverage (1.59s) panic: Missing symbols found [recovered] panic: Missing symbols found goroutine 5 [running]: testing.tRunner.func1(0xc4200b60f0) /usr/local/go/src/testing/testing.go:742 +0x29d panic(0x5adb00, 0x610d90) /usr/local/go/src/runtime/panic.go:502 +0x229 _/usr<https://ci.centos.org/job/libvirt-go-master-check/systems=libvirt-freebsd-11/ws/.TestAPICoverage(0xc4200b60f0)> /usr<https://ci.centos.org/job/libvirt-go-master-check/systems=libvirt-freebsd-11/ws/api_test.go>:506 +0x548 testing.tRunner(0xc4200b60f0, 0x5fbfe0) /usr/local/go/src/testing/testing.go:777 +0xd0 created by testing.(*T).Run /usr/local/go/src/testing/testing.go:824 +0x2e0 exit status 2 FAIL _/usr<https://ci.centos.org/job/libvirt-go-master-check/systems=libvirt-freebsd-11/ws/> 1.848s Build step 'Execute shell' marked build as failure

See <https://ci.centos.org/job/libvirt-go-master-check/systems=libvirt-freebsd-11/1119/display/redirect> ------------------------------------------ Started by upstream project "libvirt-go-master-check" build number 1119 originally caused by: Started by upstream project "libvirt-go-master-build" build number 1130 originally caused by: Started by upstream project "libvirt-master-build" build number 1529 originally caused by: Started by an SCM change Started by an SCM change Started by an SCM change [EnvInject] - Loading node environment variables. Building remotely on libvirt-freebsd-11 (libvirt) in workspace <https://ci.centos.org/job/libvirt-go-master-check/systems=libvirt-freebsd-11/ws/> [libvirt-go-master] $ /bin/sh -xe /tmp/jenkins8927386082337913438.sh + export 'TEST_ARGS=-tags api' + go test -tags api Missing function 'virDomainGetLaunchSecurityInfo' Missing function 'virNodeGetSEVInfo' Missing macro 'VIR_DOMAIN_LAUNCH_SECURITY_SEV_MEASUREMENT' Missing macro 'VIR_NODE_SEV_CBITPOS' Missing macro 'VIR_NODE_SEV_CERT_CHAIN' Missing macro 'VIR_NODE_SEV_PDH' Missing macro 'VIR_NODE_SEV_REDUCED_PHYS_BITS' --- FAIL: TestAPICoverage (0.84s) panic: Missing symbols found [recovered] panic: Missing symbols found goroutine 5 [running]: testing.tRunner.func1(0xc4200ae0f0) /usr/local/go/src/testing/testing.go:742 +0x29d panic(0x5adb00, 0x610d90) /usr/local/go/src/runtime/panic.go:502 +0x229 _/usr<https://ci.centos.org/job/libvirt-go-master-check/systems=libvirt-freebsd-11/ws/.TestAPICoverage(0xc4200ae0f0)> /usr<https://ci.centos.org/job/libvirt-go-master-check/systems=libvirt-freebsd-11/ws/api_test.go>:506 +0x548 testing.tRunner(0xc4200ae0f0, 0x5fbfe0) /usr/local/go/src/testing/testing.go:777 +0xd0 created by testing.(*T).Run /usr/local/go/src/testing/testing.go:824 +0x2e0 exit status 2 FAIL _/usr<https://ci.centos.org/job/libvirt-go-master-check/systems=libvirt-freebsd-11/ws/> 0.930s Build step 'Execute shell' marked build as failure

See <https://ci.centos.org/job/libvirt-go-master-check/systems=libvirt-freebsd-11/1120/display/redirect> ------------------------------------------ Started by upstream project "libvirt-go-master-check" build number 1120 originally caused by: Started by upstream project "libvirt-go-master-build" build number 1131 originally caused by: Started by upstream project "libvirt-master-build" build number 1530 originally caused by: Started by an SCM change [EnvInject] - Loading node environment variables. Building remotely on libvirt-freebsd-11 (libvirt) in workspace <https://ci.centos.org/job/libvirt-go-master-check/systems=libvirt-freebsd-11/ws/> [libvirt-go-master] $ /bin/sh -xe /tmp/jenkins512351359286079884.sh + export 'TEST_ARGS=-tags api' + go test -tags api Missing function 'virDomainGetLaunchSecurityInfo' Missing function 'virNodeGetSEVInfo' Missing macro 'VIR_DOMAIN_LAUNCH_SECURITY_SEV_MEASUREMENT' Missing macro 'VIR_NODE_SEV_CBITPOS' Missing macro 'VIR_NODE_SEV_CERT_CHAIN' Missing macro 'VIR_NODE_SEV_PDH' Missing macro 'VIR_NODE_SEV_REDUCED_PHYS_BITS' --- FAIL: TestAPICoverage (0.34s) panic: Missing symbols found [recovered] panic: Missing symbols found goroutine 19 [running]: testing.tRunner.func1(0xc4200cc0f0) /usr/local/go/src/testing/testing.go:742 +0x29d panic(0x5adb00, 0x610d90) /usr/local/go/src/runtime/panic.go:502 +0x229 _/usr<https://ci.centos.org/job/libvirt-go-master-check/systems=libvirt-freebsd-11/ws/.TestAPICoverage(0xc4200cc0f0)> /usr<https://ci.centos.org/job/libvirt-go-master-check/systems=libvirt-freebsd-11/ws/api_test.go>:506 +0x548 testing.tRunner(0xc4200cc0f0, 0x5fbfe0) /usr/local/go/src/testing/testing.go:777 +0xd0 created by testing.(*T).Run /usr/local/go/src/testing/testing.go:824 +0x2e0 exit status 2 FAIL _/usr<https://ci.centos.org/job/libvirt-go-master-check/systems=libvirt-freebsd-11/ws/> 0.439s Build step 'Execute shell' marked build as failure

See <https://ci.centos.org/job/libvirt-go-master-check/systems=libvirt-freebsd-11/1121/display/redirect> ------------------------------------------ Started by upstream project "libvirt-go-master-check" build number 1121 originally caused by: Started by upstream project "libvirt-go-master-build" build number 1132 originally caused by: Started by upstream project "libvirt-master-build" build number 1531 originally caused by: Started by an SCM change [EnvInject] - Loading node environment variables. Building remotely on libvirt-freebsd-11 (libvirt) in workspace <https://ci.centos.org/job/libvirt-go-master-check/systems=libvirt-freebsd-11/ws/> [libvirt-go-master] $ /bin/sh -xe /tmp/jenkins2282987642005506299.sh + export 'TEST_ARGS=-tags api' + go test -tags api Missing function 'virDomainGetLaunchSecurityInfo' Missing function 'virNodeGetSEVInfo' Missing macro 'VIR_DOMAIN_LAUNCH_SECURITY_SEV_MEASUREMENT' Missing macro 'VIR_NODE_SEV_CBITPOS' Missing macro 'VIR_NODE_SEV_CERT_CHAIN' Missing macro 'VIR_NODE_SEV_PDH' Missing macro 'VIR_NODE_SEV_REDUCED_PHYS_BITS' --- FAIL: TestAPICoverage (0.70s) panic: Missing symbols found [recovered] panic: Missing symbols found goroutine 19 [running]: testing.tRunner.func1(0xc4200cc0f0) /usr/local/go/src/testing/testing.go:742 +0x29d panic(0x5adb00, 0x610d90) /usr/local/go/src/runtime/panic.go:502 +0x229 _/usr<https://ci.centos.org/job/libvirt-go-master-check/systems=libvirt-freebsd-11/ws/.TestAPICoverage(0xc4200cc0f0)> /usr<https://ci.centos.org/job/libvirt-go-master-check/systems=libvirt-freebsd-11/ws/api_test.go>:506 +0x548 testing.tRunner(0xc4200cc0f0, 0x5fbfe0) /usr/local/go/src/testing/testing.go:777 +0xd0 created by testing.(*T).Run /usr/local/go/src/testing/testing.go:824 +0x2e0 exit status 2 FAIL _/usr<https://ci.centos.org/job/libvirt-go-master-check/systems=libvirt-freebsd-11/ws/> 0.774s Build step 'Execute shell' marked build as failure

See <https://ci.centos.org/job/libvirt-go-master-check/systems=libvirt-freebsd-11/1122/display/redirect> ------------------------------------------ Started by upstream project "libvirt-go-master-check" build number 1122 originally caused by: Started by upstream project "libvirt-go-master-build" build number 1133 originally caused by: Started by upstream project "libvirt-master-build" build number 1532 originally caused by: Started by an SCM change [EnvInject] - Loading node environment variables. Building remotely on libvirt-freebsd-11 (libvirt) in workspace <https://ci.centos.org/job/libvirt-go-master-check/systems=libvirt-freebsd-11/ws/> [libvirt-go-master] $ /bin/sh -xe /tmp/jenkins1389768569127938809.sh + export 'TEST_ARGS=-tags api' + go test -tags api Missing function 'virDomainGetLaunchSecurityInfo' Missing function 'virNodeGetSEVInfo' Missing macro 'VIR_DOMAIN_LAUNCH_SECURITY_SEV_MEASUREMENT' Missing macro 'VIR_NODE_SEV_CBITPOS' Missing macro 'VIR_NODE_SEV_CERT_CHAIN' Missing macro 'VIR_NODE_SEV_PDH' Missing macro 'VIR_NODE_SEV_REDUCED_PHYS_BITS' --- FAIL: TestAPICoverage (0.32s) panic: Missing symbols found [recovered] panic: Missing symbols found goroutine 19 [running]: testing.tRunner.func1(0xc4200cc0f0) /usr/local/go/src/testing/testing.go:742 +0x29d panic(0x5adb00, 0x610d90) /usr/local/go/src/runtime/panic.go:502 +0x229 _/usr<https://ci.centos.org/job/libvirt-go-master-check/systems=libvirt-freebsd-11/ws/.TestAPICoverage(0xc4200cc0f0)> /usr<https://ci.centos.org/job/libvirt-go-master-check/systems=libvirt-freebsd-11/ws/api_test.go>:506 +0x548 testing.tRunner(0xc4200cc0f0, 0x5fbfe0) /usr/local/go/src/testing/testing.go:777 +0xd0 created by testing.(*T).Run /usr/local/go/src/testing/testing.go:824 +0x2e0 exit status 2 FAIL _/usr<https://ci.centos.org/job/libvirt-go-master-check/systems=libvirt-freebsd-11/ws/> 0.405s Build step 'Execute shell' marked build as failure

See <https://ci.centos.org/job/libvirt-go-master-check/systems=libvirt-freebsd-11/1123/display/redirect> ------------------------------------------ Started by upstream project "libvirt-go-master-check" build number 1123 originally caused by: Started by upstream project "libvirt-go-master-build" build number 1134 originally caused by: Started by upstream project "libvirt-master-build" build number 1533 originally caused by: Started by an SCM change [EnvInject] - Loading node environment variables. Building remotely on libvirt-freebsd-11 (libvirt) in workspace <https://ci.centos.org/job/libvirt-go-master-check/systems=libvirt-freebsd-11/ws/> [libvirt-go-master] $ /bin/sh -xe /tmp/jenkins3241007811370535743.sh + export 'TEST_ARGS=-tags api' + go test -tags api Missing function 'virDomainGetLaunchSecurityInfo' Missing function 'virNodeGetSEVInfo' Missing macro 'VIR_DOMAIN_LAUNCH_SECURITY_SEV_MEASUREMENT' Missing macro 'VIR_NODE_SEV_CBITPOS' Missing macro 'VIR_NODE_SEV_CERT_CHAIN' Missing macro 'VIR_NODE_SEV_PDH' Missing macro 'VIR_NODE_SEV_REDUCED_PHYS_BITS' --- FAIL: TestAPICoverage (1.39s) panic: Missing symbols found [recovered] panic: Missing symbols found goroutine 4 [running]: testing.tRunner.func1(0xc4200b40f0) /usr/local/go/src/testing/testing.go:742 +0x29d panic(0x5adb00, 0x610d90) /usr/local/go/src/runtime/panic.go:502 +0x229 _/usr<https://ci.centos.org/job/libvirt-go-master-check/systems=libvirt-freebsd-11/ws/.TestAPICoverage(0xc4200b40f0)> /usr<https://ci.centos.org/job/libvirt-go-master-check/systems=libvirt-freebsd-11/ws/api_test.go>:506 +0x548 testing.tRunner(0xc4200b40f0, 0x5fbfe0) /usr/local/go/src/testing/testing.go:777 +0xd0 created by testing.(*T).Run /usr/local/go/src/testing/testing.go:824 +0x2e0 exit status 2 FAIL _/usr<https://ci.centos.org/job/libvirt-go-master-check/systems=libvirt-freebsd-11/ws/> 1.601s Build step 'Execute shell' marked build as failure

See <https://ci.centos.org/job/libvirt-go-master-check/systems=libvirt-freebsd-11/1124/display/redirect> ------------------------------------------ Started by upstream project "libvirt-go-master-check" build number 1124 originally caused by: Started by upstream project "libvirt-go-master-build" build number 1135 originally caused by: Started by upstream project "libvirt-master-build" build number 1534 originally caused by: Started by an SCM change [EnvInject] - Loading node environment variables. Building remotely on libvirt-freebsd-11 (libvirt) in workspace <https://ci.centos.org/job/libvirt-go-master-check/systems=libvirt-freebsd-11/ws/> [libvirt-go-master] $ /bin/sh -xe /tmp/jenkins2607023321731860524.sh + export 'TEST_ARGS=-tags api' + go test -tags api Missing function 'virDomainGetLaunchSecurityInfo' Missing function 'virNodeGetSEVInfo' Missing macro 'VIR_DOMAIN_LAUNCH_SECURITY_SEV_MEASUREMENT' Missing macro 'VIR_NODE_SEV_CBITPOS' Missing macro 'VIR_NODE_SEV_CERT_CHAIN' Missing macro 'VIR_NODE_SEV_PDH' Missing macro 'VIR_NODE_SEV_REDUCED_PHYS_BITS' --- FAIL: TestAPICoverage (0.43s) panic: Missing symbols found [recovered] panic: Missing symbols found goroutine 19 [running]: testing.tRunner.func1(0xc4200cc0f0) /usr/local/go/src/testing/testing.go:742 +0x29d panic(0x5adb00, 0x610d90) /usr/local/go/src/runtime/panic.go:502 +0x229 _/usr<https://ci.centos.org/job/libvirt-go-master-check/systems=libvirt-freebsd-11/ws/.TestAPICoverage(0xc4200cc0f0)> /usr<https://ci.centos.org/job/libvirt-go-master-check/systems=libvirt-freebsd-11/ws/api_test.go>:506 +0x548 testing.tRunner(0xc4200cc0f0, 0x5fbfe0) /usr/local/go/src/testing/testing.go:777 +0xd0 created by testing.(*T).Run /usr/local/go/src/testing/testing.go:824 +0x2e0 exit status 2 FAIL _/usr<https://ci.centos.org/job/libvirt-go-master-check/systems=libvirt-freebsd-11/ws/> 0.558s Build step 'Execute shell' marked build as failure

See <https://ci.centos.org/job/libvirt-go-master-check/systems=libvirt-freebsd-11/1125/display/redirect> ------------------------------------------ Started by upstream project "libvirt-go-master-check" build number 1125 originally caused by: Started by upstream project "libvirt-go-master-build" build number 1136 originally caused by: Started by upstream project "libvirt-master-build" build number 1535 originally caused by: Started by an SCM change [EnvInject] - Loading node environment variables. Building remotely on libvirt-freebsd-11 (libvirt) in workspace <https://ci.centos.org/job/libvirt-go-master-check/systems=libvirt-freebsd-11/ws/> [libvirt-go-master] $ /bin/sh -xe /tmp/jenkins3647403873316681871.sh + export 'TEST_ARGS=-tags api' + go test -tags api Missing function 'virDomainGetLaunchSecurityInfo' Missing function 'virNodeGetSEVInfo' Missing macro 'VIR_DOMAIN_LAUNCH_SECURITY_SEV_MEASUREMENT' Missing macro 'VIR_NODE_SEV_CBITPOS' Missing macro 'VIR_NODE_SEV_CERT_CHAIN' Missing macro 'VIR_NODE_SEV_PDH' Missing macro 'VIR_NODE_SEV_REDUCED_PHYS_BITS' --- FAIL: TestAPICoverage (0.40s) panic: Missing symbols found [recovered] panic: Missing symbols found goroutine 5 [running]: testing.tRunner.func1(0xc4200be0f0) /usr/local/go/src/testing/testing.go:742 +0x29d panic(0x5adb00, 0x610d90) /usr/local/go/src/runtime/panic.go:502 +0x229 _/usr<https://ci.centos.org/job/libvirt-go-master-check/systems=libvirt-freebsd-11/ws/.TestAPICoverage(0xc4200be0f0)> /usr<https://ci.centos.org/job/libvirt-go-master-check/systems=libvirt-freebsd-11/ws/api_test.go>:506 +0x548 testing.tRunner(0xc4200be0f0, 0x5fbfe0) /usr/local/go/src/testing/testing.go:777 +0xd0 created by testing.(*T).Run /usr/local/go/src/testing/testing.go:824 +0x2e0 exit status 2 FAIL _/usr<https://ci.centos.org/job/libvirt-go-master-check/systems=libvirt-freebsd-11/ws/> 0.506s Build step 'Execute shell' marked build as failure

See <https://ci.centos.org/job/libvirt-go-master-check/systems=libvirt-freebsd-11/1126/display/redirect> ------------------------------------------ Started by upstream project "libvirt-go-master-check" build number 1126 originally caused by: Started by upstream project "libvirt-go-master-build" build number 1138 originally caused by: Started by upstream project "libvirt-master-build" build number 1537 originally caused by: Started by user Libvirt [EnvInject] - Loading node environment variables. Building remotely on libvirt-freebsd-11 (libvirt) in workspace <https://ci.centos.org/job/libvirt-go-master-check/systems=libvirt-freebsd-11/ws/> [libvirt-go-master] $ /bin/sh -xe /tmp/jenkins7323924821668187147.sh + export 'TEST_ARGS=-tags api' + go test -tags api Missing function 'virConnectListAllNWFilterBindings' Missing function 'virNWFilterBindingCreateXML' Missing function 'virNWFilterBindingDelete' Missing function 'virNWFilterBindingFree' Missing function 'virNWFilterBindingGetFilterName' Missing function 'virNWFilterBindingGetPortDev' Missing function 'virNWFilterBindingGetXMLDesc' Missing function 'virNWFilterBindingLookupByPortDev' Missing function 'virNWFilterBindingRef' Missing enum 'VIR_CONNECT_GET_ALL_DOMAINS_STATS_NOWAIT' Missing enum 'VIR_ERR_INVALID_NWFILTER_BINDING' Missing enum 'VIR_ERR_NO_NWFILTER_BINDING' --- FAIL: TestAPICoverage (0.40s) panic: Missing symbols found [recovered] panic: Missing symbols found goroutine 4 [running]: testing.tRunner.func1(0xc4200b40f0) /usr/local/go/src/testing/testing.go:742 +0x29d panic(0x5addc0, 0x611050) /usr/local/go/src/runtime/panic.go:502 +0x229 _/usr<https://ci.centos.org/job/libvirt-go-master-check/systems=libvirt-freebsd-11/ws/.TestAPICoverage(0xc4200b40f0)> /usr<https://ci.centos.org/job/libvirt-go-master-check/systems=libvirt-freebsd-11/ws/api_test.go>:506 +0x548 testing.tRunner(0xc4200b40f0, 0x5fc2b0) /usr/local/go/src/testing/testing.go:777 +0xd0 created by testing.(*T).Run /usr/local/go/src/testing/testing.go:824 +0x2e0 exit status 2 FAIL _/usr<https://ci.centos.org/job/libvirt-go-master-check/systems=libvirt-freebsd-11/ws/> 0.598s Build step 'Execute shell' marked build as failure

See <https://ci.centos.org/job/libvirt-go-master-check/systems=libvirt-freebsd-11/1127/display/redirect> ------------------------------------------ Started by upstream project "libvirt-go-master-check" build number 1127 originally caused by: Started by upstream project "libvirt-go-master-build" build number 1139 originally caused by: Started by upstream project "libvirt-master-build" build number 1538 originally caused by: Started by an SCM change Started by an SCM change [EnvInject] - Loading node environment variables. Building remotely on libvirt-freebsd-11 (libvirt) in workspace <https://ci.centos.org/job/libvirt-go-master-check/systems=libvirt-freebsd-11/ws/> [libvirt-go-master] $ /bin/sh -xe /tmp/jenkins2417707539032080578.sh + export 'TEST_ARGS=-tags api' + go test -tags api Missing function 'virConnectListAllNWFilterBindings' Missing function 'virNWFilterBindingCreateXML' Missing function 'virNWFilterBindingDelete' Missing function 'virNWFilterBindingFree' Missing function 'virNWFilterBindingGetFilterName' Missing function 'virNWFilterBindingGetPortDev' Missing function 'virNWFilterBindingGetXMLDesc' Missing function 'virNWFilterBindingLookupByPortDev' Missing function 'virNWFilterBindingRef' Missing enum 'VIR_CONNECT_GET_ALL_DOMAINS_STATS_NOWAIT' Missing enum 'VIR_ERR_INVALID_NWFILTER_BINDING' Missing enum 'VIR_ERR_NO_NWFILTER_BINDING' --- FAIL: TestAPICoverage (0.54s) panic: Missing symbols found [recovered] panic: Missing symbols found goroutine 5 [running]: testing.tRunner.func1(0xc4200b60f0) /usr/local/go/src/testing/testing.go:742 +0x29d panic(0x5addc0, 0x611050) /usr/local/go/src/runtime/panic.go:502 +0x229 _/usr<https://ci.centos.org/job/libvirt-go-master-check/systems=libvirt-freebsd-11/ws/.TestAPICoverage(0xc4200b60f0)> /usr<https://ci.centos.org/job/libvirt-go-master-check/systems=libvirt-freebsd-11/ws/api_test.go>:506 +0x548 testing.tRunner(0xc4200b60f0, 0x5fc2b0) /usr/local/go/src/testing/testing.go:777 +0xd0 created by testing.(*T).Run /usr/local/go/src/testing/testing.go:824 +0x2e0 exit status 2 FAIL _/usr<https://ci.centos.org/job/libvirt-go-master-check/systems=libvirt-freebsd-11/ws/> 0.612s Build step 'Execute shell' marked build as failure

See <https://ci.centos.org/job/libvirt-go-master-check/systems=libvirt-freebsd-11/1128/display/redirect> ------------------------------------------ Started by upstream project "libvirt-go-master-check" build number 1128 originally caused by: Started by upstream project "libvirt-go-master-build" build number 1140 originally caused by: Started by upstream project "libvirt-master-build" build number 1539 originally caused by: Started by an SCM change Started by an SCM change Started by an SCM change [EnvInject] - Loading node environment variables. Building remotely on libvirt-freebsd-11 (libvirt) in workspace <https://ci.centos.org/job/libvirt-go-master-check/systems=libvirt-freebsd-11/ws/> [libvirt-go-master] $ /bin/sh -xe /tmp/jenkins4128247324505267547.sh + export 'TEST_ARGS=-tags api' + go test -tags api Missing function 'virConnectListAllNWFilterBindings' Missing function 'virNWFilterBindingCreateXML' Missing function 'virNWFilterBindingDelete' Missing function 'virNWFilterBindingFree' Missing function 'virNWFilterBindingGetFilterName' Missing function 'virNWFilterBindingGetPortDev' Missing function 'virNWFilterBindingGetXMLDesc' Missing function 'virNWFilterBindingLookupByPortDev' Missing function 'virNWFilterBindingRef' Missing enum 'VIR_CONNECT_GET_ALL_DOMAINS_STATS_NOWAIT' Missing enum 'VIR_ERR_INVALID_NWFILTER_BINDING' Missing enum 'VIR_ERR_NO_NWFILTER_BINDING' --- FAIL: TestAPICoverage (1.44s) panic: Missing symbols found [recovered] panic: Missing symbols found goroutine 19 [running]: testing.tRunner.func1(0xc4200cc0f0) /usr/local/go/src/testing/testing.go:742 +0x29d panic(0x5addc0, 0x611050) /usr/local/go/src/runtime/panic.go:502 +0x229 _/usr<https://ci.centos.org/job/libvirt-go-master-check/systems=libvirt-freebsd-11/ws/.TestAPICoverage(0xc4200cc0f0)> /usr<https://ci.centos.org/job/libvirt-go-master-check/systems=libvirt-freebsd-11/ws/api_test.go>:506 +0x548 testing.tRunner(0xc4200cc0f0, 0x5fc2b0) /usr/local/go/src/testing/testing.go:777 +0xd0 created by testing.(*T).Run /usr/local/go/src/testing/testing.go:824 +0x2e0 exit status 2 FAIL _/usr<https://ci.centos.org/job/libvirt-go-master-check/systems=libvirt-freebsd-11/ws/> 1.598s Build step 'Execute shell' marked build as failure

participants (1)
-
ci@centos.org