libvirt | Pipeline #130456760 has failed for master | 8018858d

Your pipeline has failed. Project: libvirt ( https://gitlab.com/libvirt/libvirt ) Branch: master ( https://gitlab.com/libvirt/libvirt/-/commits/master ) Commit: 8018858d ( https://gitlab.com/libvirt/libvirt/-/commit/8018858d23abc3423bfe4384750d0522... ) Commit Message: docs: virtfs: add section separators Signed-of... Commit Author: Christian Schoenebeck Committed by: Jano Tomko ( https://gitlab.com/jano.tomko ) Pipeline #130456760 ( https://gitlab.com/libvirt/libvirt/pipelines/130456760 ) triggered by Libvirt Automatic Mirror ( https://gitlab.com/libvirt-mirror ) had 2 failed builds. Job #488736204 ( https://gitlab.com/libvirt/libvirt/-/jobs/488736204/raw ) Stage: cross_build Name: mingw32-fedora-30 Trace: CC util/libvirt_util_la-virauth.lo CC util/libvirt_util_la-virauthconfig.lo CC util/libvirt_util_la-virbitmap.lo CC util/libvirt_util_la-virbpf.lo CC util/libvirt_util_la-virbuffer.lo CC util/libvirt_util_la-virperf.lo CC util/libvirt_util_la-vircgroup.lo CC util/libvirt_util_la-vircgroupbackend.lo CC util/libvirt_util_la-vircgroupv1.lo CC util/libvirt_util_la-vircgroupv2.lo CC util/libvirt_util_la-vircgroupv2devices.lo CC util/libvirt_util_la-vircommand.lo CC util/libvirt_util_la-virconf.lo CC util/libvirt_util_la-vircrypto.lo CC util/libvirt_util_la-virdaemon.lo ../../src/util/virdaemon.c:25:10: fatal error: sys/wait.h: No such file or directory #include <sys/wait.h> ^~~~~~~~~~~~ compilation terminated. make[3]: *** [Makefile:10547: util/libvirt_util_la-virdaemon.lo] Error 1 make[3]: Leaving directory '/builds/libvirt/libvirt/build/src' make[2]: *** [Makefile:6418: all] Error 2 make[2]: Leaving directory '/builds/libvirt/libvirt/build/src' make[1]: *** [Makefile:777: all-recursive] Error 1 make[1]: Leaving directory '/builds/libvirt/libvirt/build' make: *** [Makefile:670: all] Error 2 section_end:1585329651:build_script [0Ksection_start:1585329651:after_script [0K[0K[36;1mRunning after_script[0;m [0;msection_end:1585329652:after_script [0Ksection_start:1585329652:upload_artifacts_on_failure [0K[0K[36;1mUploading artifacts for failed job[0;m [0;msection_end:1585329654:upload_artifacts_on_failure [0K[31;1mERROR: Job failed: exit code 1 [0;m Job #488736205 ( https://gitlab.com/libvirt/libvirt/-/jobs/488736205/raw ) Stage: cross_build Name: mingw64-fedora-30 Trace: CC util/libvirt_util_la-virauth.lo CC util/libvirt_util_la-virauthconfig.lo CC util/libvirt_util_la-virbitmap.lo CC util/libvirt_util_la-virbpf.lo CC util/libvirt_util_la-virbuffer.lo CC util/libvirt_util_la-virperf.lo CC util/libvirt_util_la-vircgroup.lo CC util/libvirt_util_la-vircgroupbackend.lo CC util/libvirt_util_la-vircgroupv1.lo CC util/libvirt_util_la-vircgroupv2.lo CC util/libvirt_util_la-vircgroupv2devices.lo CC util/libvirt_util_la-vircommand.lo CC util/libvirt_util_la-virconf.lo CC util/libvirt_util_la-vircrypto.lo CC util/libvirt_util_la-virdaemon.lo ../../src/util/virdaemon.c:25:10: fatal error: sys/wait.h: No such file or directory #include <sys/wait.h> ^~~~~~~~~~~~ compilation terminated. make[3]: *** [Makefile:10547: util/libvirt_util_la-virdaemon.lo] Error 1 make[3]: Leaving directory '/builds/libvirt/libvirt/build/src' make[2]: *** [Makefile:6418: all] Error 2 make[2]: Leaving directory '/builds/libvirt/libvirt/build/src' make[1]: *** [Makefile:777: all-recursive] Error 1 make[1]: Leaving directory '/builds/libvirt/libvirt/build' make: *** [Makefile:670: all] Error 2 section_end:1585329650:build_script [0Ksection_start:1585329650:after_script [0K[0K[36;1mRunning after_script[0;m [0;msection_end:1585329652:after_script [0Ksection_start:1585329652:upload_artifacts_on_failure [0K[0K[36;1mUploading artifacts for failed job[0;m [0;msection_end:1585329653:upload_artifacts_on_failure [0K[31;1mERROR: Job failed: exit code 1 [0;m -- You're receiving this email because of your account on gitlab.com.
participants (1)
-
GitLab