[Libvirt-ci] Build failed in Jenkins: libvirt-go-check » libvirt-debian-9 #905

See <https://ci.centos.org/job/libvirt-go-check/systems=libvirt-debian-9/905/display/redirect> ------------------------------------------ Started by upstream project "libvirt-go-check" build number 905 originally caused by: Started by upstream project "libvirt-go-build" build number 919 originally caused by: Started by upstream project "libvirt-build" build number 1088 originally caused by: Started by an SCM change Running as SYSTEM [EnvInject] - Loading node environment variables. Building remotely on libvirt-debian-9 (libvirt) in workspace <https://ci.centos.org/job/libvirt-go-check/systems=libvirt-debian-9/ws/> [libvirt-go] $ /bin/sh -xe /tmp/jenkins5700620132850409130.sh + export TEST_ARGS=-tags api + go test -tags api Missing enum 'VIR_DOMAIN_STATS_MEMORY' --- FAIL: TestAPICoverage (0.54s) panic: Missing symbols found [recovered] panic: Missing symbols found goroutine 5 [running]: panic(0x55cb4a5a1680, 0xc42043d9a0) /usr/lib/go-1.7/src/runtime/panic.go:500 +0x1a1 testing.tRunner.func1(0xc42007a180) /usr/lib/go-1.7/src/testing/testing.go:579 +0x25d panic(0x55cb4a5a1680, 0xc42043d9a0) /usr/lib/go-1.7/src/runtime/panic.go:458 +0x243 _<https://ci.centos.org/job/libvirt-go-check/systems=libvirt-debian-9/ws/.TestAPICoverage(0xc42007a180)> <https://ci.centos.org/job/libvirt-go-check/systems=libvirt-debian-9/ws/api_test.go>:503 +0x5ff testing.tRunner(0xc42007a180, 0x55cb4a5f4f68) /usr/lib/go-1.7/src/testing/testing.go:610 +0x81 created by testing.(*T).Run /usr/lib/go-1.7/src/testing/testing.go:646 +0x2ec exit status 2 FAIL _<https://ci.centos.org/job/libvirt-go-check/systems=libvirt-debian-9/ws/> 0.635s Build step 'Execute shell' marked build as failure

See <https://ci.centos.org/job/libvirt-go-check/systems=libvirt-debian-9/906/display/redirect> ------------------------------------------ Started by upstream project "libvirt-go-check" build number 906 originally caused by: Started by upstream project "libvirt-go-build" build number 920 originally caused by: Started by upstream project "libvirt-build" build number 1093 originally caused by: Started by an SCM change Running as SYSTEM [EnvInject] - Loading node environment variables. Building remotely on libvirt-debian-9 (libvirt) in workspace <https://ci.centos.org/job/libvirt-go-check/systems=libvirt-debian-9/ws/> [libvirt-go] $ /bin/sh -xe /tmp/jenkins348407235394656301.sh + export TEST_ARGS=-tags api + go test -tags api Missing enum 'VIR_DOMAIN_STATS_MEMORY' --- FAIL: TestAPICoverage (1.30s) panic: Missing symbols found [recovered] panic: Missing symbols found goroutine 5 [running]: panic(0x560e2ba05680, 0xc42043d870) /usr/lib/go-1.7/src/runtime/panic.go:500 +0x1a1 testing.tRunner.func1(0xc42007a180) /usr/lib/go-1.7/src/testing/testing.go:579 +0x25d panic(0x560e2ba05680, 0xc42043d870) /usr/lib/go-1.7/src/runtime/panic.go:458 +0x243 _<https://ci.centos.org/job/libvirt-go-check/systems=libvirt-debian-9/ws/.TestAPICoverage(0xc42007a180)> <https://ci.centos.org/job/libvirt-go-check/systems=libvirt-debian-9/ws/api_test.go>:503 +0x5ff testing.tRunner(0xc42007a180, 0x560e2ba58f68) /usr/lib/go-1.7/src/testing/testing.go:610 +0x81 created by testing.(*T).Run /usr/lib/go-1.7/src/testing/testing.go:646 +0x2ec exit status 2 FAIL _<https://ci.centos.org/job/libvirt-go-check/systems=libvirt-debian-9/ws/> 1.636s Build step 'Execute shell' marked build as failure

See <https://ci.centos.org/job/libvirt-go-check/systems=libvirt-debian-9/907/display/redirect> ------------------------------------------ Started by upstream project "libvirt-go-check" build number 907 originally caused by: Started by upstream project "libvirt-go-build" build number 921 originally caused by: Started by upstream project "libvirt-build" build number 1094 originally caused by: Started by an SCM change Running as SYSTEM [EnvInject] - Loading node environment variables. Building remotely on libvirt-debian-9 (libvirt) in workspace <https://ci.centos.org/job/libvirt-go-check/systems=libvirt-debian-9/ws/> [libvirt-go] $ /bin/sh -xe /tmp/jenkins5885474454014086590.sh + export TEST_ARGS=-tags api + go test -tags api Missing enum 'VIR_DOMAIN_STATS_MEMORY' --- FAIL: TestAPICoverage (1.44s) panic: Missing symbols found [recovered] panic: Missing symbols found goroutine 5 [running]: panic(0x556935d10680, 0xc420449540) /usr/lib/go-1.7/src/runtime/panic.go:500 +0x1a1 testing.tRunner.func1(0xc42007a180) /usr/lib/go-1.7/src/testing/testing.go:579 +0x25d panic(0x556935d10680, 0xc420449540) /usr/lib/go-1.7/src/runtime/panic.go:458 +0x243 _<https://ci.centos.org/job/libvirt-go-check/systems=libvirt-debian-9/ws/.TestAPICoverage(0xc42007a180)> <https://ci.centos.org/job/libvirt-go-check/systems=libvirt-debian-9/ws/api_test.go>:503 +0x5ff testing.tRunner(0xc42007a180, 0x556935d63f68) /usr/lib/go-1.7/src/testing/testing.go:610 +0x81 created by testing.(*T).Run /usr/lib/go-1.7/src/testing/testing.go:646 +0x2ec exit status 2 FAIL _<https://ci.centos.org/job/libvirt-go-check/systems=libvirt-debian-9/ws/> 1.718s Build step 'Execute shell' marked build as failure

See <https://ci.centos.org/job/libvirt-go-check/systems=libvirt-debian-9/908/display/redirect> ------------------------------------------ Started by upstream project "libvirt-go-check" build number 908 originally caused by: Started by upstream project "libvirt-go-build" build number 922 originally caused by: Started by upstream project "libvirt-build" build number 1095 originally caused by: Started by an SCM change Running as SYSTEM [EnvInject] - Loading node environment variables. Building remotely on libvirt-debian-9 (libvirt) in workspace <https://ci.centos.org/job/libvirt-go-check/systems=libvirt-debian-9/ws/> [libvirt-go] $ /bin/sh -xe /tmp/jenkins4744364398223030955.sh + export TEST_ARGS=-tags api + go test -tags api Missing enum 'VIR_DOMAIN_STATS_MEMORY' --- FAIL: TestAPICoverage (1.40s) panic: Missing symbols found [recovered] panic: Missing symbols found goroutine 5 [running]: panic(0x55eb57059680, 0xc420229120) /usr/lib/go-1.7/src/runtime/panic.go:500 +0x1a1 testing.tRunner.func1(0xc42007a180) /usr/lib/go-1.7/src/testing/testing.go:579 +0x25d panic(0x55eb57059680, 0xc420229120) /usr/lib/go-1.7/src/runtime/panic.go:458 +0x243 _<https://ci.centos.org/job/libvirt-go-check/systems=libvirt-debian-9/ws/.TestAPICoverage(0xc42007a180)> <https://ci.centos.org/job/libvirt-go-check/systems=libvirt-debian-9/ws/api_test.go>:503 +0x5ff testing.tRunner(0xc42007a180, 0x55eb570acf68) /usr/lib/go-1.7/src/testing/testing.go:610 +0x81 created by testing.(*T).Run /usr/lib/go-1.7/src/testing/testing.go:646 +0x2ec exit status 2 FAIL _<https://ci.centos.org/job/libvirt-go-check/systems=libvirt-debian-9/ws/> 1.760s Build step 'Execute shell' marked build as failure

See <https://ci.centos.org/job/libvirt-go-check/systems=libvirt-debian-9/909/display/redirect> ------------------------------------------ Started by upstream project "libvirt-go-check" build number 909 originally caused by: Started by upstream project "libvirt-go-build" build number 923 originally caused by: Started by upstream project "libvirt-build" build number 1096 originally caused by: Started by an SCM change Running as SYSTEM [EnvInject] - Loading node environment variables. Building remotely on libvirt-debian-9 (libvirt) in workspace <https://ci.centos.org/job/libvirt-go-check/systems=libvirt-debian-9/ws/> [libvirt-go] $ /bin/sh -xe /tmp/jenkins8532785233617775362.sh + export TEST_ARGS=-tags api + go test -tags api Missing enum 'VIR_DOMAIN_STATS_MEMORY' --- FAIL: TestAPICoverage (0.99s) panic: Missing symbols found [recovered] panic: Missing symbols found goroutine 19 [running]: panic(0x55ccb5e77680, 0xc42043f500) /usr/lib/go-1.7/src/runtime/panic.go:500 +0x1a1 testing.tRunner.func1(0xc420090180) /usr/lib/go-1.7/src/testing/testing.go:579 +0x25d panic(0x55ccb5e77680, 0xc42043f500) /usr/lib/go-1.7/src/runtime/panic.go:458 +0x243 _<https://ci.centos.org/job/libvirt-go-check/systems=libvirt-debian-9/ws/.TestAPICoverage(0xc420090180)> <https://ci.centos.org/job/libvirt-go-check/systems=libvirt-debian-9/ws/api_test.go>:503 +0x5ff testing.tRunner(0xc420090180, 0x55ccb5ecaf68) /usr/lib/go-1.7/src/testing/testing.go:610 +0x81 created by testing.(*T).Run /usr/lib/go-1.7/src/testing/testing.go:646 +0x2ec exit status 2 FAIL _<https://ci.centos.org/job/libvirt-go-check/systems=libvirt-debian-9/ws/> 1.218s Build step 'Execute shell' marked build as failure

See <https://ci.centos.org/job/libvirt-go-check/systems=libvirt-debian-9/910/display/redirect> ------------------------------------------ Started by upstream project "libvirt-go-check" build number 910 originally caused by: Started by upstream project "libvirt-go-build" build number 924 originally caused by: Started by upstream project "libvirt-build" build number 1097 originally caused by: Started by an SCM change Started by an SCM change Started by an SCM change Running as SYSTEM [EnvInject] - Loading node environment variables. Building remotely on libvirt-debian-9 (libvirt) in workspace <https://ci.centos.org/job/libvirt-go-check/systems=libvirt-debian-9/ws/> [libvirt-go] $ /bin/sh -xe /tmp/jenkins8146550713919303607.sh + export TEST_ARGS=-tags api + go test -tags api Missing enum 'VIR_DOMAIN_STATS_MEMORY' --- FAIL: TestAPICoverage (0.83s) panic: Missing symbols found [recovered] panic: Missing symbols found goroutine 5 [running]: panic(0x5567d8c4f680, 0xc42043d7c0) /usr/lib/go-1.7/src/runtime/panic.go:500 +0x1a1 testing.tRunner.func1(0xc42007a180) /usr/lib/go-1.7/src/testing/testing.go:579 +0x25d panic(0x5567d8c4f680, 0xc42043d7c0) /usr/lib/go-1.7/src/runtime/panic.go:458 +0x243 _<https://ci.centos.org/job/libvirt-go-check/systems=libvirt-debian-9/ws/.TestAPICoverage(0xc42007a180)> <https://ci.centos.org/job/libvirt-go-check/systems=libvirt-debian-9/ws/api_test.go>:503 +0x5ff testing.tRunner(0xc42007a180, 0x5567d8ca2f68) /usr/lib/go-1.7/src/testing/testing.go:610 +0x81 created by testing.(*T).Run /usr/lib/go-1.7/src/testing/testing.go:646 +0x2ec exit status 2 FAIL _<https://ci.centos.org/job/libvirt-go-check/systems=libvirt-debian-9/ws/> 0.941s Build step 'Execute shell' marked build as failure

See <https://ci.centos.org/job/libvirt-go-check/systems=libvirt-debian-9/911/display/redirect> ------------------------------------------ Started by upstream project "libvirt-go-check" build number 911 originally caused by: Started by upstream project "libvirt-go-build" build number 925 originally caused by: Started by upstream project "libvirt-build" build number 1098 originally caused by: Started by an SCM change Started by an SCM change Started by an SCM change Running as SYSTEM [EnvInject] - Loading node environment variables. Building remotely on libvirt-debian-9 (libvirt) in workspace <https://ci.centos.org/job/libvirt-go-check/systems=libvirt-debian-9/ws/> [libvirt-go] $ /bin/sh -xe /tmp/jenkins6191131326708926535.sh + export TEST_ARGS=-tags api + go test -tags api Missing enum 'VIR_DOMAIN_STATS_MEMORY' --- FAIL: TestAPICoverage (1.63s) panic: Missing symbols found [recovered] panic: Missing symbols found goroutine 5 [running]: panic(0x564b8e41b680, 0xc42043d860) /usr/lib/go-1.7/src/runtime/panic.go:500 +0x1a1 testing.tRunner.func1(0xc42007a180) /usr/lib/go-1.7/src/testing/testing.go:579 +0x25d panic(0x564b8e41b680, 0xc42043d860) /usr/lib/go-1.7/src/runtime/panic.go:458 +0x243 _<https://ci.centos.org/job/libvirt-go-check/systems=libvirt-debian-9/ws/.TestAPICoverage(0xc42007a180)> <https://ci.centos.org/job/libvirt-go-check/systems=libvirt-debian-9/ws/api_test.go>:503 +0x5ff testing.tRunner(0xc42007a180, 0x564b8e46ef68) /usr/lib/go-1.7/src/testing/testing.go:610 +0x81 created by testing.(*T).Run /usr/lib/go-1.7/src/testing/testing.go:646 +0x2ec exit status 2 FAIL _<https://ci.centos.org/job/libvirt-go-check/systems=libvirt-debian-9/ws/> 1.790s Build step 'Execute shell' marked build as failure

See <https://ci.centos.org/job/libvirt-go-check/systems=libvirt-debian-9/912/display/redirect> ------------------------------------------ Started by upstream project "libvirt-go-check" build number 912 originally caused by: Started by upstream project "libvirt-go-build" build number 926 originally caused by: Started by upstream project "libvirt-build" build number 1099 originally caused by: Started by user Libvirt Running as SYSTEM [EnvInject] - Loading node environment variables. Building remotely on libvirt-debian-9 (libvirt) in workspace <https://ci.centos.org/job/libvirt-go-check/systems=libvirt-debian-9/ws/> [libvirt-go] $ /bin/sh -xe /tmp/jenkins8944786298297685222.sh + export TEST_ARGS=-tags api + go test -tags api Missing enum 'VIR_DOMAIN_STATS_MEMORY' --- FAIL: TestAPICoverage (1.05s) panic: Missing symbols found [recovered] panic: Missing symbols found goroutine 18 [running]: panic(0x5604fa89d680, 0xc420443d60) /usr/lib/go-1.7/src/runtime/panic.go:500 +0x1a1 testing.tRunner.func1(0xc4200b40c0) /usr/lib/go-1.7/src/testing/testing.go:579 +0x25d panic(0x5604fa89d680, 0xc420443d60) /usr/lib/go-1.7/src/runtime/panic.go:458 +0x243 _<https://ci.centos.org/job/libvirt-go-check/systems=libvirt-debian-9/ws/.TestAPICoverage(0xc4200b40c0)> <https://ci.centos.org/job/libvirt-go-check/systems=libvirt-debian-9/ws/api_test.go>:503 +0x5ff testing.tRunner(0xc4200b40c0, 0x5604fa8f0f68) /usr/lib/go-1.7/src/testing/testing.go:610 +0x81 created by testing.(*T).Run /usr/lib/go-1.7/src/testing/testing.go:646 +0x2ec exit status 2 FAIL _<https://ci.centos.org/job/libvirt-go-check/systems=libvirt-debian-9/ws/> 1.185s Build step 'Execute shell' marked build as failure

participants (1)
-
ci@centos.org