[Libvirt-ci] Build failed in Jenkins: libvirt-go-xml-check » libvirt-fedora-28 #173

See <https://ci.centos.org/job/libvirt-go-xml-check/systems=libvirt-fedora-28/173/display/redirect> ------------------------------------------ Started by upstream project "libvirt-go-xml-check" build number 173 originally caused by: Started by upstream project "libvirt-go-xml-build" build number 173 originally caused by: Started by upstream project "libvirt-build" build number 205 originally caused by: Started by an SCM change [EnvInject] - Loading node environment variables. Building remotely on libvirt-fedora-28 (libvirt) in workspace <https://ci.centos.org/job/libvirt-go-xml-check/systems=libvirt-fedora-28/ws/> [libvirt-go-xml] $ /bin/sh -xe /tmp/jenkins6714397891657157582.sh + export 'TEST_ARGS=-tags xmlroundtrip' + TEST_ARGS='-tags xmlroundtrip' + go test -tags xmlroundtrip --- FAIL: TestRoundTrip (27.19s) xml_test.go:400: testdata/libvirt/tests/qemuxml2argvdata/memory-hotplug-nvdimm-align.xml: /domain[0]/devices[0]/memory[0]/source[0]/alignsize[0]: element in expected XML missing in actual XML FAIL exit status 1 FAIL _<https://ci.centos.org/job/libvirt-go-xml-check/systems=libvirt-fedora-28/ws/> 27.371s Build step 'Execute shell' marked build as failure

See <https://ci.centos.org/job/libvirt-go-xml-check/systems=libvirt-fedora-28/174/display/redirect> ------------------------------------------ Started by upstream project "libvirt-go-xml-check" build number 174 originally caused by: Started by upstream project "libvirt-go-xml-build" build number 174 originally caused by: Started by upstream project "libvirt-build" build number 206 originally caused by: Started by an SCM change [EnvInject] - Loading node environment variables. Building remotely on libvirt-fedora-28 (libvirt) in workspace <https://ci.centos.org/job/libvirt-go-xml-check/systems=libvirt-fedora-28/ws/> [libvirt-go-xml] $ /bin/sh -xe /tmp/jenkins1871132066891008502.sh + export 'TEST_ARGS=-tags xmlroundtrip' + TEST_ARGS='-tags xmlroundtrip' + go test -tags xmlroundtrip --- FAIL: TestRoundTrip (16.88s) xml_test.go:400: testdata/libvirt/tests/qemuxml2argvdata/memory-hotplug-nvdimm-align.xml: /domain[0]/devices[0]/memory[0]/source[0]/alignsize[0]: element in expected XML missing in actual XML FAIL exit status 1 FAIL _<https://ci.centos.org/job/libvirt-go-xml-check/systems=libvirt-fedora-28/ws/> 17.051s Build step 'Execute shell' marked build as failure

See <https://ci.centos.org/job/libvirt-go-xml-check/systems=libvirt-fedora-28/175/display/redirect> ------------------------------------------ Started by upstream project "libvirt-go-xml-check" build number 175 originally caused by: Started by upstream project "libvirt-go-xml-build" build number 175 originally caused by: Started by upstream project "libvirt-build" build number 209 originally caused by: Started by an SCM change [EnvInject] - Loading node environment variables. Building remotely on libvirt-fedora-28 (libvirt) in workspace <https://ci.centos.org/job/libvirt-go-xml-check/systems=libvirt-fedora-28/ws/> [libvirt-go-xml] $ /bin/sh -xe /tmp/jenkins5443543685799481556.sh + export 'TEST_ARGS=-tags xmlroundtrip' + TEST_ARGS='-tags xmlroundtrip' + go test -tags xmlroundtrip --- FAIL: TestRoundTrip (15.74s) xml_test.go:400: testdata/libvirt/tests/qemuxml2argvdata/memory-hotplug-nvdimm-align.xml: /domain[0]/devices[0]/memory[0]/source[0]/alignsize[0]: element in expected XML missing in actual XML FAIL exit status 1 FAIL _<https://ci.centos.org/job/libvirt-go-xml-check/systems=libvirt-fedora-28/ws/> 15.826s Build step 'Execute shell' marked build as failure

See <https://ci.centos.org/job/libvirt-go-xml-check/systems=libvirt-fedora-28/176/display/redirect> ------------------------------------------ Started by upstream project "libvirt-go-xml-check" build number 176 originally caused by: Started by upstream project "libvirt-go-xml-build" build number 176 originally caused by: Started by upstream project "libvirt-build" build number 210 originally caused by: Started by an SCM change [EnvInject] - Loading node environment variables. Building remotely on libvirt-fedora-28 (libvirt) in workspace <https://ci.centos.org/job/libvirt-go-xml-check/systems=libvirt-fedora-28/ws/> [libvirt-go-xml] $ /bin/sh -xe /tmp/jenkins3920064693144970274.sh + export 'TEST_ARGS=-tags xmlroundtrip' + TEST_ARGS='-tags xmlroundtrip' + go test -tags xmlroundtrip --- FAIL: TestRoundTrip (18.64s) xml_test.go:400: testdata/libvirt/tests/qemuxml2argvdata/memory-hotplug-nvdimm-align.xml: /domain[0]/devices[0]/memory[0]/source[0]/alignsize[0]: element in expected XML missing in actual XML FAIL exit status 1 FAIL _<https://ci.centos.org/job/libvirt-go-xml-check/systems=libvirt-fedora-28/ws/> 18.721s Build step 'Execute shell' marked build as failure

See <https://ci.centos.org/job/libvirt-go-xml-check/systems=libvirt-fedora-28/177/display/redirect> ------------------------------------------ Started by upstream project "libvirt-go-xml-check" build number 177 originally caused by: Started by upstream project "libvirt-go-xml-build" build number 177 originally caused by: Started by upstream project "libvirt-build" build number 211 originally caused by: Started by an SCM change [EnvInject] - Loading node environment variables. Building remotely on libvirt-fedora-28 (libvirt) in workspace <https://ci.centos.org/job/libvirt-go-xml-check/systems=libvirt-fedora-28/ws/> [libvirt-go-xml] $ /bin/sh -xe /tmp/jenkins6531766207450809179.sh + export 'TEST_ARGS=-tags xmlroundtrip' + TEST_ARGS='-tags xmlroundtrip' + go test -tags xmlroundtrip --- FAIL: TestRoundTrip (14.81s) xml_test.go:400: testdata/libvirt/tests/qemuxml2argvdata/memory-hotplug-nvdimm-align.xml: /domain[0]/devices[0]/memory[0]/source[0]/alignsize[0]: element in expected XML missing in actual XML FAIL exit status 1 FAIL _<https://ci.centos.org/job/libvirt-go-xml-check/systems=libvirt-fedora-28/ws/> 14.914s Build step 'Execute shell' marked build as failure

See <https://ci.centos.org/job/libvirt-go-xml-check/systems=libvirt-fedora-28/178/display/redirect> ------------------------------------------ Started by upstream project "libvirt-go-xml-check" build number 178 originally caused by: Started by upstream project "libvirt-go-xml-build" build number 178 originally caused by: Started by upstream project "libvirt-build" build number 212 originally caused by: Started by an SCM change Started by an SCM change Started by an SCM change Started by an SCM change Started by an SCM change Started by an SCM change Started by an SCM change [EnvInject] - Loading node environment variables. Building remotely on libvirt-fedora-28 (libvirt) in workspace <https://ci.centos.org/job/libvirt-go-xml-check/systems=libvirt-fedora-28/ws/> [libvirt-go-xml] $ /bin/sh -xe /tmp/jenkins8574435350128819154.sh + export 'TEST_ARGS=-tags xmlroundtrip' + TEST_ARGS='-tags xmlroundtrip' + go test -tags xmlroundtrip --- FAIL: TestRoundTrip (9.37s) xml_test.go:400: testdata/libvirt/tests/qemuxml2argvdata/memory-hotplug-nvdimm-align.xml: /domain[0]/devices[0]/memory[0]/source[0]/alignsize[0]: element in expected XML missing in actual XML FAIL exit status 1 FAIL _<https://ci.centos.org/job/libvirt-go-xml-check/systems=libvirt-fedora-28/ws/> 9.437s Build step 'Execute shell' marked build as failure

See <https://ci.centos.org/job/libvirt-go-xml-check/systems=libvirt-fedora-28/179/display/redirect> ------------------------------------------ Started by upstream project "libvirt-go-xml-check" build number 179 originally caused by: Started by upstream project "libvirt-go-xml-build" build number 179 originally caused by: Started by upstream project "libvirt-build" build number 213 originally caused by: Started by an SCM change [EnvInject] - Loading node environment variables. Building remotely on libvirt-fedora-28 (libvirt) in workspace <https://ci.centos.org/job/libvirt-go-xml-check/systems=libvirt-fedora-28/ws/> [libvirt-go-xml] $ /bin/sh -xe /tmp/jenkins3323731407302979751.sh + export 'TEST_ARGS=-tags xmlroundtrip' + TEST_ARGS='-tags xmlroundtrip' + go test -tags xmlroundtrip --- FAIL: TestRoundTrip (17.39s) xml_test.go:400: testdata/libvirt/tests/qemuxml2argvdata/memory-hotplug-nvdimm-align.xml: /domain[0]/devices[0]/memory[0]/source[0]/alignsize[0]: element in expected XML missing in actual XML FAIL exit status 1 FAIL _<https://ci.centos.org/job/libvirt-go-xml-check/systems=libvirt-fedora-28/ws/> 17.645s Build step 'Execute shell' marked build as failure

See <https://ci.centos.org/job/libvirt-go-xml-check/systems=libvirt-fedora-28/180/display/redirect> ------------------------------------------ Started by upstream project "libvirt-go-xml-check" build number 180 originally caused by: Started by upstream project "libvirt-go-xml-build" build number 180 originally caused by: Started by upstream project "libvirt-build" build number 214 originally caused by: Started by an SCM change [EnvInject] - Loading node environment variables. Building remotely on libvirt-fedora-28 (libvirt) in workspace <https://ci.centos.org/job/libvirt-go-xml-check/systems=libvirt-fedora-28/ws/> [libvirt-go-xml] $ /bin/sh -xe /tmp/jenkins314534061094451310.sh + export 'TEST_ARGS=-tags xmlroundtrip' + TEST_ARGS='-tags xmlroundtrip' + go test -tags xmlroundtrip --- FAIL: TestRoundTrip (25.01s) xml_test.go:400: testdata/libvirt/tests/qemuxml2argvdata/memory-hotplug-nvdimm-align.xml: /domain[0]/devices[0]/memory[0]/source[0]/alignsize[0]: element in expected XML missing in actual XML FAIL exit status 1 FAIL _<https://ci.centos.org/job/libvirt-go-xml-check/systems=libvirt-fedora-28/ws/> 25.165s Build step 'Execute shell' marked build as failure

See <https://ci.centos.org/job/libvirt-go-xml-check/systems=libvirt-fedora-28/181/display/redirect> ------------------------------------------ Started by upstream project "libvirt-go-xml-check" build number 181 originally caused by: Started by upstream project "libvirt-go-xml-build" build number 181 originally caused by: Started by upstream project "libvirt-build" build number 215 originally caused by: Started by an SCM change [EnvInject] - Loading node environment variables. Building remotely on libvirt-fedora-28 (libvirt) in workspace <https://ci.centos.org/job/libvirt-go-xml-check/systems=libvirt-fedora-28/ws/> [libvirt-go-xml] $ /bin/sh -xe /tmp/jenkins3571224278869429470.sh + export 'TEST_ARGS=-tags xmlroundtrip' + TEST_ARGS='-tags xmlroundtrip' + go test -tags xmlroundtrip --- FAIL: TestRoundTrip (19.63s) xml_test.go:400: testdata/libvirt/tests/qemuxml2argvdata/memory-hotplug-nvdimm-align.xml: /domain[0]/devices[0]/memory[0]/source[0]/alignsize[0]: element in expected XML missing in actual XML FAIL exit status 1 FAIL _<https://ci.centos.org/job/libvirt-go-xml-check/systems=libvirt-fedora-28/ws/> 19.724s Build step 'Execute shell' marked build as failure

See <https://ci.centos.org/job/libvirt-go-xml-check/systems=libvirt-fedora-28/182/display/redirect> ------------------------------------------ Started by upstream project "libvirt-go-xml-check" build number 182 originally caused by: Started by upstream project "libvirt-go-xml-build" build number 182 originally caused by: Started by upstream project "libvirt-build" build number 216 originally caused by: Started by an SCM change Started by an SCM change Started by an SCM change [EnvInject] - Loading node environment variables. Building remotely on libvirt-fedora-28 (libvirt) in workspace <https://ci.centos.org/job/libvirt-go-xml-check/systems=libvirt-fedora-28/ws/> [libvirt-go-xml] $ /bin/sh -xe /tmp/jenkins5156778420663925362.sh + export 'TEST_ARGS=-tags xmlroundtrip' + TEST_ARGS='-tags xmlroundtrip' + go test -tags xmlroundtrip --- FAIL: TestRoundTrip (20.34s) xml_test.go:400: testdata/libvirt/tests/qemuxml2argvdata/memory-hotplug-nvdimm-align.xml: /domain[0]/devices[0]/memory[0]/source[0]/alignsize[0]: element in expected XML missing in actual XML FAIL exit status 1 FAIL _<https://ci.centos.org/job/libvirt-go-xml-check/systems=libvirt-fedora-28/ws/> 20.401s Build step 'Execute shell' marked build as failure

See <https://ci.centos.org/job/libvirt-go-xml-check/systems=libvirt-fedora-28/183/display/redirect> ------------------------------------------ Started by upstream project "libvirt-go-xml-check" build number 183 originally caused by: Started by upstream project "libvirt-go-xml-build" build number 183 originally caused by: Started by upstream project "libvirt-build" build number 217 originally caused by: Started by an SCM change [EnvInject] - Loading node environment variables. Building remotely on libvirt-fedora-28 (libvirt) in workspace <https://ci.centos.org/job/libvirt-go-xml-check/systems=libvirt-fedora-28/ws/> [libvirt-go-xml] $ /bin/sh -xe /tmp/jenkins5067750697893519339.sh + export 'TEST_ARGS=-tags xmlroundtrip' + TEST_ARGS='-tags xmlroundtrip' + go test -tags xmlroundtrip --- FAIL: TestRoundTrip (26.44s) xml_test.go:400: testdata/libvirt/tests/qemuxml2argvdata/memory-hotplug-nvdimm-align.xml: /domain[0]/devices[0]/memory[0]/source[0]/alignsize[0]: element in expected XML missing in actual XML FAIL exit status 1 FAIL _<https://ci.centos.org/job/libvirt-go-xml-check/systems=libvirt-fedora-28/ws/> 26.638s Build step 'Execute shell' marked build as failure

See <https://ci.centos.org/job/libvirt-go-xml-check/systems=libvirt-fedora-28/184/display/redirect> ------------------------------------------ Started by upstream project "libvirt-go-xml-check" build number 184 originally caused by: Started by upstream project "libvirt-go-xml-build" build number 184 originally caused by: Started by upstream project "libvirt-build" build number 218 originally caused by: Started by an SCM change [EnvInject] - Loading node environment variables. Building remotely on libvirt-fedora-28 (libvirt) in workspace <https://ci.centos.org/job/libvirt-go-xml-check/systems=libvirt-fedora-28/ws/> [libvirt-go-xml] $ /bin/sh -xe /tmp/jenkins165885607343177242.sh + export 'TEST_ARGS=-tags xmlroundtrip' + TEST_ARGS='-tags xmlroundtrip' + go test -tags xmlroundtrip --- FAIL: TestRoundTrip (25.19s) xml_test.go:400: testdata/libvirt/tests/qemuxml2argvdata/memory-hotplug-nvdimm-align.xml: /domain[0]/devices[0]/memory[0]/source[0]/alignsize[0]: element in expected XML missing in actual XML FAIL exit status 1 FAIL _<https://ci.centos.org/job/libvirt-go-xml-check/systems=libvirt-fedora-28/ws/> 25.245s Build step 'Execute shell' marked build as failure

See <https://ci.centos.org/job/libvirt-go-xml-check/systems=libvirt-fedora-28/185/display/redirect> ------------------------------------------ Started by upstream project "libvirt-go-xml-check" build number 185 originally caused by: Started by upstream project "libvirt-go-xml-build" build number 185 originally caused by: Started by upstream project "libvirt-build" build number 219 originally caused by: Started by an SCM change Started by an SCM change Started by an SCM change Started by an SCM change [EnvInject] - Loading node environment variables. Building remotely on libvirt-fedora-28 (libvirt) in workspace <https://ci.centos.org/job/libvirt-go-xml-check/systems=libvirt-fedora-28/ws/> [libvirt-go-xml] $ /bin/sh -xe /tmp/jenkins6494861592706378040.sh + export 'TEST_ARGS=-tags xmlroundtrip' + TEST_ARGS='-tags xmlroundtrip' + go test -tags xmlroundtrip --- FAIL: TestRoundTrip (14.61s) xml_test.go:400: testdata/libvirt/tests/qemuxml2argvdata/memory-hotplug-nvdimm-align.xml: /domain[0]/devices[0]/memory[0]/source[0]/alignsize[0]: element in expected XML missing in actual XML FAIL exit status 1 FAIL _<https://ci.centos.org/job/libvirt-go-xml-check/systems=libvirt-fedora-28/ws/> 14.659s Build step 'Execute shell' marked build as failure

See <https://ci.centos.org/job/libvirt-go-xml-check/systems=libvirt-fedora-28/186/display/redirect> ------------------------------------------ Started by upstream project "libvirt-go-xml-check" build number 186 originally caused by: Started by upstream project "libvirt-go-xml-build" build number 186 originally caused by: Started by upstream project "libvirt-build" build number 220 originally caused by: Started by an SCM change Started by an SCM change [EnvInject] - Loading node environment variables. Building remotely on libvirt-fedora-28 (libvirt) in workspace <https://ci.centos.org/job/libvirt-go-xml-check/systems=libvirt-fedora-28/ws/> [libvirt-go-xml] $ /bin/sh -xe /tmp/jenkins5595301687449947250.sh + export 'TEST_ARGS=-tags xmlroundtrip' + TEST_ARGS='-tags xmlroundtrip' + go test -tags xmlroundtrip --- FAIL: TestRoundTrip (12.72s) xml_test.go:400: testdata/libvirt/tests/qemuxml2argvdata/memory-hotplug-nvdimm-align.xml: /domain[0]/devices[0]/memory[0]/source[0]/alignsize[0]: element in expected XML missing in actual XML FAIL exit status 1 FAIL _<https://ci.centos.org/job/libvirt-go-xml-check/systems=libvirt-fedora-28/ws/> 12.797s Build step 'Execute shell' marked build as failure

See <https://ci.centos.org/job/libvirt-go-xml-check/systems=libvirt-fedora-28/187/display/redirect> ------------------------------------------ Started by upstream project "libvirt-go-xml-check" build number 187 originally caused by: Started by upstream project "libvirt-go-xml-build" build number 187 originally caused by: Started by upstream project "libvirt-build" build number 221 originally caused by: Started by an SCM change Started by an SCM change Started by an SCM change Started by an SCM change [EnvInject] - Loading node environment variables. Building remotely on libvirt-fedora-28 (libvirt) in workspace <https://ci.centos.org/job/libvirt-go-xml-check/systems=libvirt-fedora-28/ws/> [libvirt-go-xml] $ /bin/sh -xe /tmp/jenkins3352780561743961750.sh + export 'TEST_ARGS=-tags xmlroundtrip' + TEST_ARGS='-tags xmlroundtrip' + go test -tags xmlroundtrip --- FAIL: TestRoundTrip (13.91s) xml_test.go:400: testdata/libvirt/tests/qemuxml2argvdata/memory-hotplug-nvdimm-align.xml: /domain[0]/devices[0]/memory[0]/source[0]/alignsize[0]: element in expected XML missing in actual XML FAIL exit status 1 FAIL _<https://ci.centos.org/job/libvirt-go-xml-check/systems=libvirt-fedora-28/ws/> 14.096s Build step 'Execute shell' marked build as failure

See <https://ci.centos.org/job/libvirt-go-xml-check/systems=libvirt-fedora-28/188/display/redirect> ------------------------------------------ Started by upstream project "libvirt-go-xml-check" build number 188 originally caused by: Started by upstream project "libvirt-go-xml-build" build number 188 originally caused by: Started by upstream project "libvirt-build" build number 222 originally caused by: Started by an SCM change [EnvInject] - Loading node environment variables. Building remotely on libvirt-fedora-28 (libvirt) in workspace <https://ci.centos.org/job/libvirt-go-xml-check/systems=libvirt-fedora-28/ws/> [libvirt-go-xml] $ /bin/sh -xe /tmp/jenkins2161366753233078703.sh + export 'TEST_ARGS=-tags xmlroundtrip' + TEST_ARGS='-tags xmlroundtrip' + go test -tags xmlroundtrip --- FAIL: TestRoundTrip (27.90s) xml_test.go:400: testdata/libvirt/tests/qemuxml2argvdata/memory-hotplug-nvdimm-align.xml: /domain[0]/devices[0]/memory[0]/source[0]/alignsize[0]: element in expected XML missing in actual XML FAIL exit status 1 FAIL _<https://ci.centos.org/job/libvirt-go-xml-check/systems=libvirt-fedora-28/ws/> 28.133s Build step 'Execute shell' marked build as failure

See <https://ci.centos.org/job/libvirt-go-xml-check/systems=libvirt-fedora-28/189/display/redirect> ------------------------------------------ Started by upstream project "libvirt-go-xml-check" build number 189 originally caused by: Started by upstream project "libvirt-go-xml-build" build number 189 originally caused by: Started by upstream project "libvirt-build" build number 223 originally caused by: Started by an SCM change [EnvInject] - Loading node environment variables. Building remotely on libvirt-fedora-28 (libvirt) in workspace <https://ci.centos.org/job/libvirt-go-xml-check/systems=libvirt-fedora-28/ws/> [libvirt-go-xml] $ /bin/sh -xe /tmp/jenkins171571083348363846.sh + export 'TEST_ARGS=-tags xmlroundtrip' + TEST_ARGS='-tags xmlroundtrip' + go test -tags xmlroundtrip --- FAIL: TestRoundTrip (18.78s) xml_test.go:400: testdata/libvirt/tests/qemuxml2argvdata/memory-hotplug-nvdimm-align.xml: /domain[0]/devices[0]/memory[0]/source[0]/alignsize[0]: element in expected XML missing in actual XML FAIL exit status 1 FAIL _<https://ci.centos.org/job/libvirt-go-xml-check/systems=libvirt-fedora-28/ws/> 18.990s Build step 'Execute shell' marked build as failure

See <https://ci.centos.org/job/libvirt-go-xml-check/systems=libvirt-fedora-28/190/display/redirect> ------------------------------------------ Started by upstream project "libvirt-go-xml-check" build number 190 originally caused by: Started by upstream project "libvirt-go-xml-build" build number 190 originally caused by: Started by upstream project "libvirt-build" build number 224 originally caused by: Started by an SCM change [EnvInject] - Loading node environment variables. Building remotely on libvirt-fedora-28 (libvirt) in workspace <https://ci.centos.org/job/libvirt-go-xml-check/systems=libvirt-fedora-28/ws/> [libvirt-go-xml] $ /bin/sh -xe /tmp/jenkins5172638709567694190.sh + export 'TEST_ARGS=-tags xmlroundtrip' + TEST_ARGS='-tags xmlroundtrip' + go test -tags xmlroundtrip --- FAIL: TestRoundTrip (18.36s) xml_test.go:400: testdata/libvirt/tests/qemuxml2argvdata/memory-hotplug-nvdimm-align.xml: /domain[0]/devices[0]/memory[0]/source[0]/alignsize[0]: element in expected XML missing in actual XML FAIL exit status 1 FAIL _<https://ci.centos.org/job/libvirt-go-xml-check/systems=libvirt-fedora-28/ws/> 18.495s Build step 'Execute shell' marked build as failure

See <https://ci.centos.org/job/libvirt-go-xml-check/systems=libvirt-fedora-28/191/display/redirect> ------------------------------------------ Started by upstream project "libvirt-go-xml-check" build number 191 originally caused by: Started by upstream project "libvirt-go-xml-build" build number 191 originally caused by: Started by upstream project "libvirt-build" build number 225 originally caused by: Started by an SCM change Started by an SCM change Started by an SCM change Started by an SCM change Started by an SCM change [EnvInject] - Loading node environment variables. Building remotely on libvirt-fedora-28 (libvirt) in workspace <https://ci.centos.org/job/libvirt-go-xml-check/systems=libvirt-fedora-28/ws/> [libvirt-go-xml] $ /bin/sh -xe /tmp/jenkins2648863037068851317.sh + export 'TEST_ARGS=-tags xmlroundtrip' + TEST_ARGS='-tags xmlroundtrip' + go test -tags xmlroundtrip --- FAIL: TestRoundTrip (15.01s) xml_test.go:400: testdata/libvirt/tests/qemuxml2argvdata/memory-hotplug-nvdimm-align.xml: /domain[0]/devices[0]/memory[0]/source[0]/alignsize[0]: element in expected XML missing in actual XML FAIL exit status 1 FAIL _<https://ci.centos.org/job/libvirt-go-xml-check/systems=libvirt-fedora-28/ws/> 15.119s Build step 'Execute shell' marked build as failure

See <https://ci.centos.org/job/libvirt-go-xml-check/systems=libvirt-fedora-28/192/display/redirect> ------------------------------------------ Started by upstream project "libvirt-go-xml-check" build number 192 originally caused by: Started by upstream project "libvirt-go-xml-build" build number 192 originally caused by: Started by upstream project "libvirt-build" build number 226 originally caused by: Started by an SCM change [EnvInject] - Loading node environment variables. Building remotely on libvirt-fedora-28 (libvirt) in workspace <https://ci.centos.org/job/libvirt-go-xml-check/systems=libvirt-fedora-28/ws/> [libvirt-go-xml] $ /bin/sh -xe /tmp/jenkins2409779324256320655.sh + export 'TEST_ARGS=-tags xmlroundtrip' + TEST_ARGS='-tags xmlroundtrip' + go test -tags xmlroundtrip --- FAIL: TestRoundTrip (35.91s) xml_test.go:400: testdata/libvirt/tests/qemuxml2argvdata/memory-hotplug-nvdimm-align.xml: /domain[0]/devices[0]/memory[0]/source[0]/alignsize[0]: element in expected XML missing in actual XML FAIL exit status 1 FAIL _<https://ci.centos.org/job/libvirt-go-xml-check/systems=libvirt-fedora-28/ws/> 36.149s Build step 'Execute shell' marked build as failure

See <https://ci.centos.org/job/libvirt-go-xml-check/systems=libvirt-fedora-28/193/display/redirect> ------------------------------------------ Started by upstream project "libvirt-go-xml-check" build number 193 originally caused by: Started by upstream project "libvirt-go-xml-build" build number 193 originally caused by: Started by upstream project "libvirt-build" build number 227 originally caused by: Started by an SCM change [EnvInject] - Loading node environment variables. Building remotely on libvirt-fedora-28 (libvirt) in workspace <https://ci.centos.org/job/libvirt-go-xml-check/systems=libvirt-fedora-28/ws/> [libvirt-go-xml] $ /bin/sh -xe /tmp/jenkins202449305406427775.sh + export 'TEST_ARGS=-tags xmlroundtrip' + TEST_ARGS='-tags xmlroundtrip' + go test -tags xmlroundtrip --- FAIL: TestRoundTrip (22.02s) xml_test.go:400: testdata/libvirt/tests/qemuxml2argvdata/memory-hotplug-nvdimm-align.xml: /domain[0]/devices[0]/memory[0]/source[0]/alignsize[0]: element in expected XML missing in actual XML FAIL exit status 1 FAIL _<https://ci.centos.org/job/libvirt-go-xml-check/systems=libvirt-fedora-28/ws/> 22.249s Build step 'Execute shell' marked build as failure

See <https://ci.centos.org/job/libvirt-go-xml-check/systems=libvirt-fedora-28/194/display/redirect> ------------------------------------------ Started by upstream project "libvirt-go-xml-check" build number 194 originally caused by: Started by upstream project "libvirt-go-xml-build" build number 194 originally caused by: Started by upstream project "libvirt-build" build number 228 originally caused by: Started by an SCM change Started by an SCM change Started by an SCM change Started by an SCM change Started by an SCM change Started by an SCM change Started by an SCM change [EnvInject] - Loading node environment variables. Building remotely on libvirt-fedora-28 (libvirt) in workspace <https://ci.centos.org/job/libvirt-go-xml-check/systems=libvirt-fedora-28/ws/> [libvirt-go-xml] $ /bin/sh -xe /tmp/jenkins1880575230733777008.sh + export 'TEST_ARGS=-tags xmlroundtrip' + TEST_ARGS='-tags xmlroundtrip' + go test -tags xmlroundtrip --- FAIL: TestRoundTrip (15.81s) xml_test.go:400: testdata/libvirt/tests/qemuxml2argvdata/memory-hotplug-nvdimm-align.xml: /domain[0]/devices[0]/memory[0]/source[0]/alignsize[0]: element in expected XML missing in actual XML FAIL exit status 1 FAIL _<https://ci.centos.org/job/libvirt-go-xml-check/systems=libvirt-fedora-28/ws/> 16.046s Build step 'Execute shell' marked build as failure

See <https://ci.centos.org/job/libvirt-go-xml-check/systems=libvirt-fedora-28/195/display/redirect> ------------------------------------------ Started by upstream project "libvirt-go-xml-check" build number 195 originally caused by: Started by upstream project "libvirt-go-xml-build" build number 195 originally caused by: Started by upstream project "libvirt-build" build number 229 originally caused by: Started by an SCM change Started by an SCM change Started by an SCM change Started by an SCM change [EnvInject] - Loading node environment variables. Building remotely on libvirt-fedora-28 (libvirt) in workspace <https://ci.centos.org/job/libvirt-go-xml-check/systems=libvirt-fedora-28/ws/> [libvirt-go-xml] $ /bin/sh -xe /tmp/jenkins5872092888204098807.sh + export 'TEST_ARGS=-tags xmlroundtrip' + TEST_ARGS='-tags xmlroundtrip' + go test -tags xmlroundtrip --- FAIL: TestRoundTrip (16.76s) xml_test.go:400: testdata/libvirt/tests/qemuxml2argvdata/memory-hotplug-nvdimm-align.xml: /domain[0]/devices[0]/memory[0]/source[0]/alignsize[0]: element in expected XML missing in actual XML FAIL exit status 1 FAIL _<https://ci.centos.org/job/libvirt-go-xml-check/systems=libvirt-fedora-28/ws/> 16.885s Build step 'Execute shell' marked build as failure

participants (1)
-
ci@centos.org