Build failed in Jenkins: libvirt-go-xml-check » libvirt-fedora-30 #959

See <https://ci.centos.org/job/libvirt-go-xml-check/systems=libvirt-fedora-30/959/display/redirect> ------------------------------------------ Started by upstream project "libvirt-go-xml-check" build number 959 originally caused by: Started by upstream project "libvirt-go-xml-build" build number 962 originally caused by: Started by upstream project "libvirt-build" build number 1127 originally caused by: Started by an SCM change Started by an SCM change Running as SYSTEM [EnvInject] - Loading node environment variables. Building remotely on libvirt-fedora-30 (libvirt) in workspace <https://ci.centos.org/job/libvirt-go-xml-check/systems=libvirt-fedora-30/ws/> [libvirt-go-xml] $ /bin/sh -xe /tmp/jenkins3480170385858061828.sh + export 'TEST_ARGS=-tags xmlroundtrip' + TEST_ARGS='-tags xmlroundtrip' + go test -tags xmlroundtrip --- FAIL: TestRoundTrip (32.55s) xml_test.go:374: testdata/libvirt/tests/qemuxml2argvdata/virtio-rng-builtin.xml: /domain[0]/devices[0]/rng[0]/backend[0]: element in expected XML missing in actual XML FAIL exit status 1 FAIL _<https://ci.centos.org/job/libvirt-go-xml-check/systems=libvirt-fedora-30/ws/> 32.637s Build step 'Execute shell' marked build as failure

See <https://ci.centos.org/job/libvirt-go-xml-check/systems=libvirt-fedora-30/960/display/redirect> ------------------------------------------ Started by upstream project "libvirt-go-xml-check" build number 960 originally caused by: Started by upstream project "libvirt-go-xml-build" build number 963 originally caused by: Started by upstream project "libvirt-build" build number 1128 originally caused by: Started by an SCM change Running as SYSTEM [EnvInject] - Loading node environment variables. Building remotely on libvirt-fedora-30 (libvirt) in workspace <https://ci.centos.org/job/libvirt-go-xml-check/systems=libvirt-fedora-30/ws/> [libvirt-go-xml] $ /bin/sh -xe /tmp/jenkins4303780499950427347.sh + export 'TEST_ARGS=-tags xmlroundtrip' + TEST_ARGS='-tags xmlroundtrip' + go test -tags xmlroundtrip --- FAIL: TestRoundTrip (39.04s) xml_test.go:374: testdata/libvirt/tests/qemuxml2argvdata/virtio-rng-builtin.xml: /domain[0]/devices[0]/rng[0]/backend[0]: element in expected XML missing in actual XML FAIL exit status 1 FAIL _<https://ci.centos.org/job/libvirt-go-xml-check/systems=libvirt-fedora-30/ws/> 39.122s Build step 'Execute shell' marked build as failure

See <https://ci.centos.org/job/libvirt-go-xml-check/systems=libvirt-fedora-30/961/display/redirect> ------------------------------------------ Started by upstream project "libvirt-go-xml-check" build number 961 originally caused by: Started by upstream project "libvirt-go-xml-build" build number 964 originally caused by: Started by upstream project "libvirt-build" build number 1131 originally caused by: Started by an SCM change Running as SYSTEM [EnvInject] - Loading node environment variables. Building remotely on libvirt-fedora-30 (libvirt) in workspace <https://ci.centos.org/job/libvirt-go-xml-check/systems=libvirt-fedora-30/ws/> [libvirt-go-xml] $ /bin/sh -xe /tmp/jenkins6583078287394925261.sh + export 'TEST_ARGS=-tags xmlroundtrip' + TEST_ARGS='-tags xmlroundtrip' + go test -tags xmlroundtrip --- FAIL: TestRoundTrip (47.46s) xml_test.go:374: testdata/libvirt/tests/qemuxml2argvdata/virtio-rng-builtin.xml: /domain[0]/devices[0]/rng[0]/backend[0]: element in expected XML missing in actual XML FAIL exit status 1 FAIL _<https://ci.centos.org/job/libvirt-go-xml-check/systems=libvirt-fedora-30/ws/> 47.561s Build step 'Execute shell' marked build as failure

See <https://ci.centos.org/job/libvirt-go-xml-check/systems=libvirt-fedora-30/962/display/redirect> ------------------------------------------ Started by upstream project "libvirt-go-xml-check" build number 962 originally caused by: Started by upstream project "libvirt-go-xml-build" build number 965 originally caused by: Started by upstream project "libvirt-build" build number 1132 originally caused by: Started by an SCM change Started by an SCM change Started by an SCM change Started by an SCM change Running as SYSTEM [EnvInject] - Loading node environment variables. Building remotely on libvirt-fedora-30 (libvirt) in workspace <https://ci.centos.org/job/libvirt-go-xml-check/systems=libvirt-fedora-30/ws/> [libvirt-go-xml] $ /bin/sh -xe /tmp/jenkins1911348613392213871.sh + export 'TEST_ARGS=-tags xmlroundtrip' + TEST_ARGS='-tags xmlroundtrip' + go test -tags xmlroundtrip --- FAIL: TestRoundTrip (38.10s) xml_test.go:374: testdata/libvirt/tests/qemuxml2argvdata/virtio-rng-builtin.xml: /domain[0]/devices[0]/rng[0]/backend[0]: element in expected XML missing in actual XML FAIL exit status 1 FAIL _<https://ci.centos.org/job/libvirt-go-xml-check/systems=libvirt-fedora-30/ws/> 38.325s Build step 'Execute shell' marked build as failure

See <https://ci.centos.org/job/libvirt-go-xml-check/systems=libvirt-fedora-30/963/display/redirect> ------------------------------------------ Started by upstream project "libvirt-go-xml-check" build number 963 originally caused by: Started by upstream project "libvirt-go-xml-build" build number 966 originally caused by: Started by upstream project "libvirt-build" build number 1133 originally caused by: Started by an SCM change Running as SYSTEM [EnvInject] - Loading node environment variables. Building remotely on libvirt-fedora-30 (libvirt) in workspace <https://ci.centos.org/job/libvirt-go-xml-check/systems=libvirt-fedora-30/ws/> [libvirt-go-xml] $ /bin/sh -xe /tmp/jenkins11180093396373611082.sh + export 'TEST_ARGS=-tags xmlroundtrip' + TEST_ARGS='-tags xmlroundtrip' + go test -tags xmlroundtrip --- FAIL: TestRoundTrip (18.03s) xml_test.go:374: testdata/libvirt/tests/qemuxml2argvdata/virtio-rng-builtin.xml: /domain[0]/devices[0]/rng[0]/backend[0]: element in expected XML missing in actual XML FAIL exit status 1 FAIL _<https://ci.centos.org/job/libvirt-go-xml-check/systems=libvirt-fedora-30/ws/> 18.069s Build step 'Execute shell' marked build as failure

participants (1)
-
ci@centos.org