[Libvirt-ci] Build failed in Jenkins: libvirt-go-xml-master-check » libvirt-centos-7 #459

See <https://ci.centos.org/job/libvirt-go-xml-master-check/systems=libvirt-centos-7/459/display/redirect> ------------------------------------------ Started by upstream project "libvirt-go-xml-master-check" build number 459 originally caused by: Started by upstream project "libvirt-go-xml-master-build" build number 467 originally caused by: Started by upstream project "libvirt-master-build" build number 1519 originally caused by: Started by an SCM change Started by an SCM change [EnvInject] - Loading node environment variables. Building remotely on libvirt-centos-7 (libvirt) in workspace <https://ci.centos.org/job/libvirt-go-xml-master-check/systems=libvirt-centos-7/ws/> [libvirt-go-xml-master] $ /bin/sh -xe /tmp/jenkins1094353572975337378.sh + export 'TEST_ARGS=-tags xmlroundtrip' + TEST_ARGS='-tags xmlroundtrip' + go test -tags xmlroundtrip --- FAIL: TestRoundTrip (18.66s) xml_test.go:383: testdata/libvirt/tests/genericxml2xmlindata/launch-security-sev.xml: /domain[0]/launch-security[0]: element in expected XML missing in actual XML FAIL exit status 1 FAIL _<https://ci.centos.org/job/libvirt-go-xml-master-check/systems=libvirt-centos-7/ws/> 18.801s Build step 'Execute shell' marked build as failure

See <https://ci.centos.org/job/libvirt-go-xml-master-check/systems=libvirt-centos-7/460/display/redirect> ------------------------------------------ Started by upstream project "libvirt-go-xml-master-check" build number 460 originally caused by: Started by upstream project "libvirt-go-xml-master-build" build number 468 originally caused by: Started by upstream project "libvirt-master-build" build number 1520 originally caused by: Started by an SCM change Started by an SCM change Started by an SCM change Started by an SCM change [EnvInject] - Loading node environment variables. Building remotely on libvirt-centos-7 (libvirt) in workspace <https://ci.centos.org/job/libvirt-go-xml-master-check/systems=libvirt-centos-7/ws/> [libvirt-go-xml-master] $ /bin/sh -xe /tmp/jenkins6144478909657639372.sh + export 'TEST_ARGS=-tags xmlroundtrip' + TEST_ARGS='-tags xmlroundtrip' + go test -tags xmlroundtrip --- FAIL: TestRoundTrip (6.60s) xml_test.go:383: testdata/libvirt/tests/genericxml2xmlindata/launch-security-sev.xml: /domain[0]/launch-security[0]: element in expected XML missing in actual XML FAIL exit status 1 FAIL _<https://ci.centos.org/job/libvirt-go-xml-master-check/systems=libvirt-centos-7/ws/> 6.788s Build step 'Execute shell' marked build as failure

See <https://ci.centos.org/job/libvirt-go-xml-master-check/systems=libvirt-centos-7/461/display/redirect> ------------------------------------------ Started by upstream project "libvirt-go-xml-master-check" build number 461 originally caused by: Started by upstream project "libvirt-go-xml-master-build" build number 469 originally caused by: Started by upstream project "libvirt-master-build" build number 1521 originally caused by: Started by an SCM change [EnvInject] - Loading node environment variables. Building remotely on libvirt-centos-7 (libvirt) in workspace <https://ci.centos.org/job/libvirt-go-xml-master-check/systems=libvirt-centos-7/ws/> [libvirt-go-xml-master] $ /bin/sh -xe /tmp/jenkins2353902635677457397.sh + export 'TEST_ARGS=-tags xmlroundtrip' + TEST_ARGS='-tags xmlroundtrip' + go test -tags xmlroundtrip --- FAIL: TestRoundTrip (26.37s) xml_test.go:383: testdata/libvirt/tests/genericxml2xmlindata/launch-security-sev.xml: /domain[0]/launch-security[0]: element in expected XML missing in actual XML FAIL exit status 1 FAIL _<https://ci.centos.org/job/libvirt-go-xml-master-check/systems=libvirt-centos-7/ws/> 26.586s Build step 'Execute shell' marked build as failure

See <https://ci.centos.org/job/libvirt-go-xml-master-check/systems=libvirt-centos-7/462/display/redirect> ------------------------------------------ Started by upstream project "libvirt-go-xml-master-check" build number 462 originally caused by: Started by upstream project "libvirt-go-xml-master-build" build number 470 originally caused by: Started by upstream project "libvirt-master-build" build number 1522 originally caused by: Started by an SCM change [EnvInject] - Loading node environment variables. Building remotely on libvirt-centos-7 (libvirt) in workspace <https://ci.centos.org/job/libvirt-go-xml-master-check/systems=libvirt-centos-7/ws/> [libvirt-go-xml-master] $ /bin/sh -xe /tmp/jenkins1827539757726379583.sh + export 'TEST_ARGS=-tags xmlroundtrip' + TEST_ARGS='-tags xmlroundtrip' + go test -tags xmlroundtrip --- FAIL: TestRoundTrip (24.76s) xml_test.go:383: testdata/libvirt/tests/genericxml2xmlindata/launch-security-sev.xml: /domain[0]/launch-security[0]: element in expected XML missing in actual XML FAIL exit status 1 FAIL _<https://ci.centos.org/job/libvirt-go-xml-master-check/systems=libvirt-centos-7/ws/> 24.963s Build step 'Execute shell' marked build as failure

See <https://ci.centos.org/job/libvirt-go-xml-master-check/systems=libvirt-centos-7/463/display/redirect> ------------------------------------------ Started by upstream project "libvirt-go-xml-master-check" build number 463 originally caused by: Started by upstream project "libvirt-go-xml-master-build" build number 471 originally caused by: Started by upstream project "libvirt-master-build" build number 1523 originally caused by: Started by an SCM change [EnvInject] - Loading node environment variables. Building remotely on libvirt-centos-7 (libvirt) in workspace <https://ci.centos.org/job/libvirt-go-xml-master-check/systems=libvirt-centos-7/ws/> [libvirt-go-xml-master] $ /bin/sh -xe /tmp/jenkins751757498390603944.sh + export 'TEST_ARGS=-tags xmlroundtrip' + TEST_ARGS='-tags xmlroundtrip' + go test -tags xmlroundtrip --- FAIL: TestRoundTrip (20.62s) xml_test.go:383: testdata/libvirt/tests/genericxml2xmlindata/launch-security-sev.xml: /domain[0]/launch-security[0]: element in expected XML missing in actual XML FAIL exit status 1 FAIL _<https://ci.centos.org/job/libvirt-go-xml-master-check/systems=libvirt-centos-7/ws/> 20.690s Build step 'Execute shell' marked build as failure

See <https://ci.centos.org/job/libvirt-go-xml-master-check/systems=libvirt-centos-7/464/display/redirect> ------------------------------------------ Started by upstream project "libvirt-go-xml-master-check" build number 464 originally caused by: Started by upstream project "libvirt-go-xml-master-build" build number 472 originally caused by: Started by upstream project "libvirt-master-build" build number 1524 originally caused by: Started by an SCM change Started by an SCM change Started by an SCM change [EnvInject] - Loading node environment variables. Building remotely on libvirt-centos-7 (libvirt) in workspace <https://ci.centos.org/job/libvirt-go-xml-master-check/systems=libvirt-centos-7/ws/> [libvirt-go-xml-master] $ /bin/sh -xe /tmp/jenkins3664201517363050347.sh + export 'TEST_ARGS=-tags xmlroundtrip' + TEST_ARGS='-tags xmlroundtrip' + go test -tags xmlroundtrip --- FAIL: TestRoundTrip (15.00s) xml_test.go:383: testdata/libvirt/tests/genericxml2xmlindata/launch-security-sev.xml: /domain[0]/launch-security[0]: element in expected XML missing in actual XML FAIL exit status 1 FAIL _<https://ci.centos.org/job/libvirt-go-xml-master-check/systems=libvirt-centos-7/ws/> 15.265s Build step 'Execute shell' marked build as failure

See <https://ci.centos.org/job/libvirt-go-xml-master-check/systems=libvirt-centos-7/465/display/redirect> ------------------------------------------ Started by upstream project "libvirt-go-xml-master-check" build number 465 originally caused by: Started by upstream project "libvirt-go-xml-master-build" build number 473 originally caused by: Started by upstream project "libvirt-master-build" build number 1525 originally caused by: Started by an SCM change [EnvInject] - Loading node environment variables. Building remotely on libvirt-centos-7 (libvirt) in workspace <https://ci.centos.org/job/libvirt-go-xml-master-check/systems=libvirt-centos-7/ws/> [libvirt-go-xml-master] $ /bin/sh -xe /tmp/jenkins1982047489576989091.sh + export 'TEST_ARGS=-tags xmlroundtrip' + TEST_ARGS='-tags xmlroundtrip' + go test -tags xmlroundtrip --- FAIL: TestRoundTrip (23.01s) xml_test.go:383: testdata/libvirt/tests/genericxml2xmlindata/launch-security-sev.xml: /domain[0]/launch-security[0]: element in expected XML missing in actual XML FAIL exit status 1 FAIL _<https://ci.centos.org/job/libvirt-go-xml-master-check/systems=libvirt-centos-7/ws/> 23.194s Build step 'Execute shell' marked build as failure

See <https://ci.centos.org/job/libvirt-go-xml-master-check/systems=libvirt-centos-7/466/display/redirect> ------------------------------------------ Started by upstream project "libvirt-go-xml-master-check" build number 466 originally caused by: Started by upstream project "libvirt-go-xml-master-build" build number 474 originally caused by: Started by upstream project "libvirt-master-build" build number 1526 originally caused by: Started by an SCM change [EnvInject] - Loading node environment variables. Building remotely on libvirt-centos-7 (libvirt) in workspace <https://ci.centos.org/job/libvirt-go-xml-master-check/systems=libvirt-centos-7/ws/> [libvirt-go-xml-master] $ /bin/sh -xe /tmp/jenkins3526558917603417351.sh + export 'TEST_ARGS=-tags xmlroundtrip' + TEST_ARGS='-tags xmlroundtrip' + go test -tags xmlroundtrip --- FAIL: TestRoundTrip (25.51s) xml_test.go:383: testdata/libvirt/tests/genericxml2xmlindata/launch-security-sev.xml: /domain[0]/launchSecurity[0]: element in expected XML missing in actual XML FAIL exit status 1 FAIL _<https://ci.centos.org/job/libvirt-go-xml-master-check/systems=libvirt-centos-7/ws/> 25.705s Build step 'Execute shell' marked build as failure

See <https://ci.centos.org/job/libvirt-go-xml-master-check/systems=libvirt-centos-7/467/display/redirect> ------------------------------------------ Started by upstream project "libvirt-go-xml-master-check" build number 467 originally caused by: Started by upstream project "libvirt-go-xml-master-build" build number 475 originally caused by: Started by upstream project "libvirt-master-build" build number 1527 originally caused by: Started by an SCM change [EnvInject] - Loading node environment variables. Building remotely on libvirt-centos-7 (libvirt) in workspace <https://ci.centos.org/job/libvirt-go-xml-master-check/systems=libvirt-centos-7/ws/> [libvirt-go-xml-master] $ /bin/sh -xe /tmp/jenkins5685917253097242022.sh + export 'TEST_ARGS=-tags xmlroundtrip' + TEST_ARGS='-tags xmlroundtrip' + go test -tags xmlroundtrip --- FAIL: TestRoundTrip (25.28s) xml_test.go:383: testdata/libvirt/tests/genericxml2xmlindata/launch-security-sev.xml: /domain[0]/launchSecurity[0]: element in expected XML missing in actual XML FAIL exit status 1 FAIL _<https://ci.centos.org/job/libvirt-go-xml-master-check/systems=libvirt-centos-7/ws/> 25.432s Build step 'Execute shell' marked build as failure

See <https://ci.centos.org/job/libvirt-go-xml-master-check/systems=libvirt-centos-7/468/display/redirect> ------------------------------------------ Started by upstream project "libvirt-go-xml-master-check" build number 468 originally caused by: Started by upstream project "libvirt-go-xml-master-build" build number 476 originally caused by: Started by upstream project "libvirt-master-build" build number 1528 originally caused by: Started by an SCM change [EnvInject] - Loading node environment variables. Building remotely on libvirt-centos-7 (libvirt) in workspace <https://ci.centos.org/job/libvirt-go-xml-master-check/systems=libvirt-centos-7/ws/> [libvirt-go-xml-master] $ /bin/sh -xe /tmp/jenkins6708890400467170985.sh + export 'TEST_ARGS=-tags xmlroundtrip' + TEST_ARGS='-tags xmlroundtrip' + go test -tags xmlroundtrip --- FAIL: TestRoundTrip (27.81s) xml_test.go:383: testdata/libvirt/tests/genericxml2xmlindata/launch-security-sev.xml: /domain[0]/launchSecurity[0]: element in expected XML missing in actual XML FAIL exit status 1 FAIL _<https://ci.centos.org/job/libvirt-go-xml-master-check/systems=libvirt-centos-7/ws/> 28.021s Build step 'Execute shell' marked build as failure

See <https://ci.centos.org/job/libvirt-go-xml-master-check/systems=libvirt-centos-7/469/display/redirect> ------------------------------------------ Started by upstream project "libvirt-go-xml-master-check" build number 469 originally caused by: Started by upstream project "libvirt-go-xml-master-build" build number 477 originally caused by: Started by upstream project "libvirt-master-build" build number 1529 originally caused by: Started by an SCM change Started by an SCM change Started by an SCM change [EnvInject] - Loading node environment variables. Building remotely on libvirt-centos-7 (libvirt) in workspace <https://ci.centos.org/job/libvirt-go-xml-master-check/systems=libvirt-centos-7/ws/> [libvirt-go-xml-master] $ /bin/sh -xe /tmp/jenkins8841445119382849235.sh + export 'TEST_ARGS=-tags xmlroundtrip' + TEST_ARGS='-tags xmlroundtrip' + go test -tags xmlroundtrip --- FAIL: TestRoundTrip (8.29s) xml_test.go:383: testdata/libvirt/tests/genericxml2xmlindata/launch-security-sev.xml: /domain[0]/launchSecurity[0]: element in expected XML missing in actual XML FAIL exit status 1 FAIL _<https://ci.centos.org/job/libvirt-go-xml-master-check/systems=libvirt-centos-7/ws/> 8.652s Build step 'Execute shell' marked build as failure

See <https://ci.centos.org/job/libvirt-go-xml-master-check/systems=libvirt-centos-7/470/display/redirect> ------------------------------------------ Started by upstream project "libvirt-go-xml-master-check" build number 470 originally caused by: Started by upstream project "libvirt-go-xml-master-build" build number 478 originally caused by: Started by upstream project "libvirt-master-build" build number 1530 originally caused by: Started by an SCM change [EnvInject] - Loading node environment variables. Building remotely on libvirt-centos-7 (libvirt) in workspace <https://ci.centos.org/job/libvirt-go-xml-master-check/systems=libvirt-centos-7/ws/> [libvirt-go-xml-master] $ /bin/sh -xe /tmp/jenkins2674236913322312379.sh + export 'TEST_ARGS=-tags xmlroundtrip' + TEST_ARGS='-tags xmlroundtrip' + go test -tags xmlroundtrip --- FAIL: TestRoundTrip (23.20s) xml_test.go:383: testdata/libvirt/tests/genericxml2xmlindata/launch-security-sev.xml: /domain[0]/launchSecurity[0]: element in expected XML missing in actual XML FAIL exit status 1 FAIL _<https://ci.centos.org/job/libvirt-go-xml-master-check/systems=libvirt-centos-7/ws/> 23.302s Build step 'Execute shell' marked build as failure

See <https://ci.centos.org/job/libvirt-go-xml-master-check/systems=libvirt-centos-7/471/display/redirect> ------------------------------------------ Started by upstream project "libvirt-go-xml-master-check" build number 471 originally caused by: Started by upstream project "libvirt-go-xml-master-build" build number 479 originally caused by: Started by upstream project "libvirt-master-build" build number 1531 originally caused by: Started by an SCM change [EnvInject] - Loading node environment variables. Building remotely on libvirt-centos-7 (libvirt) in workspace <https://ci.centos.org/job/libvirt-go-xml-master-check/systems=libvirt-centos-7/ws/> [libvirt-go-xml-master] $ /bin/sh -xe /tmp/jenkins4168156204817134285.sh + export 'TEST_ARGS=-tags xmlroundtrip' + TEST_ARGS='-tags xmlroundtrip' + go test -tags xmlroundtrip --- FAIL: TestRoundTrip (19.97s) xml_test.go:383: testdata/libvirt/tests/genericxml2xmlindata/launch-security-sev.xml: /domain[0]/launchSecurity[0]: element in expected XML missing in actual XML FAIL exit status 1 FAIL _<https://ci.centos.org/job/libvirt-go-xml-master-check/systems=libvirt-centos-7/ws/> 20.105s Build step 'Execute shell' marked build as failure

See <https://ci.centos.org/job/libvirt-go-xml-master-check/systems=libvirt-centos-7/472/display/redirect> ------------------------------------------ Started by upstream project "libvirt-go-xml-master-check" build number 472 originally caused by: Started by upstream project "libvirt-go-xml-master-build" build number 480 originally caused by: Started by upstream project "libvirt-master-build" build number 1532 originally caused by: Started by an SCM change [EnvInject] - Loading node environment variables. Building remotely on libvirt-centos-7 (libvirt) in workspace <https://ci.centos.org/job/libvirt-go-xml-master-check/systems=libvirt-centos-7/ws/> [libvirt-go-xml-master] $ /bin/sh -xe /tmp/jenkins441775414797636469.sh + export 'TEST_ARGS=-tags xmlroundtrip' + TEST_ARGS='-tags xmlroundtrip' + go test -tags xmlroundtrip --- FAIL: TestRoundTrip (34.30s) xml_test.go:383: testdata/libvirt/tests/genericxml2xmlindata/launch-security-sev.xml: /domain[0]/launchSecurity[0]: element in expected XML missing in actual XML FAIL exit status 1 FAIL _<https://ci.centos.org/job/libvirt-go-xml-master-check/systems=libvirt-centos-7/ws/> 34.493s Build step 'Execute shell' marked build as failure

See <https://ci.centos.org/job/libvirt-go-xml-master-check/systems=libvirt-centos-7/473/display/redirect> ------------------------------------------ Started by upstream project "libvirt-go-xml-master-check" build number 473 originally caused by: Started by upstream project "libvirt-go-xml-master-build" build number 481 originally caused by: Started by upstream project "libvirt-master-build" build number 1533 originally caused by: Started by an SCM change [EnvInject] - Loading node environment variables. Building remotely on libvirt-centos-7 (libvirt) in workspace <https://ci.centos.org/job/libvirt-go-xml-master-check/systems=libvirt-centos-7/ws/> [libvirt-go-xml-master] $ /bin/sh -xe /tmp/jenkins88690741812507384.sh + export 'TEST_ARGS=-tags xmlroundtrip' + TEST_ARGS='-tags xmlroundtrip' + go test -tags xmlroundtrip --- FAIL: TestRoundTrip (34.57s) xml_test.go:383: testdata/libvirt/tests/genericxml2xmlindata/launch-security-sev.xml: /domain[0]/launchSecurity[0]: element in expected XML missing in actual XML FAIL exit status 1 FAIL _<https://ci.centos.org/job/libvirt-go-xml-master-check/systems=libvirt-centos-7/ws/> 34.872s Build step 'Execute shell' marked build as failure

See <https://ci.centos.org/job/libvirt-go-xml-master-check/systems=libvirt-centos-7/474/display/redirect> ------------------------------------------ Started by upstream project "libvirt-go-xml-master-check" build number 474 originally caused by: Started by upstream project "libvirt-go-xml-master-build" build number 482 originally caused by: Started by upstream project "libvirt-master-build" build number 1534 originally caused by: Started by an SCM change [EnvInject] - Loading node environment variables. Building remotely on libvirt-centos-7 (libvirt) in workspace <https://ci.centos.org/job/libvirt-go-xml-master-check/systems=libvirt-centos-7/ws/> [libvirt-go-xml-master] $ /bin/sh -xe /tmp/jenkins1316432642811160518.sh + export 'TEST_ARGS=-tags xmlroundtrip' + TEST_ARGS='-tags xmlroundtrip' + go test -tags xmlroundtrip --- FAIL: TestRoundTrip (20.31s) xml_test.go:383: testdata/libvirt/tests/domaincapsschemadata/basic.xml: /domainCapabilities[0]/features[0]/sev[0]: element in expected XML missing in actual XML FAIL exit status 1 FAIL _<https://ci.centos.org/job/libvirt-go-xml-master-check/systems=libvirt-centos-7/ws/> 20.604s Build step 'Execute shell' marked build as failure

See <https://ci.centos.org/job/libvirt-go-xml-master-check/systems=libvirt-centos-7/475/display/redirect> ------------------------------------------ Started by upstream project "libvirt-go-xml-master-check" build number 475 originally caused by: Started by upstream project "libvirt-go-xml-master-build" build number 483 originally caused by: Started by upstream project "libvirt-master-build" build number 1535 originally caused by: Started by an SCM change [EnvInject] - Loading node environment variables. Building remotely on libvirt-centos-7 (libvirt) in workspace <https://ci.centos.org/job/libvirt-go-xml-master-check/systems=libvirt-centos-7/ws/> [libvirt-go-xml-master] $ /bin/sh -xe /tmp/jenkins4195679574297211079.sh + export 'TEST_ARGS=-tags xmlroundtrip' + TEST_ARGS='-tags xmlroundtrip' + go test -tags xmlroundtrip --- FAIL: TestRoundTrip (28.25s) xml_test.go:383: testdata/libvirt/tests/domaincapsschemadata/basic.xml: /domainCapabilities[0]/features[0]/sev[0]: element in expected XML missing in actual XML FAIL exit status 1 FAIL _<https://ci.centos.org/job/libvirt-go-xml-master-check/systems=libvirt-centos-7/ws/> 28.461s Build step 'Execute shell' marked build as failure

See <https://ci.centos.org/job/libvirt-go-xml-master-check/systems=libvirt-centos-7/476/display/redirect> ------------------------------------------ Started by upstream project "libvirt-go-xml-master-check" build number 476 originally caused by: Started by upstream project "libvirt-go-xml-master-build" build number 485 originally caused by: Started by upstream project "libvirt-master-build" build number 1537 originally caused by: Started by user Libvirt [EnvInject] - Loading node environment variables. Building remotely on libvirt-centos-7 (libvirt) in workspace <https://ci.centos.org/job/libvirt-go-xml-master-check/systems=libvirt-centos-7/ws/> [libvirt-go-xml-master] $ /bin/sh -xe /tmp/jenkins4568309764581542088.sh + export 'TEST_ARGS=-tags xmlroundtrip' + TEST_ARGS='-tags xmlroundtrip' + go test -tags xmlroundtrip --- FAIL: TestRoundTrip (45.43s) xml_test.go:383: testdata/libvirt/tests/qemuxml2argvdata/name-escape.xml: /domain[0]/devices[0]/smartcard[0]/database[0]: element in expected XML missing in actual XML FAIL exit status 1 FAIL _<https://ci.centos.org/job/libvirt-go-xml-master-check/systems=libvirt-centos-7/ws/> 45.656s Build step 'Execute shell' marked build as failure

See <https://ci.centos.org/job/libvirt-go-xml-master-check/systems=libvirt-centos-7/477/display/redirect> ------------------------------------------ Started by upstream project "libvirt-go-xml-master-check" build number 477 originally caused by: Started by upstream project "libvirt-go-xml-master-build" build number 486 originally caused by: Started by upstream project "libvirt-master-build" build number 1538 originally caused by: Started by an SCM change Started by an SCM change [EnvInject] - Loading node environment variables. Building remotely on libvirt-centos-7 (libvirt) in workspace <https://ci.centos.org/job/libvirt-go-xml-master-check/systems=libvirt-centos-7/ws/> [libvirt-go-xml-master] $ /bin/sh -xe /tmp/jenkins8568901078308110492.sh + export 'TEST_ARGS=-tags xmlroundtrip' + TEST_ARGS='-tags xmlroundtrip' + go test -tags xmlroundtrip --- FAIL: TestRoundTrip (30.28s) xml_test.go:383: testdata/libvirt/tests/qemuxml2argvdata/name-escape.xml: /domain[0]/devices[0]/smartcard[0]/database[0]: element in expected XML missing in actual XML FAIL exit status 1 FAIL _<https://ci.centos.org/job/libvirt-go-xml-master-check/systems=libvirt-centos-7/ws/> 30.465s Build step 'Execute shell' marked build as failure

participants (1)
-
ci@centos.org