[Libvirt-ci] Build failed in Jenkins: libvirt-go-check » libvirt-debian-10 #905

See <https://ci.centos.org/job/libvirt-go-check/systems=libvirt-debian-10/905/display/redirect> ------------------------------------------ Started by upstream project "libvirt-go-check" build number 905 originally caused by: Started by upstream project "libvirt-go-build" build number 919 originally caused by: Started by upstream project "libvirt-build" build number 1088 originally caused by: Started by an SCM change Running as SYSTEM [EnvInject] - Loading node environment variables. Building remotely on libvirt-debian-10 (libvirt) in workspace <https://ci.centos.org/job/libvirt-go-check/systems=libvirt-debian-10/ws/> [libvirt-go] $ /bin/sh -xe /tmp/jenkins3229834481590385990.sh + export TEST_ARGS=-tags api + go test -tags api Missing enum 'VIR_DOMAIN_STATS_MEMORY' --- FAIL: TestAPICoverage (0.43s) panic: Missing symbols found [recovered] panic: Missing symbols found goroutine 18 [running]: testing.tRunner.func1(0xc0000b4100) /usr/lib/go-1.11/src/testing/testing.go:792 +0x387 panic(0x5cfc00, 0x63cfe0) /usr/lib/go-1.11/src/runtime/panic.go:513 +0x1b9 _<https://ci.centos.org/job/libvirt-go-check/systems=libvirt-debian-10/ws/.TestAPICoverage(0xc0000b4100)> <https://ci.centos.org/job/libvirt-go-check/systems=libvirt-debian-10/ws/api_test.go>:503 +0x554 testing.tRunner(0xc0000b4100, 0x61e430) /usr/lib/go-1.11/src/testing/testing.go:827 +0xbf created by testing.(*T).Run /usr/lib/go-1.11/src/testing/testing.go:878 +0x35c exit status 2 FAIL _<https://ci.centos.org/job/libvirt-go-check/systems=libvirt-debian-10/ws/> 0.578s Build step 'Execute shell' marked build as failure

See <https://ci.centos.org/job/libvirt-go-check/systems=libvirt-debian-10/906/display/redirect> ------------------------------------------ Started by upstream project "libvirt-go-check" build number 906 originally caused by: Started by upstream project "libvirt-go-build" build number 920 originally caused by: Started by upstream project "libvirt-build" build number 1093 originally caused by: Started by an SCM change Running as SYSTEM [EnvInject] - Loading node environment variables. Building remotely on libvirt-debian-10 (libvirt) in workspace <https://ci.centos.org/job/libvirt-go-check/systems=libvirt-debian-10/ws/> [libvirt-go] $ /bin/sh -xe /tmp/jenkins9222005123272156164.sh + export TEST_ARGS=-tags api + go test -tags api Missing enum 'VIR_DOMAIN_STATS_MEMORY' --- FAIL: TestAPICoverage (0.97s) panic: Missing symbols found [recovered] panic: Missing symbols found goroutine 5 [running]: testing.tRunner.func1(0xc0000a8100) /usr/lib/go-1.11/src/testing/testing.go:792 +0x387 panic(0x5cfc00, 0x63cfe0) /usr/lib/go-1.11/src/runtime/panic.go:513 +0x1b9 _<https://ci.centos.org/job/libvirt-go-check/systems=libvirt-debian-10/ws/.TestAPICoverage(0xc0000a8100)> <https://ci.centos.org/job/libvirt-go-check/systems=libvirt-debian-10/ws/api_test.go>:503 +0x554 testing.tRunner(0xc0000a8100, 0x61e430) /usr/lib/go-1.11/src/testing/testing.go:827 +0xbf created by testing.(*T).Run /usr/lib/go-1.11/src/testing/testing.go:878 +0x35c exit status 2 FAIL _<https://ci.centos.org/job/libvirt-go-check/systems=libvirt-debian-10/ws/> 1.095s Build step 'Execute shell' marked build as failure

See <https://ci.centos.org/job/libvirt-go-check/systems=libvirt-debian-10/907/display/redirect> ------------------------------------------ Started by upstream project "libvirt-go-check" build number 907 originally caused by: Started by upstream project "libvirt-go-build" build number 921 originally caused by: Started by upstream project "libvirt-build" build number 1094 originally caused by: Started by an SCM change Running as SYSTEM [EnvInject] - Loading node environment variables. Building remotely on libvirt-debian-10 (libvirt) in workspace <https://ci.centos.org/job/libvirt-go-check/systems=libvirt-debian-10/ws/> [libvirt-go] $ /bin/sh -xe /tmp/jenkins2040267631976276779.sh + export TEST_ARGS=-tags api + go test -tags api Missing enum 'VIR_DOMAIN_STATS_MEMORY' --- FAIL: TestAPICoverage (0.55s) panic: Missing symbols found [recovered] panic: Missing symbols found goroutine 5 [running]: testing.tRunner.func1(0xc0000a8100) /usr/lib/go-1.11/src/testing/testing.go:792 +0x387 panic(0x5cfc00, 0x63cfe0) /usr/lib/go-1.11/src/runtime/panic.go:513 +0x1b9 _<https://ci.centos.org/job/libvirt-go-check/systems=libvirt-debian-10/ws/.TestAPICoverage(0xc0000a8100)> <https://ci.centos.org/job/libvirt-go-check/systems=libvirt-debian-10/ws/api_test.go>:503 +0x554 testing.tRunner(0xc0000a8100, 0x61e430) /usr/lib/go-1.11/src/testing/testing.go:827 +0xbf created by testing.(*T).Run /usr/lib/go-1.11/src/testing/testing.go:878 +0x35c exit status 2 FAIL _<https://ci.centos.org/job/libvirt-go-check/systems=libvirt-debian-10/ws/> 0.625s Build step 'Execute shell' marked build as failure

See <https://ci.centos.org/job/libvirt-go-check/systems=libvirt-debian-10/908/display/redirect> ------------------------------------------ Started by upstream project "libvirt-go-check" build number 908 originally caused by: Started by upstream project "libvirt-go-build" build number 922 originally caused by: Started by upstream project "libvirt-build" build number 1095 originally caused by: Started by an SCM change Running as SYSTEM [EnvInject] - Loading node environment variables. Building remotely on libvirt-debian-10 (libvirt) in workspace <https://ci.centos.org/job/libvirt-go-check/systems=libvirt-debian-10/ws/> [libvirt-go] $ /bin/sh -xe /tmp/jenkins12763504782324938889.sh + export TEST_ARGS=-tags api + go test -tags api Missing enum 'VIR_DOMAIN_STATS_MEMORY' --- FAIL: TestAPICoverage (0.84s) panic: Missing symbols found [recovered] panic: Missing symbols found goroutine 19 [running]: testing.tRunner.func1(0xc0000c2100) /usr/lib/go-1.11/src/testing/testing.go:792 +0x387 panic(0x5cfc00, 0x63cfe0) /usr/lib/go-1.11/src/runtime/panic.go:513 +0x1b9 _<https://ci.centos.org/job/libvirt-go-check/systems=libvirt-debian-10/ws/.TestAPICoverage(0xc0000c2100)> <https://ci.centos.org/job/libvirt-go-check/systems=libvirt-debian-10/ws/api_test.go>:503 +0x554 testing.tRunner(0xc0000c2100, 0x61e430) /usr/lib/go-1.11/src/testing/testing.go:827 +0xbf created by testing.(*T).Run /usr/lib/go-1.11/src/testing/testing.go:878 +0x35c exit status 2 FAIL _<https://ci.centos.org/job/libvirt-go-check/systems=libvirt-debian-10/ws/> 0.966s Build step 'Execute shell' marked build as failure

See <https://ci.centos.org/job/libvirt-go-check/systems=libvirt-debian-10/909/display/redirect> ------------------------------------------ Started by upstream project "libvirt-go-check" build number 909 originally caused by: Started by upstream project "libvirt-go-build" build number 923 originally caused by: Started by upstream project "libvirt-build" build number 1096 originally caused by: Started by an SCM change Running as SYSTEM [EnvInject] - Loading node environment variables. Building remotely on libvirt-debian-10 (libvirt) in workspace <https://ci.centos.org/job/libvirt-go-check/systems=libvirt-debian-10/ws/> [libvirt-go] $ /bin/sh -xe /tmp/jenkins15242220759391059129.sh + export TEST_ARGS=-tags api + go test -tags api Missing enum 'VIR_DOMAIN_STATS_MEMORY' --- FAIL: TestAPICoverage (0.66s) panic: Missing symbols found [recovered] panic: Missing symbols found goroutine 19 [running]: testing.tRunner.func1(0xc0000c2100) /usr/lib/go-1.11/src/testing/testing.go:792 +0x387 panic(0x5cfc00, 0x63cfe0) /usr/lib/go-1.11/src/runtime/panic.go:513 +0x1b9 _<https://ci.centos.org/job/libvirt-go-check/systems=libvirt-debian-10/ws/.TestAPICoverage(0xc0000c2100)> <https://ci.centos.org/job/libvirt-go-check/systems=libvirt-debian-10/ws/api_test.go>:503 +0x554 testing.tRunner(0xc0000c2100, 0x61e430) /usr/lib/go-1.11/src/testing/testing.go:827 +0xbf created by testing.(*T).Run /usr/lib/go-1.11/src/testing/testing.go:878 +0x35c exit status 2 FAIL _<https://ci.centos.org/job/libvirt-go-check/systems=libvirt-debian-10/ws/> 1.031s Build step 'Execute shell' marked build as failure

See <https://ci.centos.org/job/libvirt-go-check/systems=libvirt-debian-10/910/display/redirect> ------------------------------------------ Started by upstream project "libvirt-go-check" build number 910 originally caused by: Started by upstream project "libvirt-go-build" build number 924 originally caused by: Started by upstream project "libvirt-build" build number 1097 originally caused by: Started by an SCM change Started by an SCM change Started by an SCM change Running as SYSTEM [EnvInject] - Loading node environment variables. Building remotely on libvirt-debian-10 (libvirt) in workspace <https://ci.centos.org/job/libvirt-go-check/systems=libvirt-debian-10/ws/> [libvirt-go] $ /bin/sh -xe /tmp/jenkins11223638596169434174.sh + export TEST_ARGS=-tags api + go test -tags api Missing enum 'VIR_DOMAIN_STATS_MEMORY' --- FAIL: TestAPICoverage (0.68s) panic: Missing symbols found [recovered] panic: Missing symbols found goroutine 19 [running]: testing.tRunner.func1(0xc0000c2100) /usr/lib/go-1.11/src/testing/testing.go:792 +0x387 panic(0x5cfc00, 0x63cfe0) /usr/lib/go-1.11/src/runtime/panic.go:513 +0x1b9 _<https://ci.centos.org/job/libvirt-go-check/systems=libvirt-debian-10/ws/.TestAPICoverage(0xc0000c2100)> <https://ci.centos.org/job/libvirt-go-check/systems=libvirt-debian-10/ws/api_test.go>:503 +0x554 testing.tRunner(0xc0000c2100, 0x61e430) /usr/lib/go-1.11/src/testing/testing.go:827 +0xbf created by testing.(*T).Run /usr/lib/go-1.11/src/testing/testing.go:878 +0x35c exit status 2 FAIL _<https://ci.centos.org/job/libvirt-go-check/systems=libvirt-debian-10/ws/> 0.902s Build step 'Execute shell' marked build as failure

See <https://ci.centos.org/job/libvirt-go-check/systems=libvirt-debian-10/911/display/redirect> ------------------------------------------ Started by upstream project "libvirt-go-check" build number 911 originally caused by: Started by upstream project "libvirt-go-build" build number 925 originally caused by: Started by upstream project "libvirt-build" build number 1098 originally caused by: Started by an SCM change Started by an SCM change Started by an SCM change Running as SYSTEM [EnvInject] - Loading node environment variables. Building remotely on libvirt-debian-10 (libvirt) in workspace <https://ci.centos.org/job/libvirt-go-check/systems=libvirt-debian-10/ws/> [libvirt-go] $ /bin/sh -xe /tmp/jenkins921977171028883159.sh + export TEST_ARGS=-tags api + go test -tags api Missing enum 'VIR_DOMAIN_STATS_MEMORY' --- FAIL: TestAPICoverage (0.53s) panic: Missing symbols found [recovered] panic: Missing symbols found goroutine 19 [running]: testing.tRunner.func1(0xc0000c2100) /usr/lib/go-1.11/src/testing/testing.go:792 +0x387 panic(0x5cfc00, 0x63cfe0) /usr/lib/go-1.11/src/runtime/panic.go:513 +0x1b9 _<https://ci.centos.org/job/libvirt-go-check/systems=libvirt-debian-10/ws/.TestAPICoverage(0xc0000c2100)> <https://ci.centos.org/job/libvirt-go-check/systems=libvirt-debian-10/ws/api_test.go>:503 +0x554 testing.tRunner(0xc0000c2100, 0x61e430) /usr/lib/go-1.11/src/testing/testing.go:827 +0xbf created by testing.(*T).Run /usr/lib/go-1.11/src/testing/testing.go:878 +0x35c exit status 2 FAIL _<https://ci.centos.org/job/libvirt-go-check/systems=libvirt-debian-10/ws/> 0.707s Build step 'Execute shell' marked build as failure

See <https://ci.centos.org/job/libvirt-go-check/systems=libvirt-debian-10/912/display/redirect> ------------------------------------------ Started by upstream project "libvirt-go-check" build number 912 originally caused by: Started by upstream project "libvirt-go-build" build number 926 originally caused by: Started by upstream project "libvirt-build" build number 1099 originally caused by: Started by user Libvirt Running as SYSTEM [EnvInject] - Loading node environment variables. Building remotely on libvirt-debian-10 (libvirt) in workspace <https://ci.centos.org/job/libvirt-go-check/systems=libvirt-debian-10/ws/> [libvirt-go] $ /bin/sh -xe /tmp/jenkins95762476377983066.sh + export TEST_ARGS=-tags api + go test -tags api Missing enum 'VIR_DOMAIN_STATS_MEMORY' --- FAIL: TestAPICoverage (0.42s) panic: Missing symbols found [recovered] panic: Missing symbols found goroutine 5 [running]: testing.tRunner.func1(0xc0000a8100) /usr/lib/go-1.11/src/testing/testing.go:792 +0x387 panic(0x5cfc00, 0x63cfe0) /usr/lib/go-1.11/src/runtime/panic.go:513 +0x1b9 _<https://ci.centos.org/job/libvirt-go-check/systems=libvirt-debian-10/ws/.TestAPICoverage(0xc0000a8100)> <https://ci.centos.org/job/libvirt-go-check/systems=libvirt-debian-10/ws/api_test.go>:503 +0x554 testing.tRunner(0xc0000a8100, 0x61e430) /usr/lib/go-1.11/src/testing/testing.go:827 +0xbf created by testing.(*T).Run /usr/lib/go-1.11/src/testing/testing.go:878 +0x35c exit status 2 FAIL _<https://ci.centos.org/job/libvirt-go-check/systems=libvirt-debian-10/ws/> 0.620s Build step 'Execute shell' marked build as failure

participants (1)
-
ci@centos.org