[Libvirt-ci] Build failed in Jenkins: virt-manager-check » libvirt-debian-9 #309

See <https://ci.centos.org/job/virt-manager-check/systems=libvirt-debian-9/309/display/redirect> ------------------------------------------ Started by upstream project "virt-manager-check" build number 309 originally caused by: Started by upstream project "virt-manager-build" build number 310 originally caused by: Started by an SCM change Started by an SCM change Started by an SCM change Started by an SCM change Started by an SCM change Started by an SCM change [EnvInject] - Loading node environment variables. Building remotely on libvirt-debian-9 (libvirt) in workspace <https://ci.centos.org/job/virt-manager-check/systems=libvirt-debian-9/ws/> [virt-manager] $ /bin/sh -xe /tmp/jenkins6018464034717476818.sh + /usr/bin/python3 ./setup.py test running test Traceback (most recent call last): File "./setup.py", line 712, in <module> distclass=VMMDistribution, File "/usr/lib/python3.5/distutils/core.py", line 148, in setup dist.run_commands() File "/usr/lib/python3.5/distutils/dist.py", line 955, in run_commands self.run_command(cmd) File "/usr/lib/python3.5/distutils/dist.py", line 974, in run_command cmd_obj.run() File "./setup.py", line 514, in run TestBaseCommand.run(self) File "./setup.py", line 430, in run import tests as testsmodule File "<https://ci.centos.org/job/virt-manager-check/systems=libvirt-debian-9/ws/tests/__init__.py",> line 19, in <module> from tests import utils File "<https://ci.centos.org/job/virt-manager-check/systems=libvirt-debian-9/ws/tests/utils.py",> line 13, in <module> import virtinst File "<https://ci.centos.org/job/virt-manager-check/systems=libvirt-debian-9/ws/virtinst/__init__.py",> line 27, in <module> from virtinst.uri import URI File "<https://ci.centos.org/job/virt-manager-check/systems=libvirt-debian-9/ws/virtinst/uri.py",> line 12, in <module> from .cli import parse_optstr_tuples File "<https://ci.centos.org/job/virt-manager-check/systems=libvirt-debian-9/ws/virtinst/cli.py",> line 1408, in <module> class ParseCLICheck(VirtCLIParser): File "<https://ci.centos.org/job/virt-manager-check/systems=libvirt-debian-9/ws/virtinst/cli.py",> line 1138, in __new__ self.__init_class__(**kwargs) File "<https://ci.centos.org/job/virt-manager-check/systems=libvirt-debian-9/ws/virtinst/cli.py",> line 1413, in __init_class__ super().__init_class__(**kwargs) RuntimeError: super(): empty __class__ cell Build step 'Execute shell' marked build as failure

See <https://ci.centos.org/job/virt-manager-check/systems=libvirt-debian-9/310/display/redirect> ------------------------------------------ Started by upstream project "virt-manager-check" build number 310 originally caused by: Started by upstream project "virt-manager-build" build number 311 originally caused by: Started by an SCM change [EnvInject] - Loading node environment variables. Building remotely on libvirt-debian-9 (libvirt) in workspace <https://ci.centos.org/job/virt-manager-check/systems=libvirt-debian-9/ws/> [virt-manager] $ /bin/sh -xe /tmp/jenkins2190020666653668914.sh + /usr/bin/python3 ./setup.py test running test Traceback (most recent call last): File "./setup.py", line 712, in <module> distclass=VMMDistribution, File "/usr/lib/python3.5/distutils/core.py", line 148, in setup dist.run_commands() File "/usr/lib/python3.5/distutils/dist.py", line 955, in run_commands self.run_command(cmd) File "/usr/lib/python3.5/distutils/dist.py", line 974, in run_command cmd_obj.run() File "./setup.py", line 514, in run TestBaseCommand.run(self) File "./setup.py", line 430, in run import tests as testsmodule File "<https://ci.centos.org/job/virt-manager-check/systems=libvirt-debian-9/ws/tests/__init__.py",> line 19, in <module> from tests import utils File "<https://ci.centos.org/job/virt-manager-check/systems=libvirt-debian-9/ws/tests/utils.py",> line 13, in <module> import virtinst File "<https://ci.centos.org/job/virt-manager-check/systems=libvirt-debian-9/ws/virtinst/__init__.py",> line 27, in <module> from virtinst.uri import URI File "<https://ci.centos.org/job/virt-manager-check/systems=libvirt-debian-9/ws/virtinst/uri.py",> line 12, in <module> from .cli import parse_optstr_tuples File "<https://ci.centos.org/job/virt-manager-check/systems=libvirt-debian-9/ws/virtinst/cli.py",> line 1408, in <module> class ParseCLICheck(VirtCLIParser): File "<https://ci.centos.org/job/virt-manager-check/systems=libvirt-debian-9/ws/virtinst/cli.py",> line 1138, in __new__ self.__init_class__(**kwargs) File "<https://ci.centos.org/job/virt-manager-check/systems=libvirt-debian-9/ws/virtinst/cli.py",> line 1413, in __init_class__ super().__init_class__(**kwargs) RuntimeError: super(): empty __class__ cell Build step 'Execute shell' marked build as failure

See <https://ci.centos.org/job/virt-manager-check/systems=libvirt-debian-9/311/display/redirect> ------------------------------------------ Started by upstream project "virt-manager-check" build number 311 originally caused by: Started by upstream project "virt-manager-build" build number 312 originally caused by: Started by upstream project "libvirt-python-build" build number 178 originally caused by: Started by upstream project "libvirt-build" build number 209 originally caused by: Started by an SCM change [EnvInject] - Loading node environment variables. Building remotely on libvirt-debian-9 (libvirt) in workspace <https://ci.centos.org/job/virt-manager-check/systems=libvirt-debian-9/ws/> [virt-manager] $ /bin/sh -xe /tmp/jenkins4417392588968439581.sh + /usr/bin/python3 ./setup.py test running test Traceback (most recent call last): File "./setup.py", line 712, in <module> distclass=VMMDistribution, File "/usr/lib/python3.5/distutils/core.py", line 148, in setup dist.run_commands() File "/usr/lib/python3.5/distutils/dist.py", line 955, in run_commands self.run_command(cmd) File "/usr/lib/python3.5/distutils/dist.py", line 974, in run_command cmd_obj.run() File "./setup.py", line 514, in run TestBaseCommand.run(self) File "./setup.py", line 430, in run import tests as testsmodule File "<https://ci.centos.org/job/virt-manager-check/systems=libvirt-debian-9/ws/tests/__init__.py",> line 19, in <module> from tests import utils File "<https://ci.centos.org/job/virt-manager-check/systems=libvirt-debian-9/ws/tests/utils.py",> line 13, in <module> import virtinst File "<https://ci.centos.org/job/virt-manager-check/systems=libvirt-debian-9/ws/virtinst/__init__.py",> line 27, in <module> from virtinst.uri import URI File "<https://ci.centos.org/job/virt-manager-check/systems=libvirt-debian-9/ws/virtinst/uri.py",> line 12, in <module> from .cli import parse_optstr_tuples File "<https://ci.centos.org/job/virt-manager-check/systems=libvirt-debian-9/ws/virtinst/cli.py",> line 1408, in <module> class ParseCLICheck(VirtCLIParser): File "<https://ci.centos.org/job/virt-manager-check/systems=libvirt-debian-9/ws/virtinst/cli.py",> line 1138, in __new__ self.__init_class__(**kwargs) File "<https://ci.centos.org/job/virt-manager-check/systems=libvirt-debian-9/ws/virtinst/cli.py",> line 1413, in __init_class__ super().__init_class__(**kwargs) RuntimeError: super(): empty __class__ cell Build step 'Execute shell' marked build as failure

See <https://ci.centos.org/job/virt-manager-check/systems=libvirt-debian-9/312/display/redirect> ------------------------------------------ Started by upstream project "virt-manager-check" build number 312 originally caused by: Started by upstream project "virt-manager-build" build number 313 originally caused by: Started by upstream project "libvirt-python-build" build number 179 originally caused by: Started by upstream project "libvirt-build" build number 210 originally caused by: Started by an SCM change [EnvInject] - Loading node environment variables. Building remotely on libvirt-debian-9 (libvirt) in workspace <https://ci.centos.org/job/virt-manager-check/systems=libvirt-debian-9/ws/> [virt-manager] $ /bin/sh -xe /tmp/jenkins8912092631743445579.sh + /usr/bin/python3 ./setup.py test running test Traceback (most recent call last): File "./setup.py", line 712, in <module> distclass=VMMDistribution, File "/usr/lib/python3.5/distutils/core.py", line 148, in setup dist.run_commands() File "/usr/lib/python3.5/distutils/dist.py", line 955, in run_commands self.run_command(cmd) File "/usr/lib/python3.5/distutils/dist.py", line 974, in run_command cmd_obj.run() File "./setup.py", line 514, in run TestBaseCommand.run(self) File "./setup.py", line 430, in run import tests as testsmodule File "<https://ci.centos.org/job/virt-manager-check/systems=libvirt-debian-9/ws/tests/__init__.py",> line 19, in <module> from tests import utils File "<https://ci.centos.org/job/virt-manager-check/systems=libvirt-debian-9/ws/tests/utils.py",> line 13, in <module> import virtinst File "<https://ci.centos.org/job/virt-manager-check/systems=libvirt-debian-9/ws/virtinst/__init__.py",> line 27, in <module> from virtinst.uri import URI File "<https://ci.centos.org/job/virt-manager-check/systems=libvirt-debian-9/ws/virtinst/uri.py",> line 12, in <module> from .cli import parse_optstr_tuples File "<https://ci.centos.org/job/virt-manager-check/systems=libvirt-debian-9/ws/virtinst/cli.py",> line 1408, in <module> class ParseCLICheck(VirtCLIParser): File "<https://ci.centos.org/job/virt-manager-check/systems=libvirt-debian-9/ws/virtinst/cli.py",> line 1138, in __new__ self.__init_class__(**kwargs) File "<https://ci.centos.org/job/virt-manager-check/systems=libvirt-debian-9/ws/virtinst/cli.py",> line 1413, in __init_class__ super().__init_class__(**kwargs) RuntimeError: super(): empty __class__ cell Build step 'Execute shell' marked build as failure

See <https://ci.centos.org/job/virt-manager-check/systems=libvirt-debian-9/313/display/redirect> ------------------------------------------ Started by upstream project "virt-manager-check" build number 313 originally caused by: Started by upstream project "virt-manager-build" build number 314 originally caused by: Started by upstream project "libvirt-python-build" build number 180 originally caused by: Started by upstream project "libvirt-build" build number 211 originally caused by: Started by an SCM change [EnvInject] - Loading node environment variables. Building remotely on libvirt-debian-9 (libvirt) in workspace <https://ci.centos.org/job/virt-manager-check/systems=libvirt-debian-9/ws/> [virt-manager] $ /bin/sh -xe /tmp/jenkins6867239313630494831.sh + /usr/bin/python3 ./setup.py test running test Traceback (most recent call last): File "./setup.py", line 712, in <module> distclass=VMMDistribution, File "/usr/lib/python3.5/distutils/core.py", line 148, in setup dist.run_commands() File "/usr/lib/python3.5/distutils/dist.py", line 955, in run_commands self.run_command(cmd) File "/usr/lib/python3.5/distutils/dist.py", line 974, in run_command cmd_obj.run() File "./setup.py", line 514, in run TestBaseCommand.run(self) File "./setup.py", line 430, in run import tests as testsmodule File "<https://ci.centos.org/job/virt-manager-check/systems=libvirt-debian-9/ws/tests/__init__.py",> line 19, in <module> from tests import utils File "<https://ci.centos.org/job/virt-manager-check/systems=libvirt-debian-9/ws/tests/utils.py",> line 13, in <module> import virtinst File "<https://ci.centos.org/job/virt-manager-check/systems=libvirt-debian-9/ws/virtinst/__init__.py",> line 27, in <module> from virtinst.uri import URI File "<https://ci.centos.org/job/virt-manager-check/systems=libvirt-debian-9/ws/virtinst/uri.py",> line 12, in <module> from .cli import parse_optstr_tuples File "<https://ci.centos.org/job/virt-manager-check/systems=libvirt-debian-9/ws/virtinst/cli.py",> line 1408, in <module> class ParseCLICheck(VirtCLIParser): File "<https://ci.centos.org/job/virt-manager-check/systems=libvirt-debian-9/ws/virtinst/cli.py",> line 1138, in __new__ self.__init_class__(**kwargs) File "<https://ci.centos.org/job/virt-manager-check/systems=libvirt-debian-9/ws/virtinst/cli.py",> line 1413, in __init_class__ super().__init_class__(**kwargs) RuntimeError: super(): empty __class__ cell Build step 'Execute shell' marked build as failure

See <https://ci.centos.org/job/virt-manager-check/systems=libvirt-debian-9/314/display/redirect> ------------------------------------------ Started by upstream project "virt-manager-check" build number 314 originally caused by: Started by upstream project "virt-manager-build" build number 315 originally caused by: Started by an SCM change [EnvInject] - Loading node environment variables. Building remotely on libvirt-debian-9 (libvirt) in workspace <https://ci.centos.org/job/virt-manager-check/systems=libvirt-debian-9/ws/> [virt-manager] $ /bin/sh -xe /tmp/jenkins2768920738570795549.sh + /usr/bin/python3 ./setup.py test running test Traceback (most recent call last): File "./setup.py", line 712, in <module> distclass=VMMDistribution, File "/usr/lib/python3.5/distutils/core.py", line 148, in setup dist.run_commands() File "/usr/lib/python3.5/distutils/dist.py", line 955, in run_commands self.run_command(cmd) File "/usr/lib/python3.5/distutils/dist.py", line 974, in run_command cmd_obj.run() File "./setup.py", line 514, in run TestBaseCommand.run(self) File "./setup.py", line 430, in run import tests as testsmodule File "<https://ci.centos.org/job/virt-manager-check/systems=libvirt-debian-9/ws/tests/__init__.py",> line 19, in <module> from tests import utils File "<https://ci.centos.org/job/virt-manager-check/systems=libvirt-debian-9/ws/tests/utils.py",> line 13, in <module> import virtinst File "<https://ci.centos.org/job/virt-manager-check/systems=libvirt-debian-9/ws/virtinst/__init__.py",> line 27, in <module> from virtinst.uri import URI File "<https://ci.centos.org/job/virt-manager-check/systems=libvirt-debian-9/ws/virtinst/uri.py",> line 12, in <module> from .cli import parse_optstr_tuples File "<https://ci.centos.org/job/virt-manager-check/systems=libvirt-debian-9/ws/virtinst/cli.py",> line 1424, in <module> class ParseCLICheck(VirtCLIParser): File "<https://ci.centos.org/job/virt-manager-check/systems=libvirt-debian-9/ws/virtinst/cli.py",> line 1153, in __new__ self.__init_class__(**kwargs) File "<https://ci.centos.org/job/virt-manager-check/systems=libvirt-debian-9/ws/virtinst/cli.py",> line 1429, in __init_class__ super().__init_class__(**kwargs) RuntimeError: super(): empty __class__ cell Build step 'Execute shell' marked build as failure

See <https://ci.centos.org/job/virt-manager-check/systems=libvirt-debian-9/315/display/redirect> ------------------------------------------ Started by upstream project "virt-manager-check" build number 315 originally caused by: Started by upstream project "virt-manager-build" build number 316 originally caused by: Started by upstream project "libvirt-python-build" build number 181 originally caused by: Started by upstream project "libvirt-build" build number 212 originally caused by: Started by an SCM change Started by an SCM change Started by an SCM change Started by an SCM change Started by an SCM change Started by an SCM change Started by an SCM change [EnvInject] - Loading node environment variables. Building remotely on libvirt-debian-9 (libvirt) in workspace <https://ci.centos.org/job/virt-manager-check/systems=libvirt-debian-9/ws/> [virt-manager] $ /bin/sh -xe /tmp/jenkins4054155488116621823.sh + /usr/bin/python3 ./setup.py test running test Traceback (most recent call last): File "./setup.py", line 712, in <module> distclass=VMMDistribution, File "/usr/lib/python3.5/distutils/core.py", line 148, in setup dist.run_commands() File "/usr/lib/python3.5/distutils/dist.py", line 955, in run_commands self.run_command(cmd) File "/usr/lib/python3.5/distutils/dist.py", line 974, in run_command cmd_obj.run() File "./setup.py", line 514, in run TestBaseCommand.run(self) File "./setup.py", line 430, in run import tests as testsmodule File "<https://ci.centos.org/job/virt-manager-check/systems=libvirt-debian-9/ws/tests/__init__.py",> line 19, in <module> from tests import utils File "<https://ci.centos.org/job/virt-manager-check/systems=libvirt-debian-9/ws/tests/utils.py",> line 13, in <module> import virtinst File "<https://ci.centos.org/job/virt-manager-check/systems=libvirt-debian-9/ws/virtinst/__init__.py",> line 27, in <module> from virtinst.uri import URI File "<https://ci.centos.org/job/virt-manager-check/systems=libvirt-debian-9/ws/virtinst/uri.py",> line 12, in <module> from .cli import parse_optstr_tuples File "<https://ci.centos.org/job/virt-manager-check/systems=libvirt-debian-9/ws/virtinst/cli.py",> line 1424, in <module> class ParseCLICheck(VirtCLIParser): File "<https://ci.centos.org/job/virt-manager-check/systems=libvirt-debian-9/ws/virtinst/cli.py",> line 1153, in __new__ self.__init_class__(**kwargs) File "<https://ci.centos.org/job/virt-manager-check/systems=libvirt-debian-9/ws/virtinst/cli.py",> line 1429, in __init_class__ super().__init_class__(**kwargs) RuntimeError: super(): empty __class__ cell Build step 'Execute shell' marked build as failure

See <https://ci.centos.org/job/virt-manager-check/systems=libvirt-debian-9/316/display/redirect> ------------------------------------------ Started by upstream project "virt-manager-check" build number 316 originally caused by: Started by upstream project "virt-manager-build" build number 317 originally caused by: Started by an SCM change [EnvInject] - Loading node environment variables. Building remotely on libvirt-debian-9 (libvirt) in workspace <https://ci.centos.org/job/virt-manager-check/systems=libvirt-debian-9/ws/> [virt-manager] $ /bin/sh -xe /tmp/jenkins3733129492379500629.sh + /usr/bin/python3 ./setup.py test running test Traceback (most recent call last): File "./setup.py", line 712, in <module> distclass=VMMDistribution, File "/usr/lib/python3.5/distutils/core.py", line 148, in setup dist.run_commands() File "/usr/lib/python3.5/distutils/dist.py", line 955, in run_commands self.run_command(cmd) File "/usr/lib/python3.5/distutils/dist.py", line 974, in run_command cmd_obj.run() File "./setup.py", line 514, in run TestBaseCommand.run(self) File "./setup.py", line 430, in run import tests as testsmodule File "<https://ci.centos.org/job/virt-manager-check/systems=libvirt-debian-9/ws/tests/__init__.py",> line 19, in <module> from tests import utils File "<https://ci.centos.org/job/virt-manager-check/systems=libvirt-debian-9/ws/tests/utils.py",> line 13, in <module> import virtinst File "<https://ci.centos.org/job/virt-manager-check/systems=libvirt-debian-9/ws/virtinst/__init__.py",> line 27, in <module> from virtinst.uri import URI File "<https://ci.centos.org/job/virt-manager-check/systems=libvirt-debian-9/ws/virtinst/uri.py",> line 12, in <module> from .cli import parse_optstr_tuples File "<https://ci.centos.org/job/virt-manager-check/systems=libvirt-debian-9/ws/virtinst/cli.py",> line 1424, in <module> class ParseCLICheck(VirtCLIParser): File "<https://ci.centos.org/job/virt-manager-check/systems=libvirt-debian-9/ws/virtinst/cli.py",> line 1153, in __new__ self.__init_class__(**kwargs) File "<https://ci.centos.org/job/virt-manager-check/systems=libvirt-debian-9/ws/virtinst/cli.py",> line 1429, in __init_class__ super().__init_class__(**kwargs) RuntimeError: super(): empty __class__ cell Build step 'Execute shell' marked build as failure

See <https://ci.centos.org/job/virt-manager-check/systems=libvirt-debian-9/317/display/redirect> ------------------------------------------ Started by upstream project "virt-manager-check" build number 317 originally caused by: Started by upstream project "virt-manager-build" build number 318 originally caused by: Started by upstream project "libvirt-python-build" build number 182 originally caused by: Started by upstream project "libvirt-build" build number 213 originally caused by: Started by an SCM change [EnvInject] - Loading node environment variables. Building remotely on libvirt-debian-9 (libvirt) in workspace <https://ci.centos.org/job/virt-manager-check/systems=libvirt-debian-9/ws/> [virt-manager] $ /bin/sh -xe /tmp/jenkins8552442064080788483.sh + /usr/bin/python3 ./setup.py test running test Traceback (most recent call last): File "./setup.py", line 712, in <module> distclass=VMMDistribution, File "/usr/lib/python3.5/distutils/core.py", line 148, in setup dist.run_commands() File "/usr/lib/python3.5/distutils/dist.py", line 955, in run_commands self.run_command(cmd) File "/usr/lib/python3.5/distutils/dist.py", line 974, in run_command cmd_obj.run() File "./setup.py", line 514, in run TestBaseCommand.run(self) File "./setup.py", line 430, in run import tests as testsmodule File "<https://ci.centos.org/job/virt-manager-check/systems=libvirt-debian-9/ws/tests/__init__.py",> line 19, in <module> from tests import utils File "<https://ci.centos.org/job/virt-manager-check/systems=libvirt-debian-9/ws/tests/utils.py",> line 13, in <module> import virtinst File "<https://ci.centos.org/job/virt-manager-check/systems=libvirt-debian-9/ws/virtinst/__init__.py",> line 27, in <module> from virtinst.uri import URI File "<https://ci.centos.org/job/virt-manager-check/systems=libvirt-debian-9/ws/virtinst/uri.py",> line 12, in <module> from .cli import parse_optstr_tuples File "<https://ci.centos.org/job/virt-manager-check/systems=libvirt-debian-9/ws/virtinst/cli.py",> line 1424, in <module> class ParseCLICheck(VirtCLIParser): File "<https://ci.centos.org/job/virt-manager-check/systems=libvirt-debian-9/ws/virtinst/cli.py",> line 1153, in __new__ self.__init_class__(**kwargs) File "<https://ci.centos.org/job/virt-manager-check/systems=libvirt-debian-9/ws/virtinst/cli.py",> line 1429, in __init_class__ super().__init_class__(**kwargs) RuntimeError: super(): empty __class__ cell Build step 'Execute shell' marked build as failure

See <https://ci.centos.org/job/virt-manager-check/systems=libvirt-debian-9/318/display/redirect> ------------------------------------------ Started by upstream project "virt-manager-check" build number 318 originally caused by: Started by upstream project "virt-manager-build" build number 319 originally caused by: Started by upstream project "libvirt-python-build" build number 183 originally caused by: Started by upstream project "libvirt-build" build number 214 originally caused by: Started by an SCM change [EnvInject] - Loading node environment variables. Building remotely on libvirt-debian-9 (libvirt) in workspace <https://ci.centos.org/job/virt-manager-check/systems=libvirt-debian-9/ws/> [virt-manager] $ /bin/sh -xe /tmp/jenkins3359792269829553724.sh + /usr/bin/python3 ./setup.py test running test Traceback (most recent call last): File "./setup.py", line 712, in <module> distclass=VMMDistribution, File "/usr/lib/python3.5/distutils/core.py", line 148, in setup dist.run_commands() File "/usr/lib/python3.5/distutils/dist.py", line 955, in run_commands self.run_command(cmd) File "/usr/lib/python3.5/distutils/dist.py", line 974, in run_command cmd_obj.run() File "./setup.py", line 514, in run TestBaseCommand.run(self) File "./setup.py", line 430, in run import tests as testsmodule File "<https://ci.centos.org/job/virt-manager-check/systems=libvirt-debian-9/ws/tests/__init__.py",> line 19, in <module> from tests import utils File "<https://ci.centos.org/job/virt-manager-check/systems=libvirt-debian-9/ws/tests/utils.py",> line 13, in <module> import virtinst File "<https://ci.centos.org/job/virt-manager-check/systems=libvirt-debian-9/ws/virtinst/__init__.py",> line 27, in <module> from virtinst.uri import URI File "<https://ci.centos.org/job/virt-manager-check/systems=libvirt-debian-9/ws/virtinst/uri.py",> line 12, in <module> from .cli import parse_optstr_tuples File "<https://ci.centos.org/job/virt-manager-check/systems=libvirt-debian-9/ws/virtinst/cli.py",> line 1424, in <module> class ParseCLICheck(VirtCLIParser): File "<https://ci.centos.org/job/virt-manager-check/systems=libvirt-debian-9/ws/virtinst/cli.py",> line 1153, in __new__ self.__init_class__(**kwargs) File "<https://ci.centos.org/job/virt-manager-check/systems=libvirt-debian-9/ws/virtinst/cli.py",> line 1429, in __init_class__ super().__init_class__(**kwargs) RuntimeError: super(): empty __class__ cell Build step 'Execute shell' marked build as failure

See <https://ci.centos.org/job/virt-manager-check/systems=libvirt-debian-9/319/display/redirect> ------------------------------------------ Started by upstream project "virt-manager-check" build number 319 originally caused by: Started by upstream project "virt-manager-build" build number 320 originally caused by: Started by upstream project "libvirt-python-build" build number 184 originally caused by: Started by upstream project "libvirt-build" build number 215 originally caused by: Started by an SCM change [EnvInject] - Loading node environment variables. Building remotely on libvirt-debian-9 (libvirt) in workspace <https://ci.centos.org/job/virt-manager-check/systems=libvirt-debian-9/ws/> [virt-manager] $ /bin/sh -xe /tmp/jenkins6636116861516630654.sh + /usr/bin/python3 ./setup.py test running test Traceback (most recent call last): File "./setup.py", line 712, in <module> distclass=VMMDistribution, File "/usr/lib/python3.5/distutils/core.py", line 148, in setup dist.run_commands() File "/usr/lib/python3.5/distutils/dist.py", line 955, in run_commands self.run_command(cmd) File "/usr/lib/python3.5/distutils/dist.py", line 974, in run_command cmd_obj.run() File "./setup.py", line 514, in run TestBaseCommand.run(self) File "./setup.py", line 430, in run import tests as testsmodule File "<https://ci.centos.org/job/virt-manager-check/systems=libvirt-debian-9/ws/tests/__init__.py",> line 19, in <module> from tests import utils File "<https://ci.centos.org/job/virt-manager-check/systems=libvirt-debian-9/ws/tests/utils.py",> line 13, in <module> import virtinst File "<https://ci.centos.org/job/virt-manager-check/systems=libvirt-debian-9/ws/virtinst/__init__.py",> line 27, in <module> from virtinst.uri import URI File "<https://ci.centos.org/job/virt-manager-check/systems=libvirt-debian-9/ws/virtinst/uri.py",> line 12, in <module> from .cli import parse_optstr_tuples File "<https://ci.centos.org/job/virt-manager-check/systems=libvirt-debian-9/ws/virtinst/cli.py",> line 1424, in <module> class ParseCLICheck(VirtCLIParser): File "<https://ci.centos.org/job/virt-manager-check/systems=libvirt-debian-9/ws/virtinst/cli.py",> line 1153, in __new__ self.__init_class__(**kwargs) File "<https://ci.centos.org/job/virt-manager-check/systems=libvirt-debian-9/ws/virtinst/cli.py",> line 1429, in __init_class__ super().__init_class__(**kwargs) RuntimeError: super(): empty __class__ cell Build step 'Execute shell' marked build as failure

See <https://ci.centos.org/job/virt-manager-check/systems=libvirt-debian-9/320/display/redirect> ------------------------------------------ Started by upstream project "virt-manager-check" build number 320 originally caused by: Started by upstream project "virt-manager-build" build number 321 originally caused by: Started by upstream project "libosinfo-build" build number 84 originally caused by: Started by an SCM change [EnvInject] - Loading node environment variables. Building remotely on libvirt-debian-9 (libvirt) in workspace <https://ci.centos.org/job/virt-manager-check/systems=libvirt-debian-9/ws/> [virt-manager] $ /bin/sh -xe /tmp/jenkins3930438560561610511.sh + /usr/bin/python3 ./setup.py test running test Traceback (most recent call last): File "./setup.py", line 712, in <module> distclass=VMMDistribution, File "/usr/lib/python3.5/distutils/core.py", line 148, in setup dist.run_commands() File "/usr/lib/python3.5/distutils/dist.py", line 955, in run_commands self.run_command(cmd) File "/usr/lib/python3.5/distutils/dist.py", line 974, in run_command cmd_obj.run() File "./setup.py", line 514, in run TestBaseCommand.run(self) File "./setup.py", line 430, in run import tests as testsmodule File "<https://ci.centos.org/job/virt-manager-check/systems=libvirt-debian-9/ws/tests/__init__.py",> line 19, in <module> from tests import utils File "<https://ci.centos.org/job/virt-manager-check/systems=libvirt-debian-9/ws/tests/utils.py",> line 13, in <module> import virtinst File "<https://ci.centos.org/job/virt-manager-check/systems=libvirt-debian-9/ws/virtinst/__init__.py",> line 27, in <module> from virtinst.uri import URI File "<https://ci.centos.org/job/virt-manager-check/systems=libvirt-debian-9/ws/virtinst/uri.py",> line 12, in <module> from .cli import parse_optstr_tuples File "<https://ci.centos.org/job/virt-manager-check/systems=libvirt-debian-9/ws/virtinst/cli.py",> line 1424, in <module> class ParseCLICheck(VirtCLIParser): File "<https://ci.centos.org/job/virt-manager-check/systems=libvirt-debian-9/ws/virtinst/cli.py",> line 1153, in __new__ self.__init_class__(**kwargs) File "<https://ci.centos.org/job/virt-manager-check/systems=libvirt-debian-9/ws/virtinst/cli.py",> line 1429, in __init_class__ super().__init_class__(**kwargs) RuntimeError: super(): empty __class__ cell Build step 'Execute shell' marked build as failure

participants (1)
-
ci@centos.org