[Libvirt-ci] Build failed in Jenkins: libvirt-go-xml-check » libvirt-debian-9 #173

See <https://ci.centos.org/job/libvirt-go-xml-check/systems=libvirt-debian-9/173/display/redirect> ------------------------------------------ Started by upstream project "libvirt-go-xml-check" build number 173 originally caused by: Started by upstream project "libvirt-go-xml-build" build number 173 originally caused by: Started by upstream project "libvirt-build" build number 205 originally caused by: Started by an SCM change [EnvInject] - Loading node environment variables. Building remotely on libvirt-debian-9 (libvirt) in workspace <https://ci.centos.org/job/libvirt-go-xml-check/systems=libvirt-debian-9/ws/> [libvirt-go-xml] $ /bin/sh -xe /tmp/jenkins8966545692948214579.sh + export TEST_ARGS=-tags xmlroundtrip + go test -tags xmlroundtrip --- FAIL: TestRoundTrip (30.74s) xml_test.go:400: testdata/libvirt/tests/qemuxml2argvdata/memory-hotplug-nvdimm-align.xml: /domain[0]/devices[0]/memory[0]/source[0]/alignsize[0]: element in expected XML missing in actual XML FAIL exit status 1 FAIL _<https://ci.centos.org/job/libvirt-go-xml-check/systems=libvirt-debian-9/ws/> 30.799s Build step 'Execute shell' marked build as failure

See <https://ci.centos.org/job/libvirt-go-xml-check/systems=libvirt-debian-9/174/display/redirect> ------------------------------------------ Started by upstream project "libvirt-go-xml-check" build number 174 originally caused by: Started by upstream project "libvirt-go-xml-build" build number 174 originally caused by: Started by upstream project "libvirt-build" build number 206 originally caused by: Started by an SCM change [EnvInject] - Loading node environment variables. Building remotely on libvirt-debian-9 (libvirt) in workspace <https://ci.centos.org/job/libvirt-go-xml-check/systems=libvirt-debian-9/ws/> [libvirt-go-xml] $ /bin/sh -xe /tmp/jenkins7352004768953718337.sh + export TEST_ARGS=-tags xmlroundtrip + go test -tags xmlroundtrip --- FAIL: TestRoundTrip (26.61s) xml_test.go:400: testdata/libvirt/tests/qemuxml2argvdata/memory-hotplug-nvdimm-align.xml: /domain[0]/devices[0]/memory[0]/source[0]/alignsize[0]: element in expected XML missing in actual XML FAIL exit status 1 FAIL _<https://ci.centos.org/job/libvirt-go-xml-check/systems=libvirt-debian-9/ws/> 26.701s Build step 'Execute shell' marked build as failure

See <https://ci.centos.org/job/libvirt-go-xml-check/systems=libvirt-debian-9/175/display/redirect> ------------------------------------------ Started by upstream project "libvirt-go-xml-check" build number 175 originally caused by: Started by upstream project "libvirt-go-xml-build" build number 175 originally caused by: Started by upstream project "libvirt-build" build number 209 originally caused by: Started by an SCM change [EnvInject] - Loading node environment variables. Building remotely on libvirt-debian-9 (libvirt) in workspace <https://ci.centos.org/job/libvirt-go-xml-check/systems=libvirt-debian-9/ws/> [libvirt-go-xml] $ /bin/sh -xe /tmp/jenkins1344491012144598108.sh + export TEST_ARGS=-tags xmlroundtrip + go test -tags xmlroundtrip --- FAIL: TestRoundTrip (18.16s) xml_test.go:400: testdata/libvirt/tests/qemuxml2argvdata/memory-hotplug-nvdimm-align.xml: /domain[0]/devices[0]/memory[0]/source[0]/alignsize[0]: element in expected XML missing in actual XML FAIL exit status 1 FAIL _<https://ci.centos.org/job/libvirt-go-xml-check/systems=libvirt-debian-9/ws/> 18.204s Build step 'Execute shell' marked build as failure

See <https://ci.centos.org/job/libvirt-go-xml-check/systems=libvirt-debian-9/176/display/redirect> ------------------------------------------ Started by upstream project "libvirt-go-xml-check" build number 176 originally caused by: Started by upstream project "libvirt-go-xml-build" build number 176 originally caused by: Started by upstream project "libvirt-build" build number 210 originally caused by: Started by an SCM change [EnvInject] - Loading node environment variables. Building remotely on libvirt-debian-9 (libvirt) in workspace <https://ci.centos.org/job/libvirt-go-xml-check/systems=libvirt-debian-9/ws/> [libvirt-go-xml] $ /bin/sh -xe /tmp/jenkins3831669303706241454.sh + export TEST_ARGS=-tags xmlroundtrip + go test -tags xmlroundtrip --- FAIL: TestRoundTrip (34.48s) xml_test.go:400: testdata/libvirt/tests/qemuxml2argvdata/memory-hotplug-nvdimm-align.xml: /domain[0]/devices[0]/memory[0]/source[0]/alignsize[0]: element in expected XML missing in actual XML FAIL exit status 1 FAIL _<https://ci.centos.org/job/libvirt-go-xml-check/systems=libvirt-debian-9/ws/> 34.574s Build step 'Execute shell' marked build as failure

See <https://ci.centos.org/job/libvirt-go-xml-check/systems=libvirt-debian-9/177/display/redirect> ------------------------------------------ Started by upstream project "libvirt-go-xml-check" build number 177 originally caused by: Started by upstream project "libvirt-go-xml-build" build number 177 originally caused by: Started by upstream project "libvirt-build" build number 211 originally caused by: Started by an SCM change [EnvInject] - Loading node environment variables. Building remotely on libvirt-debian-9 (libvirt) in workspace <https://ci.centos.org/job/libvirt-go-xml-check/systems=libvirt-debian-9/ws/> [libvirt-go-xml] $ /bin/sh -xe /tmp/jenkins9017630842202204710.sh + export TEST_ARGS=-tags xmlroundtrip + go test -tags xmlroundtrip --- FAIL: TestRoundTrip (17.50s) xml_test.go:400: testdata/libvirt/tests/qemuxml2argvdata/memory-hotplug-nvdimm-align.xml: /domain[0]/devices[0]/memory[0]/source[0]/alignsize[0]: element in expected XML missing in actual XML FAIL exit status 1 FAIL _<https://ci.centos.org/job/libvirt-go-xml-check/systems=libvirt-debian-9/ws/> 17.578s Build step 'Execute shell' marked build as failure

See <https://ci.centos.org/job/libvirt-go-xml-check/systems=libvirt-debian-9/178/display/redirect> ------------------------------------------ Started by upstream project "libvirt-go-xml-check" build number 178 originally caused by: Started by upstream project "libvirt-go-xml-build" build number 178 originally caused by: Started by upstream project "libvirt-build" build number 212 originally caused by: Started by an SCM change Started by an SCM change Started by an SCM change Started by an SCM change Started by an SCM change Started by an SCM change Started by an SCM change [EnvInject] - Loading node environment variables. Building remotely on libvirt-debian-9 (libvirt) in workspace <https://ci.centos.org/job/libvirt-go-xml-check/systems=libvirt-debian-9/ws/> [libvirt-go-xml] $ /bin/sh -xe /tmp/jenkins5884987149263189738.sh + export TEST_ARGS=-tags xmlroundtrip + go test -tags xmlroundtrip --- FAIL: TestRoundTrip (16.44s) xml_test.go:400: testdata/libvirt/tests/qemuxml2argvdata/memory-hotplug-nvdimm-align.xml: /domain[0]/devices[0]/memory[0]/source[0]/alignsize[0]: element in expected XML missing in actual XML FAIL exit status 1 FAIL _<https://ci.centos.org/job/libvirt-go-xml-check/systems=libvirt-debian-9/ws/> 16.556s Build step 'Execute shell' marked build as failure

See <https://ci.centos.org/job/libvirt-go-xml-check/systems=libvirt-debian-9/179/display/redirect> ------------------------------------------ Started by upstream project "libvirt-go-xml-check" build number 179 originally caused by: Started by upstream project "libvirt-go-xml-build" build number 179 originally caused by: Started by upstream project "libvirt-build" build number 213 originally caused by: Started by an SCM change [EnvInject] - Loading node environment variables. Building remotely on libvirt-debian-9 (libvirt) in workspace <https://ci.centos.org/job/libvirt-go-xml-check/systems=libvirt-debian-9/ws/> [libvirt-go-xml] $ /bin/sh -xe /tmp/jenkins3882004018386497047.sh + export TEST_ARGS=-tags xmlroundtrip + go test -tags xmlroundtrip --- FAIL: TestRoundTrip (26.19s) xml_test.go:400: testdata/libvirt/tests/qemuxml2argvdata/memory-hotplug-nvdimm-align.xml: /domain[0]/devices[0]/memory[0]/source[0]/alignsize[0]: element in expected XML missing in actual XML FAIL exit status 1 FAIL _<https://ci.centos.org/job/libvirt-go-xml-check/systems=libvirt-debian-9/ws/> 26.250s Build step 'Execute shell' marked build as failure

See <https://ci.centos.org/job/libvirt-go-xml-check/systems=libvirt-debian-9/180/display/redirect> ------------------------------------------ Started by upstream project "libvirt-go-xml-check" build number 180 originally caused by: Started by upstream project "libvirt-go-xml-build" build number 180 originally caused by: Started by upstream project "libvirt-build" build number 214 originally caused by: Started by an SCM change [EnvInject] - Loading node environment variables. Building remotely on libvirt-debian-9 (libvirt) in workspace <https://ci.centos.org/job/libvirt-go-xml-check/systems=libvirt-debian-9/ws/> [libvirt-go-xml] $ /bin/sh -xe /tmp/jenkins7111595069471921561.sh + export TEST_ARGS=-tags xmlroundtrip + go test -tags xmlroundtrip --- FAIL: TestRoundTrip (20.39s) xml_test.go:400: testdata/libvirt/tests/qemuxml2argvdata/memory-hotplug-nvdimm-align.xml: /domain[0]/devices[0]/memory[0]/source[0]/alignsize[0]: element in expected XML missing in actual XML FAIL exit status 1 FAIL _<https://ci.centos.org/job/libvirt-go-xml-check/systems=libvirt-debian-9/ws/> 20.465s Build step 'Execute shell' marked build as failure

See <https://ci.centos.org/job/libvirt-go-xml-check/systems=libvirt-debian-9/181/display/redirect> ------------------------------------------ Started by upstream project "libvirt-go-xml-check" build number 181 originally caused by: Started by upstream project "libvirt-go-xml-build" build number 181 originally caused by: Started by upstream project "libvirt-build" build number 215 originally caused by: Started by an SCM change [EnvInject] - Loading node environment variables. Building remotely on libvirt-debian-9 (libvirt) in workspace <https://ci.centos.org/job/libvirt-go-xml-check/systems=libvirt-debian-9/ws/> [libvirt-go-xml] $ /bin/sh -xe /tmp/jenkins1319375847616208493.sh + export TEST_ARGS=-tags xmlroundtrip + go test -tags xmlroundtrip --- FAIL: TestRoundTrip (14.58s) xml_test.go:400: testdata/libvirt/tests/qemuxml2argvdata/memory-hotplug-nvdimm-align.xml: /domain[0]/devices[0]/memory[0]/source[0]/alignsize[0]: element in expected XML missing in actual XML FAIL exit status 1 FAIL _<https://ci.centos.org/job/libvirt-go-xml-check/systems=libvirt-debian-9/ws/> 14.637s Build step 'Execute shell' marked build as failure

See <https://ci.centos.org/job/libvirt-go-xml-check/systems=libvirt-debian-9/182/display/redirect> ------------------------------------------ Started by upstream project "libvirt-go-xml-check" build number 182 originally caused by: Started by upstream project "libvirt-go-xml-build" build number 182 originally caused by: Started by upstream project "libvirt-build" build number 216 originally caused by: Started by an SCM change Started by an SCM change Started by an SCM change [EnvInject] - Loading node environment variables. Building remotely on libvirt-debian-9 (libvirt) in workspace <https://ci.centos.org/job/libvirt-go-xml-check/systems=libvirt-debian-9/ws/> [libvirt-go-xml] $ /bin/sh -xe /tmp/jenkins5379168123223117038.sh + export TEST_ARGS=-tags xmlroundtrip + go test -tags xmlroundtrip --- FAIL: TestRoundTrip (27.40s) xml_test.go:400: testdata/libvirt/tests/qemuxml2argvdata/memory-hotplug-nvdimm-align.xml: /domain[0]/devices[0]/memory[0]/source[0]/alignsize[0]: element in expected XML missing in actual XML FAIL exit status 1 FAIL _<https://ci.centos.org/job/libvirt-go-xml-check/systems=libvirt-debian-9/ws/> 27.641s Build step 'Execute shell' marked build as failure

See <https://ci.centos.org/job/libvirt-go-xml-check/systems=libvirt-debian-9/183/display/redirect> ------------------------------------------ Started by upstream project "libvirt-go-xml-check" build number 183 originally caused by: Started by upstream project "libvirt-go-xml-build" build number 183 originally caused by: Started by upstream project "libvirt-build" build number 217 originally caused by: Started by an SCM change [EnvInject] - Loading node environment variables. Building remotely on libvirt-debian-9 (libvirt) in workspace <https://ci.centos.org/job/libvirt-go-xml-check/systems=libvirt-debian-9/ws/> [libvirt-go-xml] $ /bin/sh -xe /tmp/jenkins5372951768713681216.sh + export TEST_ARGS=-tags xmlroundtrip + go test -tags xmlroundtrip --- FAIL: TestRoundTrip (16.56s) xml_test.go:400: testdata/libvirt/tests/qemuxml2argvdata/memory-hotplug-nvdimm-align.xml: /domain[0]/devices[0]/memory[0]/source[0]/alignsize[0]: element in expected XML missing in actual XML FAIL exit status 1 FAIL _<https://ci.centos.org/job/libvirt-go-xml-check/systems=libvirt-debian-9/ws/> 16.661s Build step 'Execute shell' marked build as failure

See <https://ci.centos.org/job/libvirt-go-xml-check/systems=libvirt-debian-9/184/display/redirect> ------------------------------------------ Started by upstream project "libvirt-go-xml-check" build number 184 originally caused by: Started by upstream project "libvirt-go-xml-build" build number 184 originally caused by: Started by upstream project "libvirt-build" build number 218 originally caused by: Started by an SCM change [EnvInject] - Loading node environment variables. Building remotely on libvirt-debian-9 (libvirt) in workspace <https://ci.centos.org/job/libvirt-go-xml-check/systems=libvirt-debian-9/ws/> [libvirt-go-xml] $ /bin/sh -xe /tmp/jenkins8571605186441916378.sh + export TEST_ARGS=-tags xmlroundtrip + go test -tags xmlroundtrip --- FAIL: TestRoundTrip (38.96s) xml_test.go:400: testdata/libvirt/tests/qemuxml2argvdata/memory-hotplug-nvdimm-align.xml: /domain[0]/devices[0]/memory[0]/source[0]/alignsize[0]: element in expected XML missing in actual XML FAIL exit status 1 FAIL _<https://ci.centos.org/job/libvirt-go-xml-check/systems=libvirt-debian-9/ws/> 39.111s Build step 'Execute shell' marked build as failure

See <https://ci.centos.org/job/libvirt-go-xml-check/systems=libvirt-debian-9/185/display/redirect> ------------------------------------------ Started by upstream project "libvirt-go-xml-check" build number 185 originally caused by: Started by upstream project "libvirt-go-xml-build" build number 185 originally caused by: Started by upstream project "libvirt-build" build number 219 originally caused by: Started by an SCM change Started by an SCM change Started by an SCM change Started by an SCM change [EnvInject] - Loading node environment variables. Building remotely on libvirt-debian-9 (libvirt) in workspace <https://ci.centos.org/job/libvirt-go-xml-check/systems=libvirt-debian-9/ws/> [libvirt-go-xml] $ /bin/sh -xe /tmp/jenkins2009167494942236054.sh + export TEST_ARGS=-tags xmlroundtrip + go test -tags xmlroundtrip --- FAIL: TestRoundTrip (13.91s) xml_test.go:400: testdata/libvirt/tests/qemuxml2argvdata/memory-hotplug-nvdimm-align.xml: /domain[0]/devices[0]/memory[0]/source[0]/alignsize[0]: element in expected XML missing in actual XML FAIL exit status 1 FAIL _<https://ci.centos.org/job/libvirt-go-xml-check/systems=libvirt-debian-9/ws/> 14.068s Build step 'Execute shell' marked build as failure

See <https://ci.centos.org/job/libvirt-go-xml-check/systems=libvirt-debian-9/186/display/redirect> ------------------------------------------ Started by upstream project "libvirt-go-xml-check" build number 186 originally caused by: Started by upstream project "libvirt-go-xml-build" build number 186 originally caused by: Started by upstream project "libvirt-build" build number 220 originally caused by: Started by an SCM change Started by an SCM change [EnvInject] - Loading node environment variables. Building remotely on libvirt-debian-9 (libvirt) in workspace <https://ci.centos.org/job/libvirt-go-xml-check/systems=libvirt-debian-9/ws/> [libvirt-go-xml] $ /bin/sh -xe /tmp/jenkins5063354674411137871.sh + export TEST_ARGS=-tags xmlroundtrip + go test -tags xmlroundtrip --- FAIL: TestRoundTrip (7.70s) xml_test.go:400: testdata/libvirt/tests/qemuxml2argvdata/memory-hotplug-nvdimm-align.xml: /domain[0]/devices[0]/memory[0]/source[0]/alignsize[0]: element in expected XML missing in actual XML FAIL exit status 1 FAIL _<https://ci.centos.org/job/libvirt-go-xml-check/systems=libvirt-debian-9/ws/> 7.767s Build step 'Execute shell' marked build as failure

See <https://ci.centos.org/job/libvirt-go-xml-check/systems=libvirt-debian-9/187/display/redirect> ------------------------------------------ Started by upstream project "libvirt-go-xml-check" build number 187 originally caused by: Started by upstream project "libvirt-go-xml-build" build number 187 originally caused by: Started by upstream project "libvirt-build" build number 221 originally caused by: Started by an SCM change Started by an SCM change Started by an SCM change Started by an SCM change [EnvInject] - Loading node environment variables. Building remotely on libvirt-debian-9 (libvirt) in workspace <https://ci.centos.org/job/libvirt-go-xml-check/systems=libvirt-debian-9/ws/> [libvirt-go-xml] $ /bin/sh -xe /tmp/jenkins44268457468669705.sh + export TEST_ARGS=-tags xmlroundtrip + go test -tags xmlroundtrip --- FAIL: TestRoundTrip (22.01s) xml_test.go:400: testdata/libvirt/tests/qemuxml2argvdata/memory-hotplug-nvdimm-align.xml: /domain[0]/devices[0]/memory[0]/source[0]/alignsize[0]: element in expected XML missing in actual XML FAIL exit status 1 FAIL _<https://ci.centos.org/job/libvirt-go-xml-check/systems=libvirt-debian-9/ws/> 22.138s Build step 'Execute shell' marked build as failure

See <https://ci.centos.org/job/libvirt-go-xml-check/systems=libvirt-debian-9/188/display/redirect> ------------------------------------------ Started by upstream project "libvirt-go-xml-check" build number 188 originally caused by: Started by upstream project "libvirt-go-xml-build" build number 188 originally caused by: Started by upstream project "libvirt-build" build number 222 originally caused by: Started by an SCM change [EnvInject] - Loading node environment variables. Building remotely on libvirt-debian-9 (libvirt) in workspace <https://ci.centos.org/job/libvirt-go-xml-check/systems=libvirt-debian-9/ws/> [libvirt-go-xml] $ /bin/sh -xe /tmp/jenkins7931587256064026297.sh + export TEST_ARGS=-tags xmlroundtrip + go test -tags xmlroundtrip --- FAIL: TestRoundTrip (29.23s) xml_test.go:400: testdata/libvirt/tests/qemuxml2argvdata/memory-hotplug-nvdimm-align.xml: /domain[0]/devices[0]/memory[0]/source[0]/alignsize[0]: element in expected XML missing in actual XML FAIL exit status 1 FAIL _<https://ci.centos.org/job/libvirt-go-xml-check/systems=libvirt-debian-9/ws/> 29.505s Build step 'Execute shell' marked build as failure

See <https://ci.centos.org/job/libvirt-go-xml-check/systems=libvirt-debian-9/189/display/redirect> ------------------------------------------ Started by upstream project "libvirt-go-xml-check" build number 189 originally caused by: Started by upstream project "libvirt-go-xml-build" build number 189 originally caused by: Started by upstream project "libvirt-build" build number 223 originally caused by: Started by an SCM change [EnvInject] - Loading node environment variables. Building remotely on libvirt-debian-9 (libvirt) in workspace <https://ci.centos.org/job/libvirt-go-xml-check/systems=libvirt-debian-9/ws/> [libvirt-go-xml] $ /bin/sh -xe /tmp/jenkins4135299086151366420.sh + export TEST_ARGS=-tags xmlroundtrip + go test -tags xmlroundtrip --- FAIL: TestRoundTrip (17.51s) xml_test.go:400: testdata/libvirt/tests/qemuxml2argvdata/memory-hotplug-nvdimm-align.xml: /domain[0]/devices[0]/memory[0]/source[0]/alignsize[0]: element in expected XML missing in actual XML FAIL exit status 1 FAIL _<https://ci.centos.org/job/libvirt-go-xml-check/systems=libvirt-debian-9/ws/> 17.794s Build step 'Execute shell' marked build as failure

See <https://ci.centos.org/job/libvirt-go-xml-check/systems=libvirt-debian-9/190/display/redirect> ------------------------------------------ Started by upstream project "libvirt-go-xml-check" build number 190 originally caused by: Started by upstream project "libvirt-go-xml-build" build number 190 originally caused by: Started by upstream project "libvirt-build" build number 224 originally caused by: Started by an SCM change [EnvInject] - Loading node environment variables. Building remotely on libvirt-debian-9 (libvirt) in workspace <https://ci.centos.org/job/libvirt-go-xml-check/systems=libvirt-debian-9/ws/> [libvirt-go-xml] $ /bin/sh -xe /tmp/jenkins4458729589984382445.sh + export TEST_ARGS=-tags xmlroundtrip + go test -tags xmlroundtrip --- FAIL: TestRoundTrip (34.03s) xml_test.go:400: testdata/libvirt/tests/qemuxml2argvdata/memory-hotplug-nvdimm-align.xml: /domain[0]/devices[0]/memory[0]/source[0]/alignsize[0]: element in expected XML missing in actual XML FAIL exit status 1 FAIL _<https://ci.centos.org/job/libvirt-go-xml-check/systems=libvirt-debian-9/ws/> 34.304s Build step 'Execute shell' marked build as failure

See <https://ci.centos.org/job/libvirt-go-xml-check/systems=libvirt-debian-9/191/display/redirect> ------------------------------------------ Started by upstream project "libvirt-go-xml-check" build number 191 originally caused by: Started by upstream project "libvirt-go-xml-build" build number 191 originally caused by: Started by upstream project "libvirt-build" build number 225 originally caused by: Started by an SCM change Started by an SCM change Started by an SCM change Started by an SCM change Started by an SCM change [EnvInject] - Loading node environment variables. Building remotely on libvirt-debian-9 (libvirt) in workspace <https://ci.centos.org/job/libvirt-go-xml-check/systems=libvirt-debian-9/ws/> [libvirt-go-xml] $ /bin/sh -xe /tmp/jenkins6766258545857727015.sh + export TEST_ARGS=-tags xmlroundtrip + go test -tags xmlroundtrip --- FAIL: TestRoundTrip (12.10s) xml_test.go:400: testdata/libvirt/tests/qemuxml2argvdata/memory-hotplug-nvdimm-align.xml: /domain[0]/devices[0]/memory[0]/source[0]/alignsize[0]: element in expected XML missing in actual XML FAIL exit status 1 FAIL _<https://ci.centos.org/job/libvirt-go-xml-check/systems=libvirt-debian-9/ws/> 12.278s Build step 'Execute shell' marked build as failure

See <https://ci.centos.org/job/libvirt-go-xml-check/systems=libvirt-debian-9/192/display/redirect> ------------------------------------------ Started by upstream project "libvirt-go-xml-check" build number 192 originally caused by: Started by upstream project "libvirt-go-xml-build" build number 192 originally caused by: Started by upstream project "libvirt-build" build number 226 originally caused by: Started by an SCM change [EnvInject] - Loading node environment variables. Building remotely on libvirt-debian-9 (libvirt) in workspace <https://ci.centos.org/job/libvirt-go-xml-check/systems=libvirt-debian-9/ws/> [libvirt-go-xml] $ /bin/sh -xe /tmp/jenkins8874670746575232471.sh + export TEST_ARGS=-tags xmlroundtrip + go test -tags xmlroundtrip --- FAIL: TestRoundTrip (33.83s) xml_test.go:400: testdata/libvirt/tests/qemuxml2argvdata/memory-hotplug-nvdimm-align.xml: /domain[0]/devices[0]/memory[0]/source[0]/alignsize[0]: element in expected XML missing in actual XML FAIL exit status 1 FAIL _<https://ci.centos.org/job/libvirt-go-xml-check/systems=libvirt-debian-9/ws/> 34.165s Build step 'Execute shell' marked build as failure

See <https://ci.centos.org/job/libvirt-go-xml-check/systems=libvirt-debian-9/193/display/redirect> ------------------------------------------ Started by upstream project "libvirt-go-xml-check" build number 193 originally caused by: Started by upstream project "libvirt-go-xml-build" build number 193 originally caused by: Started by upstream project "libvirt-build" build number 227 originally caused by: Started by an SCM change [EnvInject] - Loading node environment variables. Building remotely on libvirt-debian-9 (libvirt) in workspace <https://ci.centos.org/job/libvirt-go-xml-check/systems=libvirt-debian-9/ws/> [libvirt-go-xml] $ /bin/sh -xe /tmp/jenkins1354213855357469827.sh + export TEST_ARGS=-tags xmlroundtrip + go test -tags xmlroundtrip --- FAIL: TestRoundTrip (37.26s) xml_test.go:400: testdata/libvirt/tests/qemuxml2argvdata/memory-hotplug-nvdimm-align.xml: /domain[0]/devices[0]/memory[0]/source[0]/alignsize[0]: element in expected XML missing in actual XML FAIL exit status 1 FAIL _<https://ci.centos.org/job/libvirt-go-xml-check/systems=libvirt-debian-9/ws/> 37.449s Build step 'Execute shell' marked build as failure

See <https://ci.centos.org/job/libvirt-go-xml-check/systems=libvirt-debian-9/194/display/redirect> ------------------------------------------ Started by upstream project "libvirt-go-xml-check" build number 194 originally caused by: Started by upstream project "libvirt-go-xml-build" build number 194 originally caused by: Started by upstream project "libvirt-build" build number 228 originally caused by: Started by an SCM change Started by an SCM change Started by an SCM change Started by an SCM change Started by an SCM change Started by an SCM change Started by an SCM change [EnvInject] - Loading node environment variables. Building remotely on libvirt-debian-9 (libvirt) in workspace <https://ci.centos.org/job/libvirt-go-xml-check/systems=libvirt-debian-9/ws/> [libvirt-go-xml] $ /bin/sh -xe /tmp/jenkins4723954078911770617.sh + export TEST_ARGS=-tags xmlroundtrip + go test -tags xmlroundtrip --- FAIL: TestRoundTrip (27.23s) xml_test.go:400: testdata/libvirt/tests/qemuxml2argvdata/memory-hotplug-nvdimm-align.xml: /domain[0]/devices[0]/memory[0]/source[0]/alignsize[0]: element in expected XML missing in actual XML FAIL exit status 1 FAIL _<https://ci.centos.org/job/libvirt-go-xml-check/systems=libvirt-debian-9/ws/> 27.416s Build step 'Execute shell' marked build as failure

See <https://ci.centos.org/job/libvirt-go-xml-check/systems=libvirt-debian-9/195/display/redirect> ------------------------------------------ Started by upstream project "libvirt-go-xml-check" build number 195 originally caused by: Started by upstream project "libvirt-go-xml-build" build number 195 originally caused by: Started by upstream project "libvirt-build" build number 229 originally caused by: Started by an SCM change Started by an SCM change Started by an SCM change Started by an SCM change [EnvInject] - Loading node environment variables. Building remotely on libvirt-debian-9 (libvirt) in workspace <https://ci.centos.org/job/libvirt-go-xml-check/systems=libvirt-debian-9/ws/> [libvirt-go-xml] $ /bin/sh -xe /tmp/jenkins8805315988280866130.sh + export TEST_ARGS=-tags xmlroundtrip + go test -tags xmlroundtrip --- FAIL: TestRoundTrip (23.04s) xml_test.go:400: testdata/libvirt/tests/qemuxml2argvdata/memory-hotplug-nvdimm-align.xml: /domain[0]/devices[0]/memory[0]/source[0]/alignsize[0]: element in expected XML missing in actual XML FAIL exit status 1 FAIL _<https://ci.centos.org/job/libvirt-go-xml-check/systems=libvirt-debian-9/ws/> 23.196s Build step 'Execute shell' marked build as failure

participants (1)
-
ci@centos.org