[Libvirt-ci] Build failed in Jenkins: libvirt-build » libvirt-freebsd-12 #208

See <https://ci.centos.org/job/libvirt-build/systems=libvirt-freebsd-12/208/display/redirect?page=changes> Changes: [eblake] maint: Drop unused GETTEXT_CPPFLAGS variable [eblake] maint: Prefer AM_CPPFLAGS over INCLUDES ------------------------------------------ [...truncated 116.30 KB...] checking for struct ifreq.ifr_ifindex... no checking for struct ifreq.ifr_index... yes checking for struct ifreq.ifr_hwaddr... no checking whether BRDGSFD is declared... yes checking whether BRDGADD is declared... yes checking whether BRDGDEL is declared... yes checking whether cpuset_getaffinity is declared... yes checking for kvm_getprocs in -lkvm... yes checking for struct if_data.ifi_oqdrops... yes checking whether clock_serv_t is declared... no checking whether host_get_clock_service is declared... no checking whether clock_get_time is declared... no checking for ifconfig... /sbin/ifconfig checking whether this build is done by a static analysis tool... no checking that generated files are newer than configure... done configure: creating ./config.status config.status: creating run config.status: creating Makefile config.status: creating src/Makefile config.status: creating include/libvirt/Makefile config.status: creating docs/Makefile config.status: creating gnulib/lib/Makefile config.status: creating gnulib/tests/Makefile config.status: creating .color_coded config.status: creating .ycm_extra_conf.py config.status: creating libvirt.pc config.status: creating libvirt-qemu.pc config.status: creating libvirt-lxc.pc config.status: creating libvirt-admin.pc config.status: creating src/libvirt.pc config.status: creating src/libvirt-qemu.pc config.status: creating src/libvirt-lxc.pc config.status: creating libvirt.spec config.status: creating mingw-libvirt.spec config.status: creating po/Makefile config.status: creating include/libvirt/libvirt-common.h config.status: creating examples/Makefile config.status: creating tests/Makefile config.status: creating tools/Makefile config.status: creating config.h config.status: linking ../GNUmakefile to GNUmakefile config.status: executing depfiles commands config.status: executing libtool commands configure: configure: Configuration summary configure: ===================== configure: configure: Drivers configure: configure: QEMU: yes configure: OpenVZ: no configure: VMware: yes configure: VBox: yes configure: XenAPI: no configure: libxl: no configure: LXC: no configure: PHYP: yes configure: ESX: yes configure: Hyper-V: no configure: vz: no configure: Bhyve: yes configure: Test: yes configure: Remote: yes configure: Network: yes configure: Libvirtd: yes configure: Interface: no configure: configure: Storage Drivers configure: configure: Dir: yes configure: FS: no configure: NetFS: no configure: LVM: no configure: iSCSI: no configure: iscsi-direct: no configure: SCSI: no configure: mpath: no configure: Disk: no configure: RBD: no configure: Sheepdog: no configure: Gluster: no configure: ZFS: yes configure: Virtuozzo storage: no configure: configure: Security Drivers configure: configure: SELinux: no configure: AppArmor: no configure: configure: Driver Loadable Modules configure: configure: driver_modules: yes (CFLAGS='' LIBS='') configure: configure: Libraries configure: configure: acl: no configure: apparmor: no configure: attr: no configure: audit: no configure: avahi: yes (CFLAGS='-D_REENTRANT -D_THREAD_SAFE -pthread -I/usr/local/include ' LIBS='-L/usr/local/lib -lavahi-common -lavahi-client ') configure: bash_completion: yes (CFLAGS='' LIBS='') configure: blkid: no configure: capng: no configure: curl: yes (CFLAGS='-DCURL_DISABLE_TYPECHECK -I/usr/local/include ' LIBS='-L/usr/local/lib -lcurl ') configure: dbus: yes (CFLAGS='-I/usr/local/include/dbus-1.0 -I/usr/local/lib/dbus-1.0/include ' LIBS='-L/usr/local/lib -ldbus-1 ') configure: dlopen: yes (CFLAGS='' LIBS='') configure: firewalld: no configure: fuse: yes (CFLAGS='-I/usr/local/include/fuse -D_FILE_OFFSET_BITS=64 ' LIBS='-L/usr/local/lib -lfuse -pthread ') configure: glusterfs: no configure: gnutls: yes (CFLAGS='-I/usr/local/include -I/usr/local/include/p11-kit-1 ' LIBS='-L/usr/local/lib -lgnutls ') configure: hal: yes (CFLAGS='-DDBUS_API_SUBJECT_TO_CHANGE -I/usr/local/include/hal -I/usr/local/include/dbus-1.0 -I/usr/local/lib/dbus-1.0/include ' LIBS='-L/usr/local/lib -lhal -ldbus-1 ') configure: libiscsi: no configure: libnl: no configure: libpcap: yes (CFLAGS='-I/usr/local/include' LIBS='-L/usr/local/lib -Wl,-rpath,/usr/local/lib -lpcap') configure: libssh: yes (CFLAGS='-I/usr/local/include ' LIBS='-L/usr/local/lib -lssh ') configure: libxl: no configure: libxml: yes (CFLAGS='-I/usr/local/include/libxml2 ' LIBS='-L/usr/local/lib -lxml2 ') configure: macvtap: no configure: netcf: no configure: NLS: no configure: nss: yes configure: numactl: no configure: openwsman: no configure: pciaccess: yes (CFLAGS='-I/usr/local/include ' LIBS='-L/usr/local/lib -lpciaccess ') configure: pm_utils: yes (CFLAGS='' LIBS='') configure: polkit: yes configure: rbd: no configure: readline: yes (CFLAGS='-D_FUNCTION_DEF ' LIBS='-lreadline') configure: sanlock: no configure: sasl: yes (CFLAGS='' LIBS='-lsasl2') configure: selinux: no configure: ssh2: yes (CFLAGS='-I/usr/local/include ' LIBS='-L/usr/local/lib -lssh2 ') configure: udev: no configure: virtualport: no configure: xdr: yes (CFLAGS='' LIBS='') configure: xenapi: no configure: yajl: yes (CFLAGS='' LIBS='-lyajl') configure: configure: Windows configure: configure: Cygwin: no configure: MinGW: no configure: MSVC: no configure: windres: no configure: configure: Test suite configure: configure: Coverage: no configure: Alloc OOM: no configure: configure: Miscellaneous configure: configure: Debug: yes configure: Use -Werror: yes configure: Warning Flags: -fno-common -W -Waddress -Wall -Wattributes -Wbad-function-cast -Wbuiltin-macro-redefined -Wcast-align -Wchar-subscripts -Wcomment -Wcomments -Wcpp -Wdangling-else -Wdate-time -Wdeprecated-declarations -Wdiv-by-zero -Wdouble-promotion -Wduplicate-decl-specifier -Wempty-body -Wendif-labels -Wexpansion-to-defined -Wextra -Wformat-extra-args -Wformat-security -Wformat-y2k -Wformat-zero-length -Wignored-attributes -Wignored-qualifiers -Wimplicit -Wimplicit-function-declaration -Wimplicit-int -Wincompatible-pointer-types -Winit-self -Winline -Wint-conversion -Wint-to-pointer-cast -Winvalid-pch -Wlogical-not-parentheses -Wmain -Wmissing-braces -Wmissing-declarations -Wmissing-field-initializers -Wmissing-include-dirs -Wmissing-prototypes -Wmultichar -Wnarrowing -Wnested-externs -Wnonnull -Wnull-dereference -Wodr -Wold-style-definition -Woverflow -Wparentheses -Wpointer-arith -Wpointer-sign -Wpointer-to-int-cast -Wpragmas -Wreturn-type -Wsequence-point -Wshadow -Wshift-count-negative -Wshift-count-overflow -Wshift-negative-value -Wsizeof-array-argument -Wsizeof-pointer-memaccess -Wstrict-aliasing -Wstrict-prototypes -Wswitch -Wswitch-bool -Wtautological-compare -Wtrigraphs -Wtype-limits -Wuninitialized -Wunknown-pragmas -Wunused -Wunused-function -Wunused-label -Wunused-local-typedefs -Wunused-parameter -Wunused-result -Wunused-value -Wunused-variable -Wvarargs -Wvariadic-macros -Wvolatile-register-var -Wwrite-strings -Wno-sign-compare -Wswitch-enum -Wno-format-nonliteral -fstack-protector -Wno-unused-command-line-argument -fexceptions -fasynchronous-unwind-tables -Werror configure: DTrace: no configure: numad: no configure: Init script: none configure: Char device locks: no configure: Default Editor: vi configure: Loader/NVRAM: configure: virt-login-shell: no configure: virt-host-validate: yes configure: TLS priority: NORMAL configure: configure: Developer Tools configure: configure: wireshark_dissector: no configure: configure: Privileges configure: configure: QEMU: root:wheel configure: Now type 'gmake' to compile libvirt. + /usr/local/bin/gmake /usr/local/bin/gmake all-recursive gmake[1]: Entering directory '/usr<https://ci.centos.org/job/libvirt-build/systems=libvirt-freebsd-12/ws/build'> Making all in . gmake[2]: Entering directory '/usr<https://ci.centos.org/job/libvirt-build/systems=libvirt-freebsd-12/ws/build'> gmake[2]: Leaving directory '/usr<https://ci.centos.org/job/libvirt-build/systems=libvirt-freebsd-12/ws/build'> Making all in gnulib/lib gmake[2]: Entering directory '/usr<https://ci.centos.org/job/libvirt-build/systems=libvirt-freebsd-12/ws/build/gnulib/lib'> GEN alloca.h GEN byteswap.h GEN configmake.h GEN arpa/inet.h GEN fcntl.h GEN getopt.h GEN getopt-cdefs.h GEN langinfo.h GEN limits.h GEN locale.h GEN netdb.h GEN poll.h GEN pty.h GEN signal.h GEN stdint.h GEN stdio.h GEN stdlib.h GEN string.h GEN strings.h GEN sys/ioctl.h GEN sys/socket.h GEN sys/stat.h GEN sys/time.h GEN sys/types.h GEN sys/select.h GEN sys/uio.h GEN sys/utsname.h GEN sys/wait.h GEN termios.h GEN time.h GEN unistd.h GEN unitypes.h GEN uniwidth.h GEN wchar.h GEN wctype.h /usr/local/bin/gmake all-am gmake[3]: Entering directory '/usr<https://ci.centos.org/job/libvirt-build/systems=libvirt-freebsd-12/ws/build/gnulib/lib'> CC allocator.lo CC areadlink.lo CC base64.lo In file included from In file included from ../../../gnulib/lib/areadlink.cIn file included from :../../../gnulib/lib/allocator.c22../../../gnulib/lib/base64.c:: 2../../config.h: :../../config.h3244::324410::10 :fatal error : fatal error'config-post.h' file not found: 'config-post.h' file not found#include <config-post.h> #include <config-post.h> ^~~~~~~~~~~~~~~ ^~~~~~~~~~~~~~~: 42: ../../config.h:3244:10: fatal error: 'config-post.h' file not found #include <config-post.h> ^~~~~~~~~~~~~~~ 1 error generated. 1 error generated. gmake[3]: *** [Makefile:2633: allocator.lo] Error 1 gmake[3]: *** Waiting for unfinished jobs.... gmake[3]: *** [Makefile:2633: areadlink.lo] Error 1 1 error generated. gmake[3]: *** [Makefile:2633: base64.lo] Error 1 gmake[3]: Leaving directory '/usr<https://ci.centos.org/job/libvirt-build/systems=libvirt-freebsd-12/ws/build/gnulib/lib'> gmake[2]: *** [Makefile:2366: all] Error 2 gmake[2]: Leaving directory '/usr<https://ci.centos.org/job/libvirt-build/systems=libvirt-freebsd-12/ws/build/gnulib/lib'> gmake[1]: *** [Makefile:2130: all-recursive] Error 1 gmake[1]: Leaving directory '/usr<https://ci.centos.org/job/libvirt-build/systems=libvirt-freebsd-12/ws/build'> gmake: *** [Makefile:2023: all] Error 2 Build step 'Execute shell' marked build as failure

participants (1)
-
ci@centos.org