[Libvirt-ci] Build failed in Jenkins: libvirt-go-check » libvirt-fedora-rawhide #905

See <https://ci.centos.org/job/libvirt-go-check/systems=libvirt-fedora-rawhide/905/display/redirect> ------------------------------------------ Started by upstream project "libvirt-go-check" build number 905 originally caused by: Started by upstream project "libvirt-go-build" build number 919 originally caused by: Started by upstream project "libvirt-build" build number 1088 originally caused by: Started by an SCM change Running as SYSTEM [EnvInject] - Loading node environment variables. Building remotely on libvirt-fedora-rawhide (libvirt) in workspace <https://ci.centos.org/job/libvirt-go-check/systems=libvirt-fedora-rawhide/ws/> [libvirt-go] $ /bin/sh -xe /tmp/jenkins11253955005347995057.sh + export 'TEST_ARGS=-tags api' + TEST_ARGS='-tags api' + go test -tags api Missing enum 'VIR_DOMAIN_STATS_MEMORY' --- FAIL: TestAPICoverage (0.60s) panic: Missing symbols found [recovered] panic: Missing symbols found goroutine 7 [running]: testing.tRunner.func1(0xc0000a8100) /usr/lib/golang/src/testing/testing.go:874 +0x3a3 panic(0x5df9a0, 0x65c8f0) /usr/lib/golang/src/runtime/panic.go:679 +0x1b2 _<https://ci.centos.org/job/libvirt-go-check/systems=libvirt-fedora-rawhide/ws/.TestAPICoverage(0xc0000a8100)> <https://ci.centos.org/job/libvirt-go-check/systems=libvirt-fedora-rawhide/ws/api_test.go>:503 +0x551 testing.tRunner(0xc0000a8100, 0x635850) /usr/lib/golang/src/testing/testing.go:909 +0xc9 created by testing.(*T).Run /usr/lib/golang/src/testing/testing.go:960 +0x350 exit status 2 FAIL _<https://ci.centos.org/job/libvirt-go-check/systems=libvirt-fedora-rawhide/ws/> 0.758s Build step 'Execute shell' marked build as failure

See <https://ci.centos.org/job/libvirt-go-check/systems=libvirt-fedora-rawhide/906/display/redirect> ------------------------------------------ Started by upstream project "libvirt-go-check" build number 906 originally caused by: Started by upstream project "libvirt-go-build" build number 920 originally caused by: Started by upstream project "libvirt-build" build number 1093 originally caused by: Started by an SCM change Running as SYSTEM [EnvInject] - Loading node environment variables. Building remotely on libvirt-fedora-rawhide (libvirt) in workspace <https://ci.centos.org/job/libvirt-go-check/systems=libvirt-fedora-rawhide/ws/> [libvirt-go] $ /bin/sh -xe /tmp/jenkins17163789304667562192.sh + export 'TEST_ARGS=-tags api' + TEST_ARGS='-tags api' + go test -tags api Missing enum 'VIR_DOMAIN_STATS_MEMORY' --- FAIL: TestAPICoverage (1.76s) panic: Missing symbols found [recovered] panic: Missing symbols found goroutine 20 [running]: testing.tRunner.func1(0xc0000c0100) /usr/lib/golang/src/testing/testing.go:874 +0x3a3 panic(0x5df9a0, 0x65c8f0) /usr/lib/golang/src/runtime/panic.go:679 +0x1b2 _<https://ci.centos.org/job/libvirt-go-check/systems=libvirt-fedora-rawhide/ws/.TestAPICoverage(0xc0000c0100)> <https://ci.centos.org/job/libvirt-go-check/systems=libvirt-fedora-rawhide/ws/api_test.go>:503 +0x551 testing.tRunner(0xc0000c0100, 0x635850) /usr/lib/golang/src/testing/testing.go:909 +0xc9 created by testing.(*T).Run /usr/lib/golang/src/testing/testing.go:960 +0x350 exit status 2 FAIL _<https://ci.centos.org/job/libvirt-go-check/systems=libvirt-fedora-rawhide/ws/> 2.149s Build step 'Execute shell' marked build as failure

See <https://ci.centos.org/job/libvirt-go-check/systems=libvirt-fedora-rawhide/907/display/redirect> ------------------------------------------ Started by upstream project "libvirt-go-check" build number 907 originally caused by: Started by upstream project "libvirt-go-build" build number 921 originally caused by: Started by upstream project "libvirt-build" build number 1094 originally caused by: Started by an SCM change Running as SYSTEM [EnvInject] - Loading node environment variables. Building remotely on libvirt-fedora-rawhide (libvirt) in workspace <https://ci.centos.org/job/libvirt-go-check/systems=libvirt-fedora-rawhide/ws/> [libvirt-go] $ /bin/sh -xe /tmp/jenkins16704411643236286031.sh + export 'TEST_ARGS=-tags api' + TEST_ARGS='-tags api' + go test -tags api Missing enum 'VIR_DOMAIN_STATS_MEMORY' --- FAIL: TestAPICoverage (1.87s) panic: Missing symbols found [recovered] panic: Missing symbols found goroutine 7 [running]: testing.tRunner.func1(0xc0000a8100) /usr/lib/golang/src/testing/testing.go:874 +0x3a3 panic(0x5df9a0, 0x65c8f0) /usr/lib/golang/src/runtime/panic.go:679 +0x1b2 _<https://ci.centos.org/job/libvirt-go-check/systems=libvirt-fedora-rawhide/ws/.TestAPICoverage(0xc0000a8100)> <https://ci.centos.org/job/libvirt-go-check/systems=libvirt-fedora-rawhide/ws/api_test.go>:503 +0x551 testing.tRunner(0xc0000a8100, 0x635850) /usr/lib/golang/src/testing/testing.go:909 +0xc9 created by testing.(*T).Run /usr/lib/golang/src/testing/testing.go:960 +0x350 exit status 2 FAIL _<https://ci.centos.org/job/libvirt-go-check/systems=libvirt-fedora-rawhide/ws/> 2.250s Build step 'Execute shell' marked build as failure

See <https://ci.centos.org/job/libvirt-go-check/systems=libvirt-fedora-rawhide/908/display/redirect> ------------------------------------------ Started by upstream project "libvirt-go-check" build number 908 originally caused by: Started by upstream project "libvirt-go-build" build number 922 originally caused by: Started by upstream project "libvirt-build" build number 1095 originally caused by: Started by an SCM change Running as SYSTEM [EnvInject] - Loading node environment variables. Building remotely on libvirt-fedora-rawhide (libvirt) in workspace <https://ci.centos.org/job/libvirt-go-check/systems=libvirt-fedora-rawhide/ws/> [libvirt-go] $ /bin/sh -xe /tmp/jenkins13170565971285695594.sh + export 'TEST_ARGS=-tags api' + TEST_ARGS='-tags api' + go test -tags api Missing enum 'VIR_DOMAIN_STATS_MEMORY' --- FAIL: TestAPICoverage (1.77s) panic: Missing symbols found [recovered] panic: Missing symbols found goroutine 20 [running]: testing.tRunner.func1(0xc0000c0100) /usr/lib/golang/src/testing/testing.go:874 +0x3a3 panic(0x5df9a0, 0x65c8f0) /usr/lib/golang/src/runtime/panic.go:679 +0x1b2 _<https://ci.centos.org/job/libvirt-go-check/systems=libvirt-fedora-rawhide/ws/.TestAPICoverage(0xc0000c0100)> <https://ci.centos.org/job/libvirt-go-check/systems=libvirt-fedora-rawhide/ws/api_test.go>:503 +0x551 testing.tRunner(0xc0000c0100, 0x635850) /usr/lib/golang/src/testing/testing.go:909 +0xc9 created by testing.(*T).Run /usr/lib/golang/src/testing/testing.go:960 +0x350 exit status 2 FAIL _<https://ci.centos.org/job/libvirt-go-check/systems=libvirt-fedora-rawhide/ws/> 2.204s Build step 'Execute shell' marked build as failure

See <https://ci.centos.org/job/libvirt-go-check/systems=libvirt-fedora-rawhide/909/display/redirect> ------------------------------------------ Started by upstream project "libvirt-go-check" build number 909 originally caused by: Started by upstream project "libvirt-go-build" build number 923 originally caused by: Started by upstream project "libvirt-build" build number 1096 originally caused by: Started by an SCM change Running as SYSTEM [EnvInject] - Loading node environment variables. Building remotely on libvirt-fedora-rawhide (libvirt) in workspace <https://ci.centos.org/job/libvirt-go-check/systems=libvirt-fedora-rawhide/ws/> [libvirt-go] $ /bin/sh -xe /tmp/jenkins18109383953477009923.sh + export 'TEST_ARGS=-tags api' + TEST_ARGS='-tags api' + go test -tags api Missing enum 'VIR_DOMAIN_STATS_MEMORY' --- FAIL: TestAPICoverage (1.64s) panic: Missing symbols found [recovered] panic: Missing symbols found goroutine 7 [running]: testing.tRunner.func1(0xc0000a8100) /usr/lib/golang/src/testing/testing.go:874 +0x3a3 panic(0x5df9a0, 0x65c8f0) /usr/lib/golang/src/runtime/panic.go:679 +0x1b2 _<https://ci.centos.org/job/libvirt-go-check/systems=libvirt-fedora-rawhide/ws/.TestAPICoverage(0xc0000a8100)> <https://ci.centos.org/job/libvirt-go-check/systems=libvirt-fedora-rawhide/ws/api_test.go>:503 +0x551 testing.tRunner(0xc0000a8100, 0x635850) /usr/lib/golang/src/testing/testing.go:909 +0xc9 created by testing.(*T).Run /usr/lib/golang/src/testing/testing.go:960 +0x350 exit status 2 FAIL _<https://ci.centos.org/job/libvirt-go-check/systems=libvirt-fedora-rawhide/ws/> 1.955s Build step 'Execute shell' marked build as failure

See <https://ci.centos.org/job/libvirt-go-check/systems=libvirt-fedora-rawhide/910/display/redirect> ------------------------------------------ Started by upstream project "libvirt-go-check" build number 910 originally caused by: Started by upstream project "libvirt-go-build" build number 924 originally caused by: Started by upstream project "libvirt-build" build number 1097 originally caused by: Started by an SCM change Started by an SCM change Started by an SCM change Running as SYSTEM [EnvInject] - Loading node environment variables. Building remotely on libvirt-fedora-rawhide (libvirt) in workspace <https://ci.centos.org/job/libvirt-go-check/systems=libvirt-fedora-rawhide/ws/> [libvirt-go] $ /bin/sh -xe /tmp/jenkins6820679737626923024.sh + export 'TEST_ARGS=-tags api' + TEST_ARGS='-tags api' + go test -tags api Missing enum 'VIR_DOMAIN_STATS_MEMORY' --- FAIL: TestAPICoverage (2.22s) panic: Missing symbols found [recovered] panic: Missing symbols found goroutine 20 [running]: testing.tRunner.func1(0xc0000c0100) /usr/lib/golang/src/testing/testing.go:874 +0x3a3 panic(0x5df9a0, 0x65c8f0) /usr/lib/golang/src/runtime/panic.go:679 +0x1b2 _<https://ci.centos.org/job/libvirt-go-check/systems=libvirt-fedora-rawhide/ws/.TestAPICoverage(0xc0000c0100)> <https://ci.centos.org/job/libvirt-go-check/systems=libvirt-fedora-rawhide/ws/api_test.go>:503 +0x551 testing.tRunner(0xc0000c0100, 0x635850) /usr/lib/golang/src/testing/testing.go:909 +0xc9 created by testing.(*T).Run /usr/lib/golang/src/testing/testing.go:960 +0x350 exit status 2 FAIL _<https://ci.centos.org/job/libvirt-go-check/systems=libvirt-fedora-rawhide/ws/> 3.236s Build step 'Execute shell' marked build as failure

See <https://ci.centos.org/job/libvirt-go-check/systems=libvirt-fedora-rawhide/911/display/redirect> ------------------------------------------ Started by upstream project "libvirt-go-check" build number 911 originally caused by: Started by upstream project "libvirt-go-build" build number 925 originally caused by: Started by upstream project "libvirt-build" build number 1098 originally caused by: Started by an SCM change Started by an SCM change Started by an SCM change Running as SYSTEM [EnvInject] - Loading node environment variables. Building remotely on libvirt-fedora-rawhide (libvirt) in workspace <https://ci.centos.org/job/libvirt-go-check/systems=libvirt-fedora-rawhide/ws/> [libvirt-go] $ /bin/sh -xe /tmp/jenkins11145077926604680675.sh + export 'TEST_ARGS=-tags api' + TEST_ARGS='-tags api' + go test -tags api Missing enum 'VIR_DOMAIN_STATS_MEMORY' --- FAIL: TestAPICoverage (0.84s) panic: Missing symbols found [recovered] panic: Missing symbols found goroutine 7 [running]: testing.tRunner.func1(0xc0000a8100) /usr/lib/golang/src/testing/testing.go:874 +0x3a3 panic(0x5df9a0, 0x65c8f0) /usr/lib/golang/src/runtime/panic.go:679 +0x1b2 _<https://ci.centos.org/job/libvirt-go-check/systems=libvirt-fedora-rawhide/ws/.TestAPICoverage(0xc0000a8100)> <https://ci.centos.org/job/libvirt-go-check/systems=libvirt-fedora-rawhide/ws/api_test.go>:503 +0x551 testing.tRunner(0xc0000a8100, 0x635850) /usr/lib/golang/src/testing/testing.go:909 +0xc9 created by testing.(*T).Run /usr/lib/golang/src/testing/testing.go:960 +0x350 exit status 2 FAIL _<https://ci.centos.org/job/libvirt-go-check/systems=libvirt-fedora-rawhide/ws/> 1.095s Build step 'Execute shell' marked build as failure

See <https://ci.centos.org/job/libvirt-go-check/systems=libvirt-fedora-rawhide/912/display/redirect> ------------------------------------------ Started by upstream project "libvirt-go-check" build number 912 originally caused by: Started by upstream project "libvirt-go-build" build number 926 originally caused by: Started by upstream project "libvirt-build" build number 1099 originally caused by: Started by user Libvirt Running as SYSTEM [EnvInject] - Loading node environment variables. Building remotely on libvirt-fedora-rawhide (libvirt) in workspace <https://ci.centos.org/job/libvirt-go-check/systems=libvirt-fedora-rawhide/ws/> [libvirt-go] $ /bin/sh -xe /tmp/jenkins17054485431188571569.sh + export 'TEST_ARGS=-tags api' + TEST_ARGS='-tags api' + go test -tags api Missing enum 'VIR_DOMAIN_STATS_MEMORY' --- FAIL: TestAPICoverage (2.03s) panic: Missing symbols found [recovered] panic: Missing symbols found goroutine 20 [running]: testing.tRunner.func1(0xc0000c0100) /usr/lib/golang/src/testing/testing.go:874 +0x3a3 panic(0x5df9a0, 0x65c8f0) /usr/lib/golang/src/runtime/panic.go:679 +0x1b2 _<https://ci.centos.org/job/libvirt-go-check/systems=libvirt-fedora-rawhide/ws/.TestAPICoverage(0xc0000c0100)> <https://ci.centos.org/job/libvirt-go-check/systems=libvirt-fedora-rawhide/ws/api_test.go>:503 +0x551 testing.tRunner(0xc0000c0100, 0x635850) /usr/lib/golang/src/testing/testing.go:909 +0xc9 created by testing.(*T).Run /usr/lib/golang/src/testing/testing.go:960 +0x350 exit status 2 FAIL _<https://ci.centos.org/job/libvirt-go-check/systems=libvirt-fedora-rawhide/ws/> 2.565s Build step 'Execute shell' marked build as failure

participants (1)
-
ci@centos.org