libvirt | Pipeline #130424640 has failed for master | bf7454d1

Your pipeline has failed. Project: libvirt ( https://gitlab.com/libvirt/libvirt ) Branch: master ( https://gitlab.com/libvirt/libvirt/-/commits/master ) Commit: bf7454d1 ( https://gitlab.com/libvirt/libvirt/-/commit/bf7454d1458e690fb113f5dd4672e501... ) Commit Message: syntax-check.mk: Drop needless _src2 variable ... Commit Author: Michal Privoznik Pipeline #130424640 ( https://gitlab.com/libvirt/libvirt/pipelines/130424640 ) triggered by Libvirt Automatic Mirror ( https://gitlab.com/libvirt-mirror ) had 2 failed builds. Job #488587792 ( https://gitlab.com/libvirt/libvirt/-/jobs/488587792/raw ) Stage: cross_build Name: mingw32-fedora-30 Trace: CC util/libvirt_util_la-virauth.lo CC util/libvirt_util_la-virauthconfig.lo CC util/libvirt_util_la-virbitmap.lo CC util/libvirt_util_la-virbpf.lo CC util/libvirt_util_la-virbuffer.lo CC util/libvirt_util_la-virperf.lo CC util/libvirt_util_la-vircgroup.lo CC util/libvirt_util_la-vircgroupbackend.lo CC util/libvirt_util_la-vircgroupv1.lo CC util/libvirt_util_la-vircgroupv2.lo CC util/libvirt_util_la-vircgroupv2devices.lo CC util/libvirt_util_la-vircommand.lo CC util/libvirt_util_la-virconf.lo CC util/libvirt_util_la-vircrypto.lo CC util/libvirt_util_la-virdaemon.lo ../../src/util/virdaemon.c:25:10: fatal error: sys/wait.h: No such file or directory #include <sys/wait.h> ^~~~~~~~~~~~ compilation terminated. make[3]: *** [Makefile:10547: util/libvirt_util_la-virdaemon.lo] Error 1 make[3]: Leaving directory '/builds/libvirt/libvirt/build/src' make[2]: *** [Makefile:6418: all] Error 2 make[2]: Leaving directory '/builds/libvirt/libvirt/build/src' make[1]: *** [Makefile:777: all-recursive] Error 1 make[1]: Leaving directory '/builds/libvirt/libvirt/build' make: *** [Makefile:670: all] Error 2 section_end:1585324247:build_script [0Ksection_start:1585324247:after_script [0K[0K[36;1mRunning after_script[0;m [0;msection_end:1585324249:after_script [0Ksection_start:1585324249:upload_artifacts_on_failure [0K[0K[36;1mUploading artifacts for failed job[0;m [0;msection_end:1585324250:upload_artifacts_on_failure [0K[31;1mERROR: Job failed: exit code 1 [0;m Job #488587797 ( https://gitlab.com/libvirt/libvirt/-/jobs/488587797/raw ) Stage: cross_build Name: mingw64-fedora-30 Trace: CC util/libvirt_util_la-virauth.lo CC util/libvirt_util_la-virauthconfig.lo CC util/libvirt_util_la-virbitmap.lo CC util/libvirt_util_la-virbpf.lo CC util/libvirt_util_la-virbuffer.lo CC util/libvirt_util_la-virperf.lo CC util/libvirt_util_la-vircgroup.lo CC util/libvirt_util_la-vircgroupbackend.lo CC util/libvirt_util_la-vircgroupv1.lo CC util/libvirt_util_la-vircgroupv2.lo CC util/libvirt_util_la-vircgroupv2devices.lo CC util/libvirt_util_la-vircommand.lo CC util/libvirt_util_la-virconf.lo CC util/libvirt_util_la-vircrypto.lo CC util/libvirt_util_la-virdaemon.lo ../../src/util/virdaemon.c:25:10: fatal error: sys/wait.h: No such file or directory #include <sys/wait.h> ^~~~~~~~~~~~ compilation terminated. make[3]: *** [Makefile:10547: util/libvirt_util_la-virdaemon.lo] Error 1 make[3]: Leaving directory '/builds/libvirt/libvirt/build/src' make[2]: *** [Makefile:6418: all] Error 2 make[2]: Leaving directory '/builds/libvirt/libvirt/build/src' make[1]: *** [Makefile:777: all-recursive] Error 1 make[1]: Leaving directory '/builds/libvirt/libvirt/build' make: *** [Makefile:670: all] Error 2 section_end:1585324236:build_script [0Ksection_start:1585324236:after_script [0K[0K[36;1mRunning after_script[0;m [0;msection_end:1585324238:after_script [0Ksection_start:1585324238:upload_artifacts_on_failure [0K[0K[36;1mUploading artifacts for failed job[0;m [0;msection_end:1585324239:upload_artifacts_on_failure [0K[31;1mERROR: Job failed: exit code 1 [0;m -- You're receiving this email because of your account on gitlab.com.
participants (1)
-
GitLab