[Libvirt-ci] Build failed in Jenkins: libvirt-go-master-check » libvirt-centos-7 #1057

See <https://ci.centos.org/job/libvirt-go-master-check/systems=libvirt-centos-7/1057/display/redirect> ------------------------------------------ Started by upstream project "libvirt-go-master-check" build number 1057 originally caused by: Started by upstream project "libvirt-go-master-build" build number 1068 originally caused by: Started by upstream project "libvirt-master-build" build number 1465 originally caused by: Started by an SCM change [EnvInject] - Loading node environment variables. Building remotely on libvirt-centos-7 (libvirt) in workspace <https://ci.centos.org/job/libvirt-go-master-check/systems=libvirt-centos-7/ws/> [libvirt-go-master] $ /bin/sh -xe /tmp/jenkins6923934845873776702.sh + export 'TEST_ARGS=-tags api' + TEST_ARGS='-tags api' + go test -tags api 2018-05-28 12:26:16.679+0000: 22682: info : libvirt version: 4.4.0 2018-05-28 12:26:16.679+0000: 22682: info : hostname: libvirt-centos-7 2018-05-28 12:26:16.679+0000: 22682: warning : virEventRegisterImpl:245 : Ignoring attempt to replace registered event loop 2018-05-28 12:26:16.679+0000: 22682: warning : virEventRegisterImpl:245 : Ignoring attempt to replace registered event loop 2018-05-28 12:26:16.679+0000: 22682: warning : virEventRegisterImpl:245 : Ignoring attempt to replace registered event loop Missing function 'virDomainDetachDeviceAlias' --- FAIL: TestAPICoverage (0.72s) panic: Missing symbols found [recovered] panic: Missing symbols found goroutine 5 [running]: testing.tRunner.func1(0xc4200980f0) /usr/lib/golang/src/testing/testing.go:711 +0x2d2 panic(0x5b5e00, 0x61a360) /usr/lib/golang/src/runtime/panic.go:491 +0x283 _<https://ci.centos.org/job/libvirt-go-master-check/systems=libvirt-centos-7/ws/.TestAPICoverage(0xc4200980f0)> <https://ci.centos.org/job/libvirt-go-master-check/systems=libvirt-centos-7/ws/api_test.go>:504 +0x5b1 testing.tRunner(0xc4200980f0, 0x604ba8) /usr/lib/golang/src/testing/testing.go:746 +0xd0 created by testing.(*T).Run /usr/lib/golang/src/testing/testing.go:789 +0x2de exit status 2 FAIL _<https://ci.centos.org/job/libvirt-go-master-check/systems=libvirt-centos-7/ws/> 0.915s Build step 'Execute shell' marked build as failure

See <https://ci.centos.org/job/libvirt-go-master-check/systems=libvirt-centos-7/1058/display/redirect> ------------------------------------------ Started by upstream project "libvirt-go-master-check" build number 1058 originally caused by: Started by upstream project "libvirt-go-master-build" build number 1069 originally caused by: Started by upstream project "libvirt-master-build" build number 1466 originally caused by: Started by an SCM change [EnvInject] - Loading node environment variables. Building remotely on libvirt-centos-7 (libvirt) in workspace <https://ci.centos.org/job/libvirt-go-master-check/systems=libvirt-centos-7/ws/> [libvirt-go-master] $ /bin/sh -xe /tmp/jenkins2578824177973299942.sh + export 'TEST_ARGS=-tags api' + TEST_ARGS='-tags api' + go test -tags api 2018-05-28 15:26:30.524+0000: 17361: info : libvirt version: 4.4.0 2018-05-28 15:26:30.524+0000: 17361: info : hostname: libvirt-centos-7 2018-05-28 15:26:30.524+0000: 17361: warning : virEventRegisterImpl:245 : Ignoring attempt to replace registered event loop 2018-05-28 15:26:30.524+0000: 17361: warning : virEventRegisterImpl:245 : Ignoring attempt to replace registered event loop 2018-05-28 15:26:30.524+0000: 17361: warning : virEventRegisterImpl:245 : Ignoring attempt to replace registered event loop Missing function 'virConnectBaselineHypervisorCPU' Missing function 'virConnectCompareHypervisorCPU' Missing function 'virDomainDetachDeviceAlias' --- FAIL: TestAPICoverage (0.44s) panic: Missing symbols found [recovered] panic: Missing symbols found goroutine 5 [running]: testing.tRunner.func1(0xc4200980f0) /usr/lib/golang/src/testing/testing.go:711 +0x2d2 panic(0x5b5e00, 0x61a360) /usr/lib/golang/src/runtime/panic.go:491 +0x283 _<https://ci.centos.org/job/libvirt-go-master-check/systems=libvirt-centos-7/ws/.TestAPICoverage(0xc4200980f0)> <https://ci.centos.org/job/libvirt-go-master-check/systems=libvirt-centos-7/ws/api_test.go>:504 +0x5b1 testing.tRunner(0xc4200980f0, 0x604ba8) /usr/lib/golang/src/testing/testing.go:746 +0xd0 created by testing.(*T).Run /usr/lib/golang/src/testing/testing.go:789 +0x2de exit status 2 FAIL _<https://ci.centos.org/job/libvirt-go-master-check/systems=libvirt-centos-7/ws/> 0.524s Build step 'Execute shell' marked build as failure

See <https://ci.centos.org/job/libvirt-go-master-check/systems=libvirt-centos-7/1059/display/redirect> ------------------------------------------ Started by upstream project "libvirt-go-master-check" build number 1059 originally caused by: Started by upstream project "libvirt-go-master-build" build number 1070 originally caused by: Started by upstream project "libvirt-master-build" build number 1467 originally caused by: Started by an SCM change Started by an SCM change [EnvInject] - Loading node environment variables. Building remotely on libvirt-centos-7 (libvirt) in workspace <https://ci.centos.org/job/libvirt-go-master-check/systems=libvirt-centos-7/ws/> [libvirt-go-master] $ /bin/sh -xe /tmp/jenkins3154406157790173837.sh + export 'TEST_ARGS=-tags api' + TEST_ARGS='-tags api' + go test -tags api 2018-05-28 16:50:54.581+0000: 8214: info : libvirt version: 4.4.0 2018-05-28 16:50:54.581+0000: 8214: info : hostname: libvirt-centos-7 2018-05-28 16:50:54.581+0000: 8214: warning : virEventRegisterImpl:245 : Ignoring attempt to replace registered event loop 2018-05-28 16:50:54.581+0000: 8214: warning : virEventRegisterImpl:245 : Ignoring attempt to replace registered event loop 2018-05-28 16:50:54.581+0000: 8214: warning : virEventRegisterImpl:245 : Ignoring attempt to replace registered event loop Missing function 'virConnectBaselineHypervisorCPU' Missing function 'virConnectCompareHypervisorCPU' Missing function 'virDomainDetachDeviceAlias' --- FAIL: TestAPICoverage (0.30s) panic: Missing symbols found [recovered] panic: Missing symbols found goroutine 19 [running]: testing.tRunner.func1(0xc4200ae0f0) /usr/lib/golang/src/testing/testing.go:711 +0x2d2 panic(0x5b5e00, 0x61a360) /usr/lib/golang/src/runtime/panic.go:491 +0x283 _<https://ci.centos.org/job/libvirt-go-master-check/systems=libvirt-centos-7/ws/.TestAPICoverage(0xc4200ae0f0)> <https://ci.centos.org/job/libvirt-go-master-check/systems=libvirt-centos-7/ws/api_test.go>:504 +0x5b1 testing.tRunner(0xc4200ae0f0, 0x604ba8) /usr/lib/golang/src/testing/testing.go:746 +0xd0 created by testing.(*T).Run /usr/lib/golang/src/testing/testing.go:789 +0x2de exit status 2 FAIL _<https://ci.centos.org/job/libvirt-go-master-check/systems=libvirt-centos-7/ws/> 0.380s Build step 'Execute shell' marked build as failure

See <https://ci.centos.org/job/libvirt-go-master-check/systems=libvirt-centos-7/1060/display/redirect> ------------------------------------------ Started by upstream project "libvirt-go-master-check" build number 1060 originally caused by: Started by upstream project "libvirt-go-master-build" build number 1071 originally caused by: Started by upstream project "libvirt-master-build" build number 1468 originally caused by: Started by an SCM change [EnvInject] - Loading node environment variables. Building remotely on libvirt-centos-7 (libvirt) in workspace <https://ci.centos.org/job/libvirt-go-master-check/systems=libvirt-centos-7/ws/> [libvirt-go-master] $ /bin/sh -xe /tmp/jenkins3863576909274421598.sh + export 'TEST_ARGS=-tags api' + TEST_ARGS='-tags api' + go test -tags api 2018-05-29 09:48:05.101+0000: 24258: info : libvirt version: 4.4.0 2018-05-29 09:48:05.101+0000: 24258: info : hostname: libvirt-centos-7 2018-05-29 09:48:05.101+0000: 24258: warning : virEventRegisterImpl:245 : Ignoring attempt to replace registered event loop 2018-05-29 09:48:05.101+0000: 24258: warning : virEventRegisterImpl:245 : Ignoring attempt to replace registered event loop 2018-05-29 09:48:05.101+0000: 24258: warning : virEventRegisterImpl:245 : Ignoring attempt to replace registered event loop Missing function 'virConnectBaselineHypervisorCPU' Missing function 'virConnectCompareHypervisorCPU' Missing function 'virDomainDetachDeviceAlias' --- FAIL: TestAPICoverage (0.25s) panic: Missing symbols found [recovered] panic: Missing symbols found goroutine 5 [running]: testing.tRunner.func1(0xc4200980f0) /usr/lib/golang/src/testing/testing.go:711 +0x2d2 panic(0x5b5e00, 0x61a360) /usr/lib/golang/src/runtime/panic.go:491 +0x283 _<https://ci.centos.org/job/libvirt-go-master-check/systems=libvirt-centos-7/ws/.TestAPICoverage(0xc4200980f0)> <https://ci.centos.org/job/libvirt-go-master-check/systems=libvirt-centos-7/ws/api_test.go>:504 +0x5b1 testing.tRunner(0xc4200980f0, 0x604ba8) /usr/lib/golang/src/testing/testing.go:746 +0xd0 created by testing.(*T).Run /usr/lib/golang/src/testing/testing.go:789 +0x2de exit status 2 FAIL _<https://ci.centos.org/job/libvirt-go-master-check/systems=libvirt-centos-7/ws/> 0.305s Build step 'Execute shell' marked build as failure

See <https://ci.centos.org/job/libvirt-go-master-check/systems=libvirt-centos-7/1061/display/redirect> ------------------------------------------ Started by upstream project "libvirt-go-master-check" build number 1061 originally caused by: Started by upstream project "libvirt-go-master-build" build number 1072 originally caused by: Started by upstream project "libvirt-master-build" build number 1469 originally caused by: Started by an SCM change [EnvInject] - Loading node environment variables. Building remotely on libvirt-centos-7 (libvirt) in workspace <https://ci.centos.org/job/libvirt-go-master-check/systems=libvirt-centos-7/ws/> [libvirt-go-master] $ /bin/sh -xe /tmp/jenkins1200765283952121851.sh + export 'TEST_ARGS=-tags api' + TEST_ARGS='-tags api' + go test -tags api 2018-05-29 13:29:15.452+0000: 13900: info : libvirt version: 4.4.0 2018-05-29 13:29:15.452+0000: 13900: info : hostname: libvirt-centos-7 2018-05-29 13:29:15.452+0000: 13900: warning : virEventRegisterImpl:245 : Ignoring attempt to replace registered event loop 2018-05-29 13:29:15.452+0000: 13900: warning : virEventRegisterImpl:245 : Ignoring attempt to replace registered event loop 2018-05-29 13:29:15.452+0000: 13900: warning : virEventRegisterImpl:245 : Ignoring attempt to replace registered event loop Missing function 'virConnectBaselineHypervisorCPU' Missing function 'virConnectCompareHypervisorCPU' Missing function 'virDomainDetachDeviceAlias' --- FAIL: TestAPICoverage (0.35s) panic: Missing symbols found [recovered] panic: Missing symbols found goroutine 5 [running]: testing.tRunner.func1(0xc4200980f0) /usr/lib/golang/src/testing/testing.go:711 +0x2d2 panic(0x5b5e00, 0x61a360) /usr/lib/golang/src/runtime/panic.go:491 +0x283 _<https://ci.centos.org/job/libvirt-go-master-check/systems=libvirt-centos-7/ws/.TestAPICoverage(0xc4200980f0)> <https://ci.centos.org/job/libvirt-go-master-check/systems=libvirt-centos-7/ws/api_test.go>:504 +0x5b1 testing.tRunner(0xc4200980f0, 0x604ba8) /usr/lib/golang/src/testing/testing.go:746 +0xd0 created by testing.(*T).Run /usr/lib/golang/src/testing/testing.go:789 +0x2de exit status 2 FAIL _<https://ci.centos.org/job/libvirt-go-master-check/systems=libvirt-centos-7/ws/> 0.455s Build step 'Execute shell' marked build as failure

See <https://ci.centos.org/job/libvirt-go-master-check/systems=libvirt-centos-7/1062/display/redirect> ------------------------------------------ Started by upstream project "libvirt-go-master-check" build number 1062 originally caused by: Started by upstream project "libvirt-go-master-build" build number 1073 originally caused by: Started by upstream project "libvirt-master-build" build number 1470 originally caused by: Started by an SCM change [EnvInject] - Loading node environment variables. Building remotely on libvirt-centos-7 (libvirt) in workspace <https://ci.centos.org/job/libvirt-go-master-check/systems=libvirt-centos-7/ws/> [libvirt-go-master] $ /bin/sh -xe /tmp/jenkins384474929545928548.sh + export 'TEST_ARGS=-tags api' + TEST_ARGS='-tags api' + go test -tags api 2018-05-29 15:13:19.454+0000: 16231: info : libvirt version: 4.4.0 2018-05-29 15:13:19.454+0000: 16231: info : hostname: libvirt-centos-7 2018-05-29 15:13:19.454+0000: 16231: warning : virEventRegisterImpl:245 : Ignoring attempt to replace registered event loop 2018-05-29 15:13:19.454+0000: 16231: warning : virEventRegisterImpl:245 : Ignoring attempt to replace registered event loop 2018-05-29 15:13:19.454+0000: 16231: warning : virEventRegisterImpl:245 : Ignoring attempt to replace registered event loop Missing function 'virConnectBaselineHypervisorCPU' Missing function 'virConnectCompareHypervisorCPU' Missing function 'virDomainDetachDeviceAlias' --- FAIL: TestAPICoverage (0.44s) panic: Missing symbols found [recovered] panic: Missing symbols found goroutine 20 [running]: testing.tRunner.func1(0xc4200ae0f0) /usr/lib/golang/src/testing/testing.go:711 +0x2d2 panic(0x5b5e00, 0x61a360) /usr/lib/golang/src/runtime/panic.go:491 +0x283 _<https://ci.centos.org/job/libvirt-go-master-check/systems=libvirt-centos-7/ws/.TestAPICoverage(0xc4200ae0f0)> <https://ci.centos.org/job/libvirt-go-master-check/systems=libvirt-centos-7/ws/api_test.go>:504 +0x5b1 testing.tRunner(0xc4200ae0f0, 0x604ba8) /usr/lib/golang/src/testing/testing.go:746 +0xd0 created by testing.(*T).Run /usr/lib/golang/src/testing/testing.go:789 +0x2de exit status 2 FAIL _<https://ci.centos.org/job/libvirt-go-master-check/systems=libvirt-centos-7/ws/> 0.500s Build step 'Execute shell' marked build as failure

See <https://ci.centos.org/job/libvirt-go-master-check/systems=libvirt-centos-7/1063/display/redirect> ------------------------------------------ Started by upstream project "libvirt-go-master-check" build number 1063 originally caused by: Started by upstream project "libvirt-go-master-build" build number 1074 originally caused by: Started by upstream project "libvirt-master-build" build number 1471 originally caused by: Started by an SCM change Started by an SCM change [EnvInject] - Loading node environment variables. Building remotely on libvirt-centos-7 (libvirt) in workspace <https://ci.centos.org/job/libvirt-go-master-check/systems=libvirt-centos-7/ws/> [libvirt-go-master] $ /bin/sh -xe /tmp/jenkins3282119722428678916.sh + export 'TEST_ARGS=-tags api' + TEST_ARGS='-tags api' + go test -tags api 2018-05-29 16:09:57.741+0000: 27290: info : libvirt version: 4.4.0 2018-05-29 16:09:57.741+0000: 27290: info : hostname: libvirt-centos-7 2018-05-29 16:09:57.741+0000: 27290: warning : virEventRegisterImpl:245 : Ignoring attempt to replace registered event loop 2018-05-29 16:09:57.741+0000: 27290: warning : virEventRegisterImpl:245 : Ignoring attempt to replace registered event loop 2018-05-29 16:09:57.741+0000: 27290: warning : virEventRegisterImpl:245 : Ignoring attempt to replace registered event loop Missing function 'virConnectBaselineHypervisorCPU' Missing function 'virConnectCompareHypervisorCPU' Missing function 'virDomainDetachDeviceAlias' --- FAIL: TestAPICoverage (0.35s) panic: Missing symbols found [recovered] panic: Missing symbols found goroutine 5 [running]: testing.tRunner.func1(0xc4200980f0) /usr/lib/golang/src/testing/testing.go:711 +0x2d2 panic(0x5b5e00, 0x61a360) /usr/lib/golang/src/runtime/panic.go:491 +0x283 _<https://ci.centos.org/job/libvirt-go-master-check/systems=libvirt-centos-7/ws/.TestAPICoverage(0xc4200980f0)> <https://ci.centos.org/job/libvirt-go-master-check/systems=libvirt-centos-7/ws/api_test.go>:504 +0x5b1 testing.tRunner(0xc4200980f0, 0x604ba8) /usr/lib/golang/src/testing/testing.go:746 +0xd0 created by testing.(*T).Run /usr/lib/golang/src/testing/testing.go:789 +0x2de exit status 2 FAIL _<https://ci.centos.org/job/libvirt-go-master-check/systems=libvirt-centos-7/ws/> 0.564s Build step 'Execute shell' marked build as failure

See <https://ci.centos.org/job/libvirt-go-master-check/systems=libvirt-centos-7/1064/display/redirect> ------------------------------------------ Started by upstream project "libvirt-go-master-check" build number 1064 originally caused by: Started by upstream project "libvirt-go-master-build" build number 1075 originally caused by: Started by upstream project "libvirt-master-build" build number 1472 originally caused by: Started by an SCM change [EnvInject] - Loading node environment variables. Building remotely on libvirt-centos-7 (libvirt) in workspace <https://ci.centos.org/job/libvirt-go-master-check/systems=libvirt-centos-7/ws/> [libvirt-go-master] $ /bin/sh -xe /tmp/jenkins8343756541936646716.sh + export 'TEST_ARGS=-tags api' + TEST_ARGS='-tags api' + go test -tags api 2018-05-30 10:19:56.390+0000: 27991: info : libvirt version: 4.4.0 2018-05-30 10:19:56.390+0000: 27991: info : hostname: libvirt-centos-7 2018-05-30 10:19:56.390+0000: 27991: warning : virEventRegisterImpl:245 : Ignoring attempt to replace registered event loop 2018-05-30 10:19:56.390+0000: 27991: warning : virEventRegisterImpl:245 : Ignoring attempt to replace registered event loop 2018-05-30 10:19:56.390+0000: 27991: warning : virEventRegisterImpl:245 : Ignoring attempt to replace registered event loop Missing function 'virConnectBaselineHypervisorCPU' Missing function 'virConnectCompareHypervisorCPU' Missing function 'virDomainDetachDeviceAlias' --- FAIL: TestAPICoverage (0.28s) panic: Missing symbols found [recovered] panic: Missing symbols found goroutine 5 [running]: testing.tRunner.func1(0xc4200980f0) /usr/lib/golang/src/testing/testing.go:711 +0x2d2 panic(0x5b5e00, 0x61a360) /usr/lib/golang/src/runtime/panic.go:491 +0x283 _<https://ci.centos.org/job/libvirt-go-master-check/systems=libvirt-centos-7/ws/.TestAPICoverage(0xc4200980f0)> <https://ci.centos.org/job/libvirt-go-master-check/systems=libvirt-centos-7/ws/api_test.go>:504 +0x5b1 testing.tRunner(0xc4200980f0, 0x604ba8) /usr/lib/golang/src/testing/testing.go:746 +0xd0 created by testing.(*T).Run /usr/lib/golang/src/testing/testing.go:789 +0x2de exit status 2 FAIL _<https://ci.centos.org/job/libvirt-go-master-check/systems=libvirt-centos-7/ws/> 0.437s Build step 'Execute shell' marked build as failure

See <https://ci.centos.org/job/libvirt-go-master-check/systems=libvirt-centos-7/1065/display/redirect> ------------------------------------------ Started by upstream project "libvirt-go-master-check" build number 1065 originally caused by: Started by upstream project "libvirt-go-master-build" build number 1076 originally caused by: Started by upstream project "libvirt-master-build" build number 1473 originally caused by: Started by an SCM change [EnvInject] - Loading node environment variables. Building remotely on libvirt-centos-7 (libvirt) in workspace <https://ci.centos.org/job/libvirt-go-master-check/systems=libvirt-centos-7/ws/> [libvirt-go-master] $ /bin/sh -xe /tmp/jenkins2176361544739658037.sh + export 'TEST_ARGS=-tags api' + TEST_ARGS='-tags api' + go test -tags api 2018-05-30 14:50:37.696+0000: 11033: info : libvirt version: 4.4.0 2018-05-30 14:50:37.696+0000: 11033: info : hostname: libvirt-centos-7 2018-05-30 14:50:37.696+0000: 11033: warning : virEventRegisterImpl:245 : Ignoring attempt to replace registered event loop 2018-05-30 14:50:37.696+0000: 11033: warning : virEventRegisterImpl:245 : Ignoring attempt to replace registered event loop 2018-05-30 14:50:37.696+0000: 11033: warning : virEventRegisterImpl:245 : Ignoring attempt to replace registered event loop Missing function 'virConnectBaselineHypervisorCPU' Missing function 'virConnectCompareHypervisorCPU' Missing function 'virDomainDetachDeviceAlias' --- FAIL: TestAPICoverage (0.69s) panic: Missing symbols found [recovered] panic: Missing symbols found goroutine 5 [running]: testing.tRunner.func1(0xc4200980f0) /usr/lib/golang/src/testing/testing.go:711 +0x2d2 panic(0x5b5e00, 0x61a360) /usr/lib/golang/src/runtime/panic.go:491 +0x283 _<https://ci.centos.org/job/libvirt-go-master-check/systems=libvirt-centos-7/ws/.TestAPICoverage(0xc4200980f0)> <https://ci.centos.org/job/libvirt-go-master-check/systems=libvirt-centos-7/ws/api_test.go>:504 +0x5b1 testing.tRunner(0xc4200980f0, 0x604ba8) /usr/lib/golang/src/testing/testing.go:746 +0xd0 created by testing.(*T).Run /usr/lib/golang/src/testing/testing.go:789 +0x2de exit status 2 FAIL _<https://ci.centos.org/job/libvirt-go-master-check/systems=libvirt-centos-7/ws/> 0.880s Build step 'Execute shell' marked build as failure

See <https://ci.centos.org/job/libvirt-go-master-check/systems=libvirt-centos-7/1066/display/redirect> ------------------------------------------ Started by upstream project "libvirt-go-master-check" build number 1066 originally caused by: Started by upstream project "libvirt-go-master-build" build number 1077 originally caused by: Started by upstream project "libvirt-master-build" build number 1474 originally caused by: Started by an SCM change Started by an SCM change Started by an SCM change [EnvInject] - Loading node environment variables. Building remotely on libvirt-centos-7 (libvirt) in workspace <https://ci.centos.org/job/libvirt-go-master-check/systems=libvirt-centos-7/ws/> [libvirt-go-master] $ /bin/sh -xe /tmp/jenkins7994704761182537143.sh + export 'TEST_ARGS=-tags api' + TEST_ARGS='-tags api' + go test -tags api 2018-05-30 15:57:32.847+0000: 995: info : libvirt version: 4.4.0 2018-05-30 15:57:32.847+0000: 995: info : hostname: libvirt-centos-7 2018-05-30 15:57:32.847+0000: 995: warning : virEventRegisterImpl:245 : Ignoring attempt to replace registered event loop 2018-05-30 15:57:32.847+0000: 995: warning : virEventRegisterImpl:245 : Ignoring attempt to replace registered event loop 2018-05-30 15:57:32.847+0000: 995: warning : virEventRegisterImpl:245 : Ignoring attempt to replace registered event loop Missing function 'virConnectBaselineHypervisorCPU' Missing function 'virConnectCompareHypervisorCPU' Missing function 'virDomainDetachDeviceAlias' --- FAIL: TestAPICoverage (0.94s) panic: Missing symbols found [recovered] panic: Missing symbols found goroutine 5 [running]: testing.tRunner.func1(0xc4200980f0) /usr/lib/golang/src/testing/testing.go:711 +0x2d2 panic(0x5b5e00, 0x61a360) /usr/lib/golang/src/runtime/panic.go:491 +0x283 _<https://ci.centos.org/job/libvirt-go-master-check/systems=libvirt-centos-7/ws/.TestAPICoverage(0xc4200980f0)> <https://ci.centos.org/job/libvirt-go-master-check/systems=libvirt-centos-7/ws/api_test.go>:504 +0x5b1 testing.tRunner(0xc4200980f0, 0x604ba8) /usr/lib/golang/src/testing/testing.go:746 +0xd0 created by testing.(*T).Run /usr/lib/golang/src/testing/testing.go:789 +0x2de exit status 2 FAIL _<https://ci.centos.org/job/libvirt-go-master-check/systems=libvirt-centos-7/ws/> 1.046s Build step 'Execute shell' marked build as failure

See <https://ci.centos.org/job/libvirt-go-master-check/systems=libvirt-centos-7/1067/display/redirect> ------------------------------------------ Started by upstream project "libvirt-go-master-check" build number 1067 originally caused by: Started by upstream project "libvirt-go-master-build" build number 1078 originally caused by: Started by upstream project "libvirt-master-build" build number 1475 originally caused by: Started by an SCM change [EnvInject] - Loading node environment variables. Building remotely on libvirt-centos-7 (libvirt) in workspace <https://ci.centos.org/job/libvirt-go-master-check/systems=libvirt-centos-7/ws/> [libvirt-go-master] $ /bin/sh -xe /tmp/jenkins7507586110892303493.sh + export 'TEST_ARGS=-tags api' + TEST_ARGS='-tags api' + go test -tags api 2018-05-31 08:27:38.345+0000: 25241: info : libvirt version: 4.4.0 2018-05-31 08:27:38.345+0000: 25241: info : hostname: libvirt-centos-7 2018-05-31 08:27:38.345+0000: 25241: warning : virEventRegisterImpl:245 : Ignoring attempt to replace registered event loop 2018-05-31 08:27:38.345+0000: 25241: warning : virEventRegisterImpl:245 : Ignoring attempt to replace registered event loop 2018-05-31 08:27:38.345+0000: 25241: warning : virEventRegisterImpl:245 : Ignoring attempt to replace registered event loop Missing function 'virConnectBaselineHypervisorCPU' Missing function 'virConnectCompareHypervisorCPU' Missing function 'virDomainDetachDeviceAlias' --- FAIL: TestAPICoverage (0.56s) panic: Missing symbols found [recovered] panic: Missing symbols found goroutine 5 [running]: testing.tRunner.func1(0xc4200980f0) /usr/lib/golang/src/testing/testing.go:711 +0x2d2 panic(0x5b5e00, 0x61a360) /usr/lib/golang/src/runtime/panic.go:491 +0x283 _<https://ci.centos.org/job/libvirt-go-master-check/systems=libvirt-centos-7/ws/.TestAPICoverage(0xc4200980f0)> <https://ci.centos.org/job/libvirt-go-master-check/systems=libvirt-centos-7/ws/api_test.go>:504 +0x5b1 testing.tRunner(0xc4200980f0, 0x604ba8) /usr/lib/golang/src/testing/testing.go:746 +0xd0 created by testing.(*T).Run /usr/lib/golang/src/testing/testing.go:789 +0x2de exit status 2 FAIL _<https://ci.centos.org/job/libvirt-go-master-check/systems=libvirt-centos-7/ws/> 0.748s Build step 'Execute shell' marked build as failure

See <https://ci.centos.org/job/libvirt-go-master-check/systems=libvirt-centos-7/1068/display/redirect> ------------------------------------------ Started by upstream project "libvirt-go-master-check" build number 1068 originally caused by: Started by upstream project "libvirt-go-master-build" build number 1079 originally caused by: Started by upstream project "libvirt-master-build" build number 1476 originally caused by: Started by an SCM change [EnvInject] - Loading node environment variables. Building remotely on libvirt-centos-7 (libvirt) in workspace <https://ci.centos.org/job/libvirt-go-master-check/systems=libvirt-centos-7/ws/> [libvirt-go-master] $ /bin/sh -xe /tmp/jenkins4654263550261937099.sh + export 'TEST_ARGS=-tags api' + TEST_ARGS='-tags api' + go test -tags api 2018-05-31 10:29:12.666+0000: 13291: info : libvirt version: 4.4.0 2018-05-31 10:29:12.666+0000: 13291: info : hostname: libvirt-centos-7 2018-05-31 10:29:12.666+0000: 13291: warning : virEventRegisterImpl:245 : Ignoring attempt to replace registered event loop 2018-05-31 10:29:12.666+0000: 13291: warning : virEventRegisterImpl:245 : Ignoring attempt to replace registered event loop 2018-05-31 10:29:12.666+0000: 13291: warning : virEventRegisterImpl:245 : Ignoring attempt to replace registered event loop Missing function 'virConnectBaselineHypervisorCPU' Missing function 'virConnectCompareHypervisorCPU' Missing function 'virDomainDetachDeviceAlias' --- FAIL: TestAPICoverage (0.52s) panic: Missing symbols found [recovered] panic: Missing symbols found goroutine 5 [running]: testing.tRunner.func1(0xc4200980f0) /usr/lib/golang/src/testing/testing.go:711 +0x2d2 panic(0x5b5e00, 0x61a360) /usr/lib/golang/src/runtime/panic.go:491 +0x283 _<https://ci.centos.org/job/libvirt-go-master-check/systems=libvirt-centos-7/ws/.TestAPICoverage(0xc4200980f0)> <https://ci.centos.org/job/libvirt-go-master-check/systems=libvirt-centos-7/ws/api_test.go>:504 +0x5b1 testing.tRunner(0xc4200980f0, 0x604ba8) /usr/lib/golang/src/testing/testing.go:746 +0xd0 created by testing.(*T).Run /usr/lib/golang/src/testing/testing.go:789 +0x2de exit status 2 FAIL _<https://ci.centos.org/job/libvirt-go-master-check/systems=libvirt-centos-7/ws/> 0.622s Build step 'Execute shell' marked build as failure

See <https://ci.centos.org/job/libvirt-go-master-check/systems=libvirt-centos-7/1069/display/redirect> ------------------------------------------ Started by upstream project "libvirt-go-master-check" build number 1069 originally caused by: Started by upstream project "libvirt-go-master-build" build number 1080 originally caused by: Started by upstream project "libvirt-master-build" build number 1477 originally caused by: Started by an SCM change Started by an SCM change Started by an SCM change [EnvInject] - Loading node environment variables. Building remotely on libvirt-centos-7 (libvirt) in workspace <https://ci.centos.org/job/libvirt-go-master-check/systems=libvirt-centos-7/ws/> [libvirt-go-master] $ /bin/sh -xe /tmp/jenkins1735681745175351912.sh + export 'TEST_ARGS=-tags api' + TEST_ARGS='-tags api' + go test -tags api 2018-05-31 11:49:05.716+0000: 4388: info : libvirt version: 4.4.0 2018-05-31 11:49:05.716+0000: 4388: info : hostname: libvirt-centos-7 2018-05-31 11:49:05.716+0000: 4388: warning : virEventRegisterImpl:245 : Ignoring attempt to replace registered event loop 2018-05-31 11:49:05.716+0000: 4388: warning : virEventRegisterImpl:245 : Ignoring attempt to replace registered event loop 2018-05-31 11:49:05.716+0000: 4388: warning : virEventRegisterImpl:245 : Ignoring attempt to replace registered event loop Missing function 'virConnectBaselineHypervisorCPU' Missing function 'virConnectCompareHypervisorCPU' Missing function 'virDomainDetachDeviceAlias' --- FAIL: TestAPICoverage (0.75s) panic: Missing symbols found [recovered] panic: Missing symbols found goroutine 5 [running]: testing.tRunner.func1(0xc4200980f0) /usr/lib/golang/src/testing/testing.go:711 +0x2d2 panic(0x5b5e00, 0x61a360) /usr/lib/golang/src/runtime/panic.go:491 +0x283 _<https://ci.centos.org/job/libvirt-go-master-check/systems=libvirt-centos-7/ws/.TestAPICoverage(0xc4200980f0)> <https://ci.centos.org/job/libvirt-go-master-check/systems=libvirt-centos-7/ws/api_test.go>:504 +0x5b1 testing.tRunner(0xc4200980f0, 0x604ba8) /usr/lib/golang/src/testing/testing.go:746 +0xd0 created by testing.(*T).Run /usr/lib/golang/src/testing/testing.go:789 +0x2de exit status 2 FAIL _<https://ci.centos.org/job/libvirt-go-master-check/systems=libvirt-centos-7/ws/> 0.910s Build step 'Execute shell' marked build as failure

See <https://ci.centos.org/job/libvirt-go-master-check/systems=libvirt-centos-7/1070/display/redirect> ------------------------------------------ Started by upstream project "libvirt-go-master-check" build number 1070 originally caused by: Started by upstream project "libvirt-go-master-build" build number 1081 originally caused by: Started by upstream project "libvirt-master-build" build number 1478 originally caused by: Started by an SCM change [EnvInject] - Loading node environment variables. Building remotely on libvirt-centos-7 (libvirt) in workspace <https://ci.centos.org/job/libvirt-go-master-check/systems=libvirt-centos-7/ws/> [libvirt-go-master] $ /bin/sh -xe /tmp/jenkins7336397301834476600.sh + export 'TEST_ARGS=-tags api' + TEST_ARGS='-tags api' + go test -tags api 2018-05-31 14:19:15.130+0000: 24632: info : libvirt version: 4.4.0 2018-05-31 14:19:15.130+0000: 24632: info : hostname: libvirt-centos-7 2018-05-31 14:19:15.130+0000: 24632: warning : virEventRegisterImpl:245 : Ignoring attempt to replace registered event loop 2018-05-31 14:19:15.130+0000: 24632: warning : virEventRegisterImpl:245 : Ignoring attempt to replace registered event loop 2018-05-31 14:19:15.130+0000: 24632: warning : virEventRegisterImpl:245 : Ignoring attempt to replace registered event loop Missing function 'virConnectBaselineHypervisorCPU' Missing function 'virConnectCompareHypervisorCPU' Missing function 'virDomainDetachDeviceAlias' --- FAIL: TestAPICoverage (0.30s) panic: Missing symbols found [recovered] panic: Missing symbols found goroutine 5 [running]: testing.tRunner.func1(0xc4200980f0) /usr/lib/golang/src/testing/testing.go:711 +0x2d2 panic(0x5b5e00, 0x61a360) /usr/lib/golang/src/runtime/panic.go:491 +0x283 _<https://ci.centos.org/job/libvirt-go-master-check/systems=libvirt-centos-7/ws/.TestAPICoverage(0xc4200980f0)> <https://ci.centos.org/job/libvirt-go-master-check/systems=libvirt-centos-7/ws/api_test.go>:504 +0x5b1 testing.tRunner(0xc4200980f0, 0x604ba8) /usr/lib/golang/src/testing/testing.go:746 +0xd0 created by testing.(*T).Run /usr/lib/golang/src/testing/testing.go:789 +0x2de exit status 2 FAIL _<https://ci.centos.org/job/libvirt-go-master-check/systems=libvirt-centos-7/ws/> 0.359s Build step 'Execute shell' marked build as failure

See <https://ci.centos.org/job/libvirt-go-master-check/systems=libvirt-centos-7/1071/display/redirect> ------------------------------------------ Started by upstream project "libvirt-go-master-check" build number 1071 originally caused by: Started by upstream project "libvirt-go-master-build" build number 1082 originally caused by: Started by upstream project "libvirt-master-build" build number 1479 originally caused by: Started by an SCM change [EnvInject] - Loading node environment variables. Building remotely on libvirt-centos-7 (libvirt) in workspace <https://ci.centos.org/job/libvirt-go-master-check/systems=libvirt-centos-7/ws/> [libvirt-go-master] $ /bin/sh -xe /tmp/jenkins1950540465855682945.sh + export 'TEST_ARGS=-tags api' + TEST_ARGS='-tags api' + go test -tags api 2018-05-31 15:46:02.299+0000: 14029: info : libvirt version: 4.4.0 2018-05-31 15:46:02.299+0000: 14029: info : hostname: libvirt-centos-7 2018-05-31 15:46:02.299+0000: 14029: warning : virEventRegisterImpl:245 : Ignoring attempt to replace registered event loop 2018-05-31 15:46:02.299+0000: 14029: warning : virEventRegisterImpl:245 : Ignoring attempt to replace registered event loop 2018-05-31 15:46:02.299+0000: 14029: warning : virEventRegisterImpl:245 : Ignoring attempt to replace registered event loop Missing function 'virConnectBaselineHypervisorCPU' Missing function 'virConnectCompareHypervisorCPU' Missing function 'virDomainDetachDeviceAlias' --- FAIL: TestAPICoverage (0.24s) panic: Missing symbols found [recovered] panic: Missing symbols found goroutine 19 [running]: testing.tRunner.func1(0xc4200ae0f0) /usr/lib/golang/src/testing/testing.go:711 +0x2d2 panic(0x5b5e00, 0x61a360) /usr/lib/golang/src/runtime/panic.go:491 +0x283 _<https://ci.centos.org/job/libvirt-go-master-check/systems=libvirt-centos-7/ws/.TestAPICoverage(0xc4200ae0f0)> <https://ci.centos.org/job/libvirt-go-master-check/systems=libvirt-centos-7/ws/api_test.go>:504 +0x5b1 testing.tRunner(0xc4200ae0f0, 0x604ba8) /usr/lib/golang/src/testing/testing.go:746 +0xd0 created by testing.(*T).Run /usr/lib/golang/src/testing/testing.go:789 +0x2de exit status 2 FAIL _<https://ci.centos.org/job/libvirt-go-master-check/systems=libvirt-centos-7/ws/> 0.308s Build step 'Execute shell' marked build as failure

See <https://ci.centos.org/job/libvirt-go-master-check/systems=libvirt-centos-7/1072/display/redirect> ------------------------------------------ Started by upstream project "libvirt-go-master-check" build number 1072 originally caused by: Started by upstream project "libvirt-go-master-build" build number 1083 originally caused by: Started by upstream project "libvirt-master-build" build number 1480 originally caused by: Started by an SCM change [EnvInject] - Loading node environment variables. Building remotely on libvirt-centos-7 (libvirt) in workspace <https://ci.centos.org/job/libvirt-go-master-check/systems=libvirt-centos-7/ws/> [libvirt-go-master] $ /bin/sh -xe /tmp/jenkins6231152547765468905.sh + export 'TEST_ARGS=-tags api' + TEST_ARGS='-tags api' + go test -tags api 2018-06-01 12:39:21.524+0000: 14545: info : libvirt version: 4.4.0 2018-06-01 12:39:21.524+0000: 14545: info : hostname: libvirt-centos-7 2018-06-01 12:39:21.524+0000: 14545: warning : virEventRegisterImpl:245 : Ignoring attempt to replace registered event loop 2018-06-01 12:39:21.525+0000: 14545: warning : virEventRegisterImpl:245 : Ignoring attempt to replace registered event loop 2018-06-01 12:39:21.525+0000: 14545: warning : virEventRegisterImpl:245 : Ignoring attempt to replace registered event loop Missing function 'virConnectBaselineHypervisorCPU' Missing function 'virConnectCompareHypervisorCPU' Missing function 'virDomainDetachDeviceAlias' --- FAIL: TestAPICoverage (0.75s) panic: Missing symbols found [recovered] panic: Missing symbols found goroutine 5 [running]: testing.tRunner.func1(0xc4200980f0) /usr/lib/golang/src/testing/testing.go:711 +0x2d2 panic(0x5b5e00, 0x61a360) /usr/lib/golang/src/runtime/panic.go:491 +0x283 _<https://ci.centos.org/job/libvirt-go-master-check/systems=libvirt-centos-7/ws/.TestAPICoverage(0xc4200980f0)> <https://ci.centos.org/job/libvirt-go-master-check/systems=libvirt-centos-7/ws/api_test.go>:504 +0x5b1 testing.tRunner(0xc4200980f0, 0x604ba8) /usr/lib/golang/src/testing/testing.go:746 +0xd0 created by testing.(*T).Run /usr/lib/golang/src/testing/testing.go:789 +0x2de exit status 2 FAIL _<https://ci.centos.org/job/libvirt-go-master-check/systems=libvirt-centos-7/ws/> 0.903s Build step 'Execute shell' marked build as failure

See <https://ci.centos.org/job/libvirt-go-master-check/systems=libvirt-centos-7/1073/display/redirect> ------------------------------------------ Started by upstream project "libvirt-go-master-check" build number 1073 originally caused by: Started by upstream project "libvirt-go-master-build" build number 1084 originally caused by: Started by upstream project "libvirt-master-build" build number 1481 originally caused by: Started by an SCM change Started by an SCM change [EnvInject] - Loading node environment variables. Building remotely on libvirt-centos-7 (libvirt) in workspace <https://ci.centos.org/job/libvirt-go-master-check/systems=libvirt-centos-7/ws/> [libvirt-go-master] $ /bin/sh -xe /tmp/jenkins2121980883674518067.sh + export 'TEST_ARGS=-tags api' + TEST_ARGS='-tags api' + go test -tags api 2018-06-01 13:58:36.579+0000: 14928: info : libvirt version: 4.4.0 2018-06-01 13:58:36.579+0000: 14928: info : hostname: libvirt-centos-7 2018-06-01 13:58:36.579+0000: 14928: warning : virEventRegisterImpl:245 : Ignoring attempt to replace registered event loop 2018-06-01 13:58:36.579+0000: 14928: warning : virEventRegisterImpl:245 : Ignoring attempt to replace registered event loop 2018-06-01 13:58:36.579+0000: 14928: warning : virEventRegisterImpl:245 : Ignoring attempt to replace registered event loop Missing function 'virConnectBaselineHypervisorCPU' Missing function 'virConnectCompareHypervisorCPU' Missing function 'virDomainDetachDeviceAlias' --- FAIL: TestAPICoverage (0.58s) panic: Missing symbols found [recovered] panic: Missing symbols found goroutine 5 [running]: testing.tRunner.func1(0xc4200980f0) /usr/lib/golang/src/testing/testing.go:711 +0x2d2 panic(0x5b5e00, 0x61a360) /usr/lib/golang/src/runtime/panic.go:491 +0x283 _<https://ci.centos.org/job/libvirt-go-master-check/systems=libvirt-centos-7/ws/.TestAPICoverage(0xc4200980f0)> <https://ci.centos.org/job/libvirt-go-master-check/systems=libvirt-centos-7/ws/api_test.go>:504 +0x5b1 testing.tRunner(0xc4200980f0, 0x604ba8) /usr/lib/golang/src/testing/testing.go:746 +0xd0 created by testing.(*T).Run /usr/lib/golang/src/testing/testing.go:789 +0x2de exit status 2 FAIL _<https://ci.centos.org/job/libvirt-go-master-check/systems=libvirt-centos-7/ws/> 0.657s Build step 'Execute shell' marked build as failure

See <https://ci.centos.org/job/libvirt-go-master-check/systems=libvirt-centos-7/1074/display/redirect> ------------------------------------------ Started by upstream project "libvirt-go-master-check" build number 1074 originally caused by: Started by upstream project "libvirt-go-master-build" build number 1085 originally caused by: Started by upstream project "libvirt-master-build" build number 1482 originally caused by: Started by an SCM change [EnvInject] - Loading node environment variables. Building remotely on libvirt-centos-7 (libvirt) in workspace <https://ci.centos.org/job/libvirt-go-master-check/systems=libvirt-centos-7/ws/> [libvirt-go-master] $ /bin/sh -xe /tmp/jenkins4403015126451447836.sh + export 'TEST_ARGS=-tags api' + TEST_ARGS='-tags api' + go test -tags api 2018-06-01 16:31:04.609+0000: 25945: info : libvirt version: 4.4.0 2018-06-01 16:31:04.609+0000: 25945: info : hostname: libvirt-centos-7 2018-06-01 16:31:04.609+0000: 25945: warning : virEventRegisterImpl:245 : Ignoring attempt to replace registered event loop 2018-06-01 16:31:04.609+0000: 25945: warning : virEventRegisterImpl:245 : Ignoring attempt to replace registered event loop 2018-06-01 16:31:04.609+0000: 25945: warning : virEventRegisterImpl:245 : Ignoring attempt to replace registered event loop Missing function 'virConnectBaselineHypervisorCPU' Missing function 'virConnectCompareHypervisorCPU' Missing function 'virDomainDetachDeviceAlias' --- FAIL: TestAPICoverage (0.56s) panic: Missing symbols found [recovered] panic: Missing symbols found goroutine 5 [running]: testing.tRunner.func1(0xc4200980f0) /usr/lib/golang/src/testing/testing.go:711 +0x2d2 panic(0x5b5e00, 0x61a360) /usr/lib/golang/src/runtime/panic.go:491 +0x283 _<https://ci.centos.org/job/libvirt-go-master-check/systems=libvirt-centos-7/ws/.TestAPICoverage(0xc4200980f0)> <https://ci.centos.org/job/libvirt-go-master-check/systems=libvirt-centos-7/ws/api_test.go>:504 +0x5b1 testing.tRunner(0xc4200980f0, 0x604ba8) /usr/lib/golang/src/testing/testing.go:746 +0xd0 created by testing.(*T).Run /usr/lib/golang/src/testing/testing.go:789 +0x2de exit status 2 FAIL _<https://ci.centos.org/job/libvirt-go-master-check/systems=libvirt-centos-7/ws/> 0.702s Build step 'Execute shell' marked build as failure

participants (1)
-
ci@centos.org