Build failed in Jenkins: libvirt-go-xml-check » libvirt-debian-9 #959

See <https://ci.centos.org/job/libvirt-go-xml-check/systems=libvirt-debian-9/959/display/redirect> ------------------------------------------ Started by upstream project "libvirt-go-xml-check" build number 959 originally caused by: Started by upstream project "libvirt-go-xml-build" build number 962 originally caused by: Started by upstream project "libvirt-build" build number 1127 originally caused by: Started by an SCM change Started by an SCM change Running as SYSTEM [EnvInject] - Loading node environment variables. Building remotely on libvirt-debian-9 (libvirt) in workspace <https://ci.centos.org/job/libvirt-go-xml-check/systems=libvirt-debian-9/ws/> [libvirt-go-xml] $ /bin/sh -xe /tmp/jenkins4935674203140875132.sh + export TEST_ARGS=-tags xmlroundtrip + go test -tags xmlroundtrip --- FAIL: TestRoundTrip (64.44s) xml_test.go:374: testdata/libvirt/tests/qemuxml2argvdata/virtio-rng-builtin.xml: /domain[0]/devices[0]/rng[0]/backend[0]: element in expected XML missing in actual XML FAIL exit status 1 FAIL _<https://ci.centos.org/job/libvirt-go-xml-check/systems=libvirt-debian-9/ws/> 64.552s Build step 'Execute shell' marked build as failure

See <https://ci.centos.org/job/libvirt-go-xml-check/systems=libvirt-debian-9/960/display/redirect> ------------------------------------------ Started by upstream project "libvirt-go-xml-check" build number 960 originally caused by: Started by upstream project "libvirt-go-xml-build" build number 963 originally caused by: Started by upstream project "libvirt-build" build number 1128 originally caused by: Started by an SCM change Running as SYSTEM [EnvInject] - Loading node environment variables. Building remotely on libvirt-debian-9 (libvirt) in workspace <https://ci.centos.org/job/libvirt-go-xml-check/systems=libvirt-debian-9/ws/> [libvirt-go-xml] $ /bin/sh -xe /tmp/jenkins2559186940289514796.sh + export TEST_ARGS=-tags xmlroundtrip + go test -tags xmlroundtrip --- FAIL: TestRoundTrip (29.36s) xml_test.go:374: testdata/libvirt/tests/qemuxml2argvdata/virtio-rng-builtin.xml: /domain[0]/devices[0]/rng[0]/backend[0]: element in expected XML missing in actual XML FAIL exit status 1 FAIL _<https://ci.centos.org/job/libvirt-go-xml-check/systems=libvirt-debian-9/ws/> 29.474s Build step 'Execute shell' marked build as failure

See <https://ci.centos.org/job/libvirt-go-xml-check/systems=libvirt-debian-9/961/display/redirect> ------------------------------------------ Started by upstream project "libvirt-go-xml-check" build number 961 originally caused by: Started by upstream project "libvirt-go-xml-build" build number 964 originally caused by: Started by upstream project "libvirt-build" build number 1131 originally caused by: Started by an SCM change Running as SYSTEM [EnvInject] - Loading node environment variables. Building remotely on libvirt-debian-9 (libvirt) in workspace <https://ci.centos.org/job/libvirt-go-xml-check/systems=libvirt-debian-9/ws/> [libvirt-go-xml] $ /bin/sh -xe /tmp/jenkins1247894523478725849.sh + export TEST_ARGS=-tags xmlroundtrip + go test -tags xmlroundtrip --- FAIL: TestRoundTrip (65.08s) xml_test.go:374: testdata/libvirt/tests/qemuxml2argvdata/virtio-rng-builtin.xml: /domain[0]/devices[0]/rng[0]/backend[0]: element in expected XML missing in actual XML FAIL exit status 1 FAIL _<https://ci.centos.org/job/libvirt-go-xml-check/systems=libvirt-debian-9/ws/> 65.210s Build step 'Execute shell' marked build as failure

See <https://ci.centos.org/job/libvirt-go-xml-check/systems=libvirt-debian-9/962/display/redirect> ------------------------------------------ Started by upstream project "libvirt-go-xml-check" build number 962 originally caused by: Started by upstream project "libvirt-go-xml-build" build number 965 originally caused by: Started by upstream project "libvirt-build" build number 1132 originally caused by: Started by an SCM change Started by an SCM change Started by an SCM change Started by an SCM change Running as SYSTEM [EnvInject] - Loading node environment variables. Building remotely on libvirt-debian-9 (libvirt) in workspace <https://ci.centos.org/job/libvirt-go-xml-check/systems=libvirt-debian-9/ws/> [libvirt-go-xml] $ /bin/sh -xe /tmp/jenkins4521908249779871250.sh + export TEST_ARGS=-tags xmlroundtrip + go test -tags xmlroundtrip --- FAIL: TestRoundTrip (58.27s) xml_test.go:374: testdata/libvirt/tests/qemuxml2argvdata/virtio-rng-builtin.xml: /domain[0]/devices[0]/rng[0]/backend[0]: element in expected XML missing in actual XML FAIL exit status 1 FAIL _<https://ci.centos.org/job/libvirt-go-xml-check/systems=libvirt-debian-9/ws/> 58.524s Build step 'Execute shell' marked build as failure

See <https://ci.centos.org/job/libvirt-go-xml-check/systems=libvirt-debian-9/963/display/redirect> ------------------------------------------ Started by upstream project "libvirt-go-xml-check" build number 963 originally caused by: Started by upstream project "libvirt-go-xml-build" build number 966 originally caused by: Started by upstream project "libvirt-build" build number 1133 originally caused by: Started by an SCM change Running as SYSTEM [EnvInject] - Loading node environment variables. Building remotely on libvirt-debian-9 (libvirt) in workspace <https://ci.centos.org/job/libvirt-go-xml-check/systems=libvirt-debian-9/ws/> [libvirt-go-xml] $ /bin/sh -xe /tmp/jenkins6153609228701143029.sh + export TEST_ARGS=-tags xmlroundtrip + go test -tags xmlroundtrip --- FAIL: TestRoundTrip (60.47s) xml_test.go:374: testdata/libvirt/tests/qemuxml2argvdata/virtio-rng-builtin.xml: /domain[0]/devices[0]/rng[0]/backend[0]: element in expected XML missing in actual XML FAIL exit status 1 FAIL _<https://ci.centos.org/job/libvirt-go-xml-check/systems=libvirt-debian-9/ws/> 60.644s Build step 'Execute shell' marked build as failure

participants (1)
-
ci@centos.org