[Libvirt-ci] Build failed in Jenkins: libvirt-go-check » libvirt-fedora-29 #231

See <https://ci.centos.org/job/libvirt-go-check/systems=libvirt-fedora-29/231/display/redirect> ------------------------------------------ Started by upstream project "libvirt-go-check" build number 231 originally caused by: Started by upstream project "libvirt-go-build" build number 235 originally caused by: Started by upstream project "libvirt-build" build number 295 originally caused by: Started by an SCM change Started by an SCM change Started by an SCM change Started by an SCM change [EnvInject] - Loading node environment variables. Building remotely on libvirt-fedora-29 (libvirt) in workspace <https://ci.centos.org/job/libvirt-go-check/systems=libvirt-fedora-29/ws/> [libvirt-go] $ /bin/sh -xe /tmp/jenkins796538148403292592.sh + export 'TEST_ARGS=-tags api' + TEST_ARGS='-tags api' + go test -tags api Missing macro 'VIR_MIGRATE_PARAM_BANDWIDTH_POSTCOPY' Missing enum 'VIR_DOMAIN_MIGRATE_MAX_SPEED_POSTCOPY' --- FAIL: TestAPICoverage (0.90s) panic: Missing symbols found [recovered] panic: Missing symbols found goroutine 5 [running]: testing.tRunner.func1(0xc0000a8100) /usr/lib/golang/src/testing/testing.go:792 +0x387 panic(0x5cca80, 0x639c80) /usr/lib/golang/src/runtime/panic.go:513 +0x1b9 _<https://ci.centos.org/job/libvirt-go-check/systems=libvirt-fedora-29/ws/.TestAPICoverage(0xc0000a8100)> <https://ci.centos.org/job/libvirt-go-check/systems=libvirt-fedora-29/ws/api_test.go>:501 +0x554 testing.tRunner(0xc0000a8100, 0x61b0e8) /usr/lib/golang/src/testing/testing.go:827 +0xbf created by testing.(*T).Run /usr/lib/golang/src/testing/testing.go:878 +0x35c exit status 2 FAIL _<https://ci.centos.org/job/libvirt-go-check/systems=libvirt-fedora-29/ws/> 1.177s Build step 'Execute shell' marked build as failure

See <https://ci.centos.org/job/libvirt-go-check/systems=libvirt-fedora-29/232/display/redirect> ------------------------------------------ Started by upstream project "libvirt-go-check" build number 232 originally caused by: Started by upstream project "libvirt-go-build" build number 236 originally caused by: Started by upstream project "libvirt-build" build number 296 originally caused by: Started by an SCM change [EnvInject] - Loading node environment variables. Building remotely on libvirt-fedora-29 (libvirt) in workspace <https://ci.centos.org/job/libvirt-go-check/systems=libvirt-fedora-29/ws/> [libvirt-go] $ /bin/sh -xe /tmp/jenkins8082806197253504816.sh + export 'TEST_ARGS=-tags api' + TEST_ARGS='-tags api' + go test -tags api Missing macro 'VIR_MIGRATE_PARAM_BANDWIDTH_POSTCOPY' Missing enum 'VIR_DOMAIN_MIGRATE_MAX_SPEED_POSTCOPY' --- FAIL: TestAPICoverage (1.28s) panic: Missing symbols found [recovered] panic: Missing symbols found goroutine 19 [running]: testing.tRunner.func1(0xc0000c2100) /usr/lib/golang/src/testing/testing.go:792 +0x387 panic(0x5cca80, 0x639c80) /usr/lib/golang/src/runtime/panic.go:513 +0x1b9 _<https://ci.centos.org/job/libvirt-go-check/systems=libvirt-fedora-29/ws/.TestAPICoverage(0xc0000c2100)> <https://ci.centos.org/job/libvirt-go-check/systems=libvirt-fedora-29/ws/api_test.go>:501 +0x554 testing.tRunner(0xc0000c2100, 0x61b0e8) /usr/lib/golang/src/testing/testing.go:827 +0xbf created by testing.(*T).Run /usr/lib/golang/src/testing/testing.go:878 +0x35c exit status 2 FAIL _<https://ci.centos.org/job/libvirt-go-check/systems=libvirt-fedora-29/ws/> 1.565s Build step 'Execute shell' marked build as failure

See <https://ci.centos.org/job/libvirt-go-check/systems=libvirt-fedora-29/233/display/redirect> ------------------------------------------ Started by upstream project "libvirt-go-check" build number 233 originally caused by: Started by upstream project "libvirt-go-build" build number 237 originally caused by: Started by upstream project "libvirt-build" build number 297 originally caused by: Started by an SCM change [EnvInject] - Loading node environment variables. Building remotely on libvirt-fedora-29 (libvirt) in workspace <https://ci.centos.org/job/libvirt-go-check/systems=libvirt-fedora-29/ws/> [libvirt-go] $ /bin/sh -xe /tmp/jenkins5077294104811423452.sh + export 'TEST_ARGS=-tags api' + TEST_ARGS='-tags api' + go test -tags api Missing macro 'VIR_MIGRATE_PARAM_BANDWIDTH_POSTCOPY' Missing enum 'VIR_DOMAIN_MIGRATE_MAX_SPEED_POSTCOPY' --- FAIL: TestAPICoverage (0.44s) panic: Missing symbols found [recovered] panic: Missing symbols found goroutine 5 [running]: testing.tRunner.func1(0xc0000a8100) /usr/lib/golang/src/testing/testing.go:792 +0x387 panic(0x5cca80, 0x639c80) /usr/lib/golang/src/runtime/panic.go:513 +0x1b9 _<https://ci.centos.org/job/libvirt-go-check/systems=libvirt-fedora-29/ws/.TestAPICoverage(0xc0000a8100)> <https://ci.centos.org/job/libvirt-go-check/systems=libvirt-fedora-29/ws/api_test.go>:501 +0x554 testing.tRunner(0xc0000a8100, 0x61b0e8) /usr/lib/golang/src/testing/testing.go:827 +0xbf created by testing.(*T).Run /usr/lib/golang/src/testing/testing.go:878 +0x35c exit status 2 FAIL _<https://ci.centos.org/job/libvirt-go-check/systems=libvirt-fedora-29/ws/> 0.553s Build step 'Execute shell' marked build as failure

See <https://ci.centos.org/job/libvirt-go-check/systems=libvirt-fedora-29/234/display/redirect> ------------------------------------------ Started by upstream project "libvirt-go-check" build number 234 originally caused by: Started by upstream project "libvirt-go-build" build number 238 originally caused by: Started by upstream project "libvirt-build" build number 298 originally caused by: Started by an SCM change Started by an SCM change Started by an SCM change Started by an SCM change Started by an SCM change Started by an SCM change [EnvInject] - Loading node environment variables. Building remotely on libvirt-fedora-29 (libvirt) in workspace <https://ci.centos.org/job/libvirt-go-check/systems=libvirt-fedora-29/ws/> [libvirt-go] $ /bin/sh -xe /tmp/jenkins1236737029585080508.sh + export 'TEST_ARGS=-tags api' + TEST_ARGS='-tags api' + go test -tags api Missing macro 'VIR_MIGRATE_PARAM_BANDWIDTH_POSTCOPY' Missing enum 'VIR_DOMAIN_MIGRATE_MAX_SPEED_POSTCOPY' --- FAIL: TestAPICoverage (0.86s) panic: Missing symbols found [recovered] panic: Missing symbols found goroutine 19 [running]: testing.tRunner.func1(0xc0000c2100) /usr/lib/golang/src/testing/testing.go:792 +0x387 panic(0x5cca80, 0x639c80) /usr/lib/golang/src/runtime/panic.go:513 +0x1b9 _<https://ci.centos.org/job/libvirt-go-check/systems=libvirt-fedora-29/ws/.TestAPICoverage(0xc0000c2100)> <https://ci.centos.org/job/libvirt-go-check/systems=libvirt-fedora-29/ws/api_test.go>:501 +0x554 testing.tRunner(0xc0000c2100, 0x61b0e8) /usr/lib/golang/src/testing/testing.go:827 +0xbf created by testing.(*T).Run /usr/lib/golang/src/testing/testing.go:878 +0x35c exit status 2 FAIL _<https://ci.centos.org/job/libvirt-go-check/systems=libvirt-fedora-29/ws/> 1.111s Build step 'Execute shell' marked build as failure

See <https://ci.centos.org/job/libvirt-go-check/systems=libvirt-fedora-29/235/display/redirect> ------------------------------------------ Started by upstream project "libvirt-go-check" build number 235 originally caused by: Started by upstream project "libvirt-go-build" build number 239 originally caused by: Started by upstream project "libvirt-build" build number 299 originally caused by: Started by an SCM change Started by an SCM change Started by an SCM change Started by an SCM change Started by an SCM change [EnvInject] - Loading node environment variables. Building remotely on libvirt-fedora-29 (libvirt) in workspace <https://ci.centos.org/job/libvirt-go-check/systems=libvirt-fedora-29/ws/> [libvirt-go] $ /bin/sh -xe /tmp/jenkins2472603279389055669.sh + export 'TEST_ARGS=-tags api' + TEST_ARGS='-tags api' + go test -tags api Missing macro 'VIR_MIGRATE_PARAM_BANDWIDTH_POSTCOPY' Missing enum 'VIR_DOMAIN_MIGRATE_MAX_SPEED_POSTCOPY' --- FAIL: TestAPICoverage (0.24s) panic: Missing symbols found [recovered] panic: Missing symbols found goroutine 5 [running]: testing.tRunner.func1(0xc0000a8100) /usr/lib/golang/src/testing/testing.go:792 +0x387 panic(0x5cca80, 0x639c80) /usr/lib/golang/src/runtime/panic.go:513 +0x1b9 _<https://ci.centos.org/job/libvirt-go-check/systems=libvirt-fedora-29/ws/.TestAPICoverage(0xc0000a8100)> <https://ci.centos.org/job/libvirt-go-check/systems=libvirt-fedora-29/ws/api_test.go>:501 +0x554 testing.tRunner(0xc0000a8100, 0x61b0e8) /usr/lib/golang/src/testing/testing.go:827 +0xbf created by testing.(*T).Run /usr/lib/golang/src/testing/testing.go:878 +0x35c exit status 2 FAIL _<https://ci.centos.org/job/libvirt-go-check/systems=libvirt-fedora-29/ws/> 0.321s Build step 'Execute shell' marked build as failure

See <https://ci.centos.org/job/libvirt-go-check/systems=libvirt-fedora-29/236/display/redirect> ------------------------------------------ Started by upstream project "libvirt-go-check" build number 236 originally caused by: Started by upstream project "libvirt-go-build" build number 240 originally caused by: Started by upstream project "libvirt-build" build number 300 originally caused by: Started by an SCM change Started by an SCM change Started by an SCM change Started by an SCM change Started by an SCM change Started by an SCM change Started by an SCM change [EnvInject] - Loading node environment variables. Building remotely on libvirt-fedora-29 (libvirt) in workspace <https://ci.centos.org/job/libvirt-go-check/systems=libvirt-fedora-29/ws/> [libvirt-go] $ /bin/sh -xe /tmp/jenkins1610994224476074136.sh + export 'TEST_ARGS=-tags api' + TEST_ARGS='-tags api' + go test -tags api Missing macro 'VIR_MIGRATE_PARAM_BANDWIDTH_POSTCOPY' Missing enum 'VIR_DOMAIN_MIGRATE_MAX_SPEED_POSTCOPY' --- FAIL: TestAPICoverage (0.84s) panic: Missing symbols found [recovered] panic: Missing symbols found goroutine 19 [running]: testing.tRunner.func1(0xc0000c2100) /usr/lib/golang/src/testing/testing.go:792 +0x387 panic(0x5cca80, 0x639c80) /usr/lib/golang/src/runtime/panic.go:513 +0x1b9 _<https://ci.centos.org/job/libvirt-go-check/systems=libvirt-fedora-29/ws/.TestAPICoverage(0xc0000c2100)> <https://ci.centos.org/job/libvirt-go-check/systems=libvirt-fedora-29/ws/api_test.go>:501 +0x554 testing.tRunner(0xc0000c2100, 0x61b0e8) /usr/lib/golang/src/testing/testing.go:827 +0xbf created by testing.(*T).Run /usr/lib/golang/src/testing/testing.go:878 +0x35c exit status 2 FAIL _<https://ci.centos.org/job/libvirt-go-check/systems=libvirt-fedora-29/ws/> 1.060s Build step 'Execute shell' marked build as failure

participants (1)
-
ci@centos.org