Build failed in Jenkins: libvirt-go-xml-check » libvirt-fedora-rawhide #973

See <https://ci.centos.org/job/libvirt-go-xml-check/systems=libvirt-fedora-rawhide/973/display/redirect> ------------------------------------------ Started by upstream project "libvirt-go-xml-check" build number 973 originally caused by: Started by upstream project "libvirt-go-xml-build" build number 976 originally caused by: Started by upstream project "libvirt-build" build number 1142 originally caused by: Started by an SCM change Running as SYSTEM [EnvInject] - Loading node environment variables. Building remotely on libvirt-fedora-rawhide (libvirt) in workspace <https://ci.centos.org/job/libvirt-go-xml-check/systems=libvirt-fedora-rawhide/ws/> [libvirt-go-xml] $ /bin/sh -xe /tmp/jenkins1982220177103545617.sh + export 'TEST_ARGS=-tags xmlroundtrip' + TEST_ARGS='-tags xmlroundtrip' + go test -tags xmlroundtrip --- FAIL: TestRoundTrip (39.64s) xml_test.go:374: testdata/libvirt/tests/qemuxml2argvdata/net-virtio-teaming-network.xml: /domain[0]/devices[0]/interface[0]/teaming[0]: element in expected XML missing in actual XML FAIL exit status 1 FAIL _<https://ci.centos.org/job/libvirt-go-xml-check/systems=libvirt-fedora-rawhide/ws/> 39.772s Build step 'Execute shell' marked build as failure

See <https://ci.centos.org/job/libvirt-go-xml-check/systems=libvirt-fedora-rawhide/974/display/redirect> ------------------------------------------ Started by upstream project "libvirt-go-xml-check" build number 974 originally caused by: Started by upstream project "libvirt-go-xml-build" build number 977 originally caused by: Started by upstream project "libvirt-build" build number 1143 originally caused by: Started by an SCM change Running as SYSTEM [EnvInject] - Loading node environment variables. Building remotely on libvirt-fedora-rawhide (libvirt) in workspace <https://ci.centos.org/job/libvirt-go-xml-check/systems=libvirt-fedora-rawhide/ws/> [libvirt-go-xml] $ /bin/sh -xe /tmp/jenkins16898948540439210358.sh + export 'TEST_ARGS=-tags xmlroundtrip' + TEST_ARGS='-tags xmlroundtrip' + go test -tags xmlroundtrip --- FAIL: TestRoundTrip (38.63s) xml_test.go:374: testdata/libvirt/tests/qemuxml2argvdata/net-virtio-teaming-network.xml: /domain[0]/devices[0]/interface[0]/teaming[0]: element in expected XML missing in actual XML FAIL exit status 1 FAIL _<https://ci.centos.org/job/libvirt-go-xml-check/systems=libvirt-fedora-rawhide/ws/> 38.777s Build step 'Execute shell' marked build as failure

See <https://ci.centos.org/job/libvirt-go-xml-check/systems=libvirt-fedora-rawhide/975/display/redirect> ------------------------------------------ Started by upstream project "libvirt-go-xml-check" build number 975 originally caused by: Started by upstream project "libvirt-go-xml-build" build number 978 originally caused by: Started by upstream project "libvirt-build" build number 1144 originally caused by: Started by an SCM change Running as SYSTEM [EnvInject] - Loading node environment variables. Building remotely on libvirt-fedora-rawhide (libvirt) in workspace <https://ci.centos.org/job/libvirt-go-xml-check/systems=libvirt-fedora-rawhide/ws/> [libvirt-go-xml] $ /bin/sh -xe /tmp/jenkins2261151221051625839.sh + export 'TEST_ARGS=-tags xmlroundtrip' + TEST_ARGS='-tags xmlroundtrip' + go test -tags xmlroundtrip --- FAIL: TestRoundTrip (44.26s) xml_test.go:374: testdata/libvirt/tests/qemuxml2argvdata/net-virtio-teaming-network.xml: /domain[0]/devices[0]/interface[0]/teaming[0]: element in expected XML missing in actual XML FAIL exit status 1 FAIL _<https://ci.centos.org/job/libvirt-go-xml-check/systems=libvirt-fedora-rawhide/ws/> 44.413s Build step 'Execute shell' marked build as failure

See <https://ci.centos.org/job/libvirt-go-xml-check/systems=libvirt-fedora-rawhide/976/display/redirect> ------------------------------------------ Started by upstream project "libvirt-go-xml-check" build number 976 originally caused by: Started by upstream project "libvirt-go-xml-build" build number 979 originally caused by: Started by upstream project "libvirt-build" build number 1145 originally caused by: Started by an SCM change Running as SYSTEM [EnvInject] - Loading node environment variables. Building remotely on libvirt-fedora-rawhide (libvirt) in workspace <https://ci.centos.org/job/libvirt-go-xml-check/systems=libvirt-fedora-rawhide/ws/> [libvirt-go-xml] $ /bin/sh -xe /tmp/jenkins12066009506420429643.sh + export 'TEST_ARGS=-tags xmlroundtrip' + TEST_ARGS='-tags xmlroundtrip' + go test -tags xmlroundtrip --- FAIL: TestRoundTrip (33.03s) xml_test.go:374: testdata/libvirt/tests/qemuxml2argvdata/net-virtio-teaming-network.xml: /domain[0]/devices[0]/interface[0]/teaming[0]: element in expected XML missing in actual XML FAIL exit status 1 FAIL _<https://ci.centos.org/job/libvirt-go-xml-check/systems=libvirt-fedora-rawhide/ws/> 33.115s Build step 'Execute shell' marked build as failure

See <https://ci.centos.org/job/libvirt-go-xml-check/systems=libvirt-fedora-rawhide/977/display/redirect> ------------------------------------------ Started by upstream project "libvirt-go-xml-check" build number 977 originally caused by: Started by upstream project "libvirt-go-xml-build" build number 980 originally caused by: Started by an SCM change Running as SYSTEM [EnvInject] - Loading node environment variables. Building remotely on libvirt-fedora-rawhide (libvirt) in workspace <https://ci.centos.org/job/libvirt-go-xml-check/systems=libvirt-fedora-rawhide/ws/> [libvirt-go-xml] $ /bin/sh -xe /tmp/jenkins13858164822817925455.sh + export 'TEST_ARGS=-tags xmlroundtrip' + TEST_ARGS='-tags xmlroundtrip' + go test -tags xmlroundtrip --- FAIL: TestRoundTrip (4.76s) xml_test.go:374: testdata/libvirt/tests/qemuxml2argvdata/net-virtio-teaming-network.xml: /domain[0]/devices[0]/interface[0]/teaming[0]: element in expected XML missing in actual XML FAIL exit status 1 FAIL _<https://ci.centos.org/job/libvirt-go-xml-check/systems=libvirt-fedora-rawhide/ws/> 4.821s Build step 'Execute shell' marked build as failure

See <https://ci.centos.org/job/libvirt-go-xml-check/systems=libvirt-fedora-rawhide/978/display/redirect> ------------------------------------------ Started by upstream project "libvirt-go-xml-check" build number 978 originally caused by: Started by upstream project "libvirt-go-xml-build" build number 981 originally caused by: Started by upstream project "libvirt-build" build number 1146 originally caused by: Started by an SCM change Running as SYSTEM [EnvInject] - Loading node environment variables. Building remotely on libvirt-fedora-rawhide (libvirt) in workspace <https://ci.centos.org/job/libvirt-go-xml-check/systems=libvirt-fedora-rawhide/ws/> [libvirt-go-xml] $ /bin/sh -xe /tmp/jenkins3936551443584777369.sh + export 'TEST_ARGS=-tags xmlroundtrip' + TEST_ARGS='-tags xmlroundtrip' + go test -tags xmlroundtrip --- FAIL: TestRoundTrip (37.40s) xml_test.go:374: testdata/libvirt/tests/qemuxml2argvdata/net-virtio-teaming-network.xml: /domain[0]/devices[0]/interface[0]/teaming[0]: element in expected XML missing in actual XML FAIL exit status 1 FAIL _<https://ci.centos.org/job/libvirt-go-xml-check/systems=libvirt-fedora-rawhide/ws/> 37.756s Build step 'Execute shell' marked build as failure

See <https://ci.centos.org/job/libvirt-go-xml-check/systems=libvirt-fedora-rawhide/979/display/redirect> ------------------------------------------ Started by upstream project "libvirt-go-xml-check" build number 979 originally caused by: Started by upstream project "libvirt-go-xml-build" build number 982 originally caused by: Started by upstream project "libvirt-build" build number 1147 originally caused by: Started by an SCM change Running as SYSTEM [EnvInject] - Loading node environment variables. Building remotely on libvirt-fedora-rawhide (libvirt) in workspace <https://ci.centos.org/job/libvirt-go-xml-check/systems=libvirt-fedora-rawhide/ws/> [libvirt-go-xml] $ /bin/sh -xe /tmp/jenkins5546547577209173253.sh + export 'TEST_ARGS=-tags xmlroundtrip' + TEST_ARGS='-tags xmlroundtrip' + go test -tags xmlroundtrip --- FAIL: TestRoundTrip (42.40s) xml_test.go:374: testdata/libvirt/tests/qemuxml2argvdata/net-virtio-teaming-network.xml: /domain[0]/devices[0]/interface[0]/teaming[0]: element in expected XML missing in actual XML FAIL exit status 1 FAIL _<https://ci.centos.org/job/libvirt-go-xml-check/systems=libvirt-fedora-rawhide/ws/> 42.627s Build step 'Execute shell' marked build as failure

See <https://ci.centos.org/job/libvirt-go-xml-check/systems=libvirt-fedora-rawhide/980/display/redirect> ------------------------------------------ Started by upstream project "libvirt-go-xml-check" build number 980 originally caused by: Started by upstream project "libvirt-go-xml-build" build number 983 originally caused by: Started by upstream project "libvirt-build" build number 1148 originally caused by: Started by an SCM change Running as SYSTEM [EnvInject] - Loading node environment variables. Building remotely on libvirt-fedora-rawhide (libvirt) in workspace <https://ci.centos.org/job/libvirt-go-xml-check/systems=libvirt-fedora-rawhide/ws/> [libvirt-go-xml] $ /bin/sh -xe /tmp/jenkins1544719903152984851.sh + export 'TEST_ARGS=-tags xmlroundtrip' + TEST_ARGS='-tags xmlroundtrip' + go test -tags xmlroundtrip --- FAIL: TestRoundTrip (33.53s) xml_test.go:374: testdata/libvirt/tests/qemuxml2argvdata/net-virtio-teaming-network.xml: /domain[0]/devices[0]/interface[0]/teaming[0]: element in expected XML missing in actual XML FAIL exit status 1 FAIL _<https://ci.centos.org/job/libvirt-go-xml-check/systems=libvirt-fedora-rawhide/ws/> 33.575s Build step 'Execute shell' marked build as failure

See <https://ci.centos.org/job/libvirt-go-xml-check/systems=libvirt-fedora-rawhide/981/display/redirect> ------------------------------------------ Started by upstream project "libvirt-go-xml-check" build number 981 originally caused by: Started by upstream project "libvirt-go-xml-build" build number 984 originally caused by: Started by upstream project "libvirt-build" build number 1149 originally caused by: Started by an SCM change Running as SYSTEM [EnvInject] - Loading node environment variables. Building remotely on libvirt-fedora-rawhide (libvirt) in workspace <https://ci.centos.org/job/libvirt-go-xml-check/systems=libvirt-fedora-rawhide/ws/> [libvirt-go-xml] $ /bin/sh -xe /tmp/jenkins13856032879397563804.sh + export 'TEST_ARGS=-tags xmlroundtrip' + TEST_ARGS='-tags xmlroundtrip' + go test -tags xmlroundtrip --- FAIL: TestRoundTrip (47.86s) xml_test.go:374: testdata/libvirt/tests/qemuxml2argvdata/net-virtio-teaming-network.xml: /domain[0]/devices[0]/interface[0]/teaming[0]: element in expected XML missing in actual XML FAIL exit status 1 FAIL _<https://ci.centos.org/job/libvirt-go-xml-check/systems=libvirt-fedora-rawhide/ws/> 48.023s Build step 'Execute shell' marked build as failure

See <https://ci.centos.org/job/libvirt-go-xml-check/systems=libvirt-fedora-rawhide/982/display/redirect> ------------------------------------------ Started by upstream project "libvirt-go-xml-check" build number 982 originally caused by: Started by upstream project "libvirt-go-xml-build" build number 985 originally caused by: Started by upstream project "libvirt-build" build number 1151 originally caused by: Started by an SCM change Running as SYSTEM [EnvInject] - Loading node environment variables. Building remotely on libvirt-fedora-rawhide (libvirt) in workspace <https://ci.centos.org/job/libvirt-go-xml-check/systems=libvirt-fedora-rawhide/ws/> [libvirt-go-xml] $ /bin/sh -xe /tmp/jenkins4986598827292343341.sh + export 'TEST_ARGS=-tags xmlroundtrip' + TEST_ARGS='-tags xmlroundtrip' + go test -tags xmlroundtrip --- FAIL: TestRoundTrip (22.99s) xml_test.go:374: testdata/libvirt/tests/qemuxml2argvdata/net-virtio-teaming-network.xml: /domain[0]/devices[0]/interface[0]/teaming[0]: element in expected XML missing in actual XML FAIL exit status 1 FAIL _<https://ci.centos.org/job/libvirt-go-xml-check/systems=libvirt-fedora-rawhide/ws/> 23.087s Build step 'Execute shell' marked build as failure

See <https://ci.centos.org/job/libvirt-go-xml-check/systems=libvirt-fedora-rawhide/983/display/redirect> ------------------------------------------ Started by upstream project "libvirt-go-xml-check" build number 983 originally caused by: Started by upstream project "libvirt-go-xml-build" build number 986 originally caused by: Started by upstream project "libvirt-build" build number 1152 originally caused by: Started by an SCM change Running as SYSTEM [EnvInject] - Loading node environment variables. Building remotely on libvirt-fedora-rawhide (libvirt) in workspace <https://ci.centos.org/job/libvirt-go-xml-check/systems=libvirt-fedora-rawhide/ws/> [libvirt-go-xml] $ /bin/sh -xe /tmp/jenkins13982784004171430697.sh + export 'TEST_ARGS=-tags xmlroundtrip' + TEST_ARGS='-tags xmlroundtrip' + go test -tags xmlroundtrip --- FAIL: TestRoundTrip (62.00s) xml_test.go:374: testdata/libvirt/tests/qemuxml2argvdata/net-virtio-teaming-network.xml: /domain[0]/devices[0]/interface[0]/teaming[0]: element in expected XML missing in actual XML FAIL exit status 1 FAIL _<https://ci.centos.org/job/libvirt-go-xml-check/systems=libvirt-fedora-rawhide/ws/> 62.368s Build step 'Execute shell' marked build as failure

See <https://ci.centos.org/job/libvirt-go-xml-check/systems=libvirt-fedora-rawhide/984/display/redirect> ------------------------------------------ Started by upstream project "libvirt-go-xml-check" build number 984 originally caused by: Started by upstream project "libvirt-go-xml-build" build number 987 originally caused by: Started by upstream project "libvirt-build" build number 1153 originally caused by: Started by an SCM change Running as SYSTEM [EnvInject] - Loading node environment variables. Building remotely on libvirt-fedora-rawhide (libvirt) in workspace <https://ci.centos.org/job/libvirt-go-xml-check/systems=libvirt-fedora-rawhide/ws/> [libvirt-go-xml] $ /bin/sh -xe /tmp/jenkins10259430537109221586.sh + export 'TEST_ARGS=-tags xmlroundtrip' + TEST_ARGS='-tags xmlroundtrip' + go test -tags xmlroundtrip --- FAIL: TestRoundTrip (37.92s) xml_test.go:374: testdata/libvirt/tests/qemuxml2argvdata/net-virtio-teaming-network.xml: /domain[0]/devices[0]/interface[0]/teaming[0]: element in expected XML missing in actual XML FAIL exit status 1 FAIL _<https://ci.centos.org/job/libvirt-go-xml-check/systems=libvirt-fedora-rawhide/ws/> 38.145s Build step 'Execute shell' marked build as failure

See <https://ci.centos.org/job/libvirt-go-xml-check/systems=libvirt-fedora-rawhide/985/display/redirect> ------------------------------------------ Started by upstream project "libvirt-go-xml-check" build number 985 originally caused by: Started by upstream project "libvirt-go-xml-build" build number 988 originally caused by: Started by upstream project "libvirt-build" build number 1154 originally caused by: Started by an SCM change Running as SYSTEM [EnvInject] - Loading node environment variables. Building remotely on libvirt-fedora-rawhide (libvirt) in workspace <https://ci.centos.org/job/libvirt-go-xml-check/systems=libvirt-fedora-rawhide/ws/> [libvirt-go-xml] $ /bin/sh -xe /tmp/jenkins3930520581312116638.sh + export 'TEST_ARGS=-tags xmlroundtrip' + TEST_ARGS='-tags xmlroundtrip' + go test -tags xmlroundtrip --- FAIL: TestRoundTrip (38.32s) xml_test.go:374: testdata/libvirt/tests/qemuxml2argvdata/net-virtio-teaming-network.xml: /domain[0]/devices[0]/interface[0]/teaming[0]: element in expected XML missing in actual XML FAIL exit status 1 FAIL _<https://ci.centos.org/job/libvirt-go-xml-check/systems=libvirt-fedora-rawhide/ws/> 38.481s Build step 'Execute shell' marked build as failure

See <https://ci.centos.org/job/libvirt-go-xml-check/systems=libvirt-fedora-rawhide/986/display/redirect> ------------------------------------------ Started by upstream project "libvirt-go-xml-check" build number 986 originally caused by: Started by upstream project "libvirt-go-xml-build" build number 989 originally caused by: Started by upstream project "libvirt-build" build number 1155 originally caused by: Started by an SCM change Running as SYSTEM [EnvInject] - Loading node environment variables. Building remotely on libvirt-fedora-rawhide (libvirt) in workspace <https://ci.centos.org/job/libvirt-go-xml-check/systems=libvirt-fedora-rawhide/ws/> [libvirt-go-xml] $ /bin/sh -xe /tmp/jenkins15584522899387364610.sh + export 'TEST_ARGS=-tags xmlroundtrip' + TEST_ARGS='-tags xmlroundtrip' + go test -tags xmlroundtrip --- FAIL: TestRoundTrip (58.22s) xml_test.go:374: testdata/libvirt/tests/qemuxml2argvdata/net-virtio-teaming-network.xml: /domain[0]/devices[0]/interface[0]/teaming[0]: element in expected XML missing in actual XML FAIL exit status 1 FAIL _<https://ci.centos.org/job/libvirt-go-xml-check/systems=libvirt-fedora-rawhide/ws/> 58.416s Build step 'Execute shell' marked build as failure

See <https://ci.centos.org/job/libvirt-go-xml-check/systems=libvirt-fedora-rawhide/987/display/redirect> ------------------------------------------ Started by upstream project "libvirt-go-xml-check" build number 987 originally caused by: Started by upstream project "libvirt-go-xml-build" build number 990 originally caused by: Started by upstream project "libvirt-build" build number 1156 originally caused by: Started by an SCM change Started by an SCM change Started by an SCM change Started by an SCM change Running as SYSTEM [EnvInject] - Loading node environment variables. Building remotely on libvirt-fedora-rawhide (libvirt) in workspace <https://ci.centos.org/job/libvirt-go-xml-check/systems=libvirt-fedora-rawhide/ws/> [libvirt-go-xml] $ /bin/sh -xe /tmp/jenkins7006350983923947641.sh + export 'TEST_ARGS=-tags xmlroundtrip' + TEST_ARGS='-tags xmlroundtrip' + go test -tags xmlroundtrip --- FAIL: TestRoundTrip (18.29s) xml_test.go:374: testdata/libvirt/tests/qemuxml2argvdata/net-virtio-teaming-network.xml: /domain[0]/devices[0]/interface[0]/teaming[0]: element in expected XML missing in actual XML FAIL exit status 1 FAIL _<https://ci.centos.org/job/libvirt-go-xml-check/systems=libvirt-fedora-rawhide/ws/> 18.412s Build step 'Execute shell' marked build as failure

See <https://ci.centos.org/job/libvirt-go-xml-check/systems=libvirt-fedora-rawhide/988/display/redirect> ------------------------------------------ Started by upstream project "libvirt-go-xml-check" build number 988 originally caused by: Started by upstream project "libvirt-go-xml-build" build number 991 originally caused by: Started by upstream project "libvirt-build" build number 1157 originally caused by: Started by an SCM change Running as SYSTEM [EnvInject] - Loading node environment variables. Building remotely on libvirt-fedora-rawhide (libvirt) in workspace <https://ci.centos.org/job/libvirt-go-xml-check/systems=libvirt-fedora-rawhide/ws/> [libvirt-go-xml] $ /bin/sh -xe /tmp/jenkins1001010400886539785.sh + export 'TEST_ARGS=-tags xmlroundtrip' + TEST_ARGS='-tags xmlroundtrip' + go test -tags xmlroundtrip --- FAIL: TestRoundTrip (41.64s) xml_test.go:374: testdata/libvirt/tests/qemuxml2argvdata/net-virtio-teaming-network.xml: /domain[0]/devices[0]/interface[0]/teaming[0]: element in expected XML missing in actual XML FAIL exit status 1 FAIL _<https://ci.centos.org/job/libvirt-go-xml-check/systems=libvirt-fedora-rawhide/ws/> 41.963s Build step 'Execute shell' marked build as failure

See <https://ci.centos.org/job/libvirt-go-xml-check/systems=libvirt-fedora-rawhide/989/display/redirect> ------------------------------------------ Started by upstream project "libvirt-go-xml-check" build number 989 originally caused by: Started by upstream project "libvirt-go-xml-build" build number 992 originally caused by: Started by upstream project "libvirt-build" build number 1158 originally caused by: Started by an SCM change Running as SYSTEM [EnvInject] - Loading node environment variables. Building remotely on libvirt-fedora-rawhide (libvirt) in workspace <https://ci.centos.org/job/libvirt-go-xml-check/systems=libvirt-fedora-rawhide/ws/> [libvirt-go-xml] $ /bin/sh -xe /tmp/jenkins3451838889079743938.sh + export 'TEST_ARGS=-tags xmlroundtrip' + TEST_ARGS='-tags xmlroundtrip' + go test -tags xmlroundtrip --- FAIL: TestRoundTrip (37.60s) xml_test.go:374: testdata/libvirt/tests/qemuxml2argvdata/net-virtio-teaming-network.xml: /domain[0]/devices[0]/interface[0]/teaming[0]: element in expected XML missing in actual XML FAIL exit status 1 FAIL _<https://ci.centos.org/job/libvirt-go-xml-check/systems=libvirt-fedora-rawhide/ws/> 37.637s Build step 'Execute shell' marked build as failure

See <https://ci.centos.org/job/libvirt-go-xml-check/systems=libvirt-fedora-rawhide/990/display/redirect> ------------------------------------------ Started by upstream project "libvirt-go-xml-check" build number 990 originally caused by: Started by upstream project "libvirt-go-xml-build" build number 993 originally caused by: Started by upstream project "libvirt-build" build number 1159 originally caused by: Started by an SCM change Started by an SCM change Started by an SCM change Started by an SCM change Started by an SCM change Started by an SCM change Started by an SCM change Running as SYSTEM [EnvInject] - Loading node environment variables. Building remotely on libvirt-fedora-rawhide (libvirt) in workspace <https://ci.centos.org/job/libvirt-go-xml-check/systems=libvirt-fedora-rawhide/ws/> [libvirt-go-xml] $ /bin/sh -xe /tmp/jenkins1200632784422993870.sh + export 'TEST_ARGS=-tags xmlroundtrip' + TEST_ARGS='-tags xmlroundtrip' + go test -tags xmlroundtrip --- FAIL: TestRoundTrip (33.50s) xml_test.go:374: testdata/libvirt/tests/qemuxml2argvdata/net-virtio-teaming-network.xml: /domain[0]/devices[0]/interface[0]/teaming[0]: element in expected XML missing in actual XML FAIL exit status 1 FAIL _<https://ci.centos.org/job/libvirt-go-xml-check/systems=libvirt-fedora-rawhide/ws/> 33.581s Build step 'Execute shell' marked build as failure

See <https://ci.centos.org/job/libvirt-go-xml-check/systems=libvirt-fedora-rawhide/991/display/redirect> ------------------------------------------ Started by upstream project "libvirt-go-xml-check" build number 991 originally caused by: Started by upstream project "libvirt-go-xml-build" build number 994 originally caused by: Started by upstream project "libvirt-build" build number 1160 originally caused by: Started by an SCM change Running as SYSTEM [EnvInject] - Loading node environment variables. Building remotely on libvirt-fedora-rawhide (libvirt) in workspace <https://ci.centos.org/job/libvirt-go-xml-check/systems=libvirt-fedora-rawhide/ws/> [libvirt-go-xml] $ /bin/sh -xe /tmp/jenkins4821650229911686754.sh + export 'TEST_ARGS=-tags xmlroundtrip' + TEST_ARGS='-tags xmlroundtrip' + go test -tags xmlroundtrip --- FAIL: TestRoundTrip (38.42s) xml_test.go:374: testdata/libvirt/tests/qemuxml2argvdata/net-virtio-teaming-network.xml: /domain[0]/devices[0]/interface[0]/teaming[0]: element in expected XML missing in actual XML FAIL exit status 1 FAIL _<https://ci.centos.org/job/libvirt-go-xml-check/systems=libvirt-fedora-rawhide/ws/> 38.490s Build step 'Execute shell' marked build as failure

See <https://ci.centos.org/job/libvirt-go-xml-check/systems=libvirt-fedora-rawhide/992/display/redirect> ------------------------------------------ Started by upstream project "libvirt-go-xml-check" build number 992 originally caused by: Started by upstream project "libvirt-go-xml-build" build number 995 originally caused by: Started by upstream project "libvirt-build" build number 1161 originally caused by: Started by an SCM change Started by an SCM change Started by an SCM change Running as SYSTEM [EnvInject] - Loading node environment variables. Building remotely on libvirt-fedora-rawhide (libvirt) in workspace <https://ci.centos.org/job/libvirt-go-xml-check/systems=libvirt-fedora-rawhide/ws/> [libvirt-go-xml] $ /bin/sh -xe /tmp/jenkins8916717137501042158.sh + export 'TEST_ARGS=-tags xmlroundtrip' + TEST_ARGS='-tags xmlroundtrip' + go test -tags xmlroundtrip --- FAIL: TestRoundTrip (18.36s) xml_test.go:374: testdata/libvirt/tests/qemuxml2argvdata/net-virtio-teaming-network.xml: /domain[0]/devices[0]/interface[0]/teaming[0]: element in expected XML missing in actual XML FAIL exit status 1 FAIL _<https://ci.centos.org/job/libvirt-go-xml-check/systems=libvirt-fedora-rawhide/ws/> 18.577s Build step 'Execute shell' marked build as failure

See <https://ci.centos.org/job/libvirt-go-xml-check/systems=libvirt-fedora-rawhide/993/display/redirect> ------------------------------------------ Started by upstream project "libvirt-go-xml-check" build number 993 originally caused by: Started by upstream project "libvirt-go-xml-build" build number 996 originally caused by: Started by upstream project "libvirt-build" build number 1162 originally caused by: Started by an SCM change Running as SYSTEM [EnvInject] - Loading node environment variables. Building remotely on libvirt-fedora-rawhide (libvirt) in workspace <https://ci.centos.org/job/libvirt-go-xml-check/systems=libvirt-fedora-rawhide/ws/> [libvirt-go-xml] $ /bin/sh -xe /tmp/jenkins4034507142052016832.sh + export 'TEST_ARGS=-tags xmlroundtrip' + TEST_ARGS='-tags xmlroundtrip' + go test -tags xmlroundtrip --- FAIL: TestRoundTrip (32.11s) xml_test.go:374: testdata/libvirt/tests/qemuxml2argvdata/net-virtio-teaming-network.xml: /domain[0]/devices[0]/interface[0]/teaming[0]: element in expected XML missing in actual XML FAIL exit status 1 FAIL _<https://ci.centos.org/job/libvirt-go-xml-check/systems=libvirt-fedora-rawhide/ws/> 32.165s Build step 'Execute shell' marked build as failure

See <https://ci.centos.org/job/libvirt-go-xml-check/systems=libvirt-fedora-rawhide/994/display/redirect> ------------------------------------------ Started by upstream project "libvirt-go-xml-check" build number 994 originally caused by: Started by upstream project "libvirt-go-xml-build" build number 997 originally caused by: Started by upstream project "libvirt-build" build number 1163 originally caused by: Started by an SCM change Running as SYSTEM [EnvInject] - Loading node environment variables. Building remotely on libvirt-fedora-rawhide (libvirt) in workspace <https://ci.centos.org/job/libvirt-go-xml-check/systems=libvirt-fedora-rawhide/ws/> [libvirt-go-xml] $ /bin/sh -xe /tmp/jenkins13658592504809754295.sh + export 'TEST_ARGS=-tags xmlroundtrip' + TEST_ARGS='-tags xmlroundtrip' + go test -tags xmlroundtrip --- FAIL: TestRoundTrip (35.90s) xml_test.go:374: testdata/libvirt/tests/qemuxml2argvdata/net-virtio-teaming-network.xml: /domain[0]/devices[0]/interface[0]/teaming[0]: element in expected XML missing in actual XML FAIL exit status 1 FAIL _<https://ci.centos.org/job/libvirt-go-xml-check/systems=libvirt-fedora-rawhide/ws/> 36.030s Build step 'Execute shell' marked build as failure

See <https://ci.centos.org/job/libvirt-go-xml-check/systems=libvirt-fedora-rawhide/995/display/redirect> ------------------------------------------ Started by upstream project "libvirt-go-xml-check" build number 995 originally caused by: Started by upstream project "libvirt-go-xml-build" build number 998 originally caused by: Started by upstream project "libvirt-build" build number 1164 originally caused by: Started by an SCM change Running as SYSTEM [EnvInject] - Loading node environment variables. Building remotely on libvirt-fedora-rawhide (libvirt) in workspace <https://ci.centos.org/job/libvirt-go-xml-check/systems=libvirt-fedora-rawhide/ws/> [libvirt-go-xml] $ /bin/sh -xe /tmp/jenkins14199166338250017355.sh + export 'TEST_ARGS=-tags xmlroundtrip' + TEST_ARGS='-tags xmlroundtrip' + go test -tags xmlroundtrip --- FAIL: TestRoundTrip (49.79s) xml_test.go:374: testdata/libvirt/tests/qemuxml2argvdata/net-virtio-teaming-network.xml: /domain[0]/devices[0]/interface[0]/teaming[0]: element in expected XML missing in actual XML FAIL exit status 1 FAIL _<https://ci.centos.org/job/libvirt-go-xml-check/systems=libvirt-fedora-rawhide/ws/> 49.911s Build step 'Execute shell' marked build as failure

See <https://ci.centos.org/job/libvirt-go-xml-check/systems=libvirt-fedora-rawhide/996/display/redirect> ------------------------------------------ Started by upstream project "libvirt-go-xml-check" build number 996 originally caused by: Started by upstream project "libvirt-go-xml-build" build number 999 originally caused by: Started by upstream project "libvirt-build" build number 1165 originally caused by: Started by an SCM change Running as SYSTEM [EnvInject] - Loading node environment variables. Building remotely on libvirt-fedora-rawhide (libvirt) in workspace <https://ci.centos.org/job/libvirt-go-xml-check/systems=libvirt-fedora-rawhide/ws/> [libvirt-go-xml] $ /bin/sh -xe /tmp/jenkins1752069500026450195.sh + export 'TEST_ARGS=-tags xmlroundtrip' + TEST_ARGS='-tags xmlroundtrip' + go test -tags xmlroundtrip --- FAIL: TestRoundTrip (32.16s) xml_test.go:374: testdata/libvirt/tests/qemuxml2argvdata/net-virtio-teaming-network.xml: /domain[0]/devices[0]/interface[0]/teaming[0]: element in expected XML missing in actual XML FAIL exit status 1 FAIL _<https://ci.centos.org/job/libvirt-go-xml-check/systems=libvirt-fedora-rawhide/ws/> 32.331s Build step 'Execute shell' marked build as failure

See <https://ci.centos.org/job/libvirt-go-xml-check/systems=libvirt-fedora-rawhide/997/display/redirect> ------------------------------------------ Started by upstream project "libvirt-go-xml-check" build number 997 originally caused by: Started by upstream project "libvirt-go-xml-build" build number 1000 originally caused by: Started by upstream project "libvirt-build" build number 1166 originally caused by: Started by an SCM change Running as SYSTEM [EnvInject] - Loading node environment variables. Building remotely on libvirt-fedora-rawhide (libvirt) in workspace <https://ci.centos.org/job/libvirt-go-xml-check/systems=libvirt-fedora-rawhide/ws/> [libvirt-go-xml] $ /bin/sh -xe /tmp/jenkins16142840721018084479.sh + export 'TEST_ARGS=-tags xmlroundtrip' + TEST_ARGS='-tags xmlroundtrip' + go test -tags xmlroundtrip --- FAIL: TestRoundTrip (38.69s) xml_test.go:374: testdata/libvirt/tests/qemuxml2argvdata/net-virtio-teaming-network.xml: /domain[0]/devices[0]/interface[0]/teaming[0]: element in expected XML missing in actual XML FAIL exit status 1 FAIL _<https://ci.centos.org/job/libvirt-go-xml-check/systems=libvirt-fedora-rawhide/ws/> 38.823s Build step 'Execute shell' marked build as failure

See <https://ci.centos.org/job/libvirt-go-xml-check/systems=libvirt-fedora-rawhide/998/display/redirect> ------------------------------------------ Started by upstream project "libvirt-go-xml-check" build number 998 originally caused by: Started by upstream project "libvirt-go-xml-build" build number 1001 originally caused by: Started by upstream project "libvirt-build" build number 1167 originally caused by: Started by an SCM change Running as SYSTEM [EnvInject] - Loading node environment variables. Building remotely on libvirt-fedora-rawhide (libvirt) in workspace <https://ci.centos.org/job/libvirt-go-xml-check/systems=libvirt-fedora-rawhide/ws/> [libvirt-go-xml] $ /bin/sh -xe /tmp/jenkins6900880541242567564.sh + export 'TEST_ARGS=-tags xmlroundtrip' + TEST_ARGS='-tags xmlroundtrip' + go test -tags xmlroundtrip --- FAIL: TestRoundTrip (43.92s) xml_test.go:374: testdata/libvirt/tests/qemuxml2argvdata/net-virtio-teaming-network.xml: /domain[0]/devices[0]/interface[0]/teaming[0]: element in expected XML missing in actual XML FAIL exit status 1 FAIL _<https://ci.centos.org/job/libvirt-go-xml-check/systems=libvirt-fedora-rawhide/ws/> 44.044s Build step 'Execute shell' marked build as failure

See <https://ci.centos.org/job/libvirt-go-xml-check/systems=libvirt-fedora-rawhide/999/display/redirect> ------------------------------------------ Started by upstream project "libvirt-go-xml-check" build number 999 originally caused by: Started by upstream project "libvirt-go-xml-build" build number 1002 originally caused by: Started by upstream project "libvirt-build" build number 1168 originally caused by: Started by an SCM change Running as SYSTEM [EnvInject] - Loading node environment variables. Building remotely on libvirt-fedora-rawhide (libvirt) in workspace <https://ci.centos.org/job/libvirt-go-xml-check/systems=libvirt-fedora-rawhide/ws/> [libvirt-go-xml] $ /bin/sh -xe /tmp/jenkins16492971456230664839.sh + export 'TEST_ARGS=-tags xmlroundtrip' + TEST_ARGS='-tags xmlroundtrip' + go test -tags xmlroundtrip --- FAIL: TestRoundTrip (50.78s) xml_test.go:374: testdata/libvirt/tests/qemuxml2argvdata/net-virtio-teaming-network.xml: /domain[0]/devices[0]/interface[0]/teaming[0]: element in expected XML missing in actual XML FAIL exit status 1 FAIL _<https://ci.centos.org/job/libvirt-go-xml-check/systems=libvirt-fedora-rawhide/ws/> 50.995s Build step 'Execute shell' marked build as failure

See <https://ci.centos.org/job/libvirt-go-xml-check/systems=libvirt-fedora-rawhide/1000/display/redirect> ------------------------------------------ Started by upstream project "libvirt-go-xml-check" build number 1000 originally caused by: Started by upstream project "libvirt-go-xml-build" build number 1003 originally caused by: Started by upstream project "libvirt-build" build number 1169 originally caused by: Started by an SCM change Started by an SCM change Started by an SCM change Running as SYSTEM [EnvInject] - Loading node environment variables. Building remotely on libvirt-fedora-rawhide (libvirt) in workspace <https://ci.centos.org/job/libvirt-go-xml-check/systems=libvirt-fedora-rawhide/ws/> [libvirt-go-xml] $ /bin/sh -xe /tmp/jenkins10677882273920556792.sh + export 'TEST_ARGS=-tags xmlroundtrip' + TEST_ARGS='-tags xmlroundtrip' + go test -tags xmlroundtrip --- FAIL: TestRoundTrip (14.17s) xml_test.go:374: testdata/libvirt/tests/qemuxml2argvdata/net-virtio-teaming-network.xml: /domain[0]/devices[0]/interface[0]/teaming[0]: element in expected XML missing in actual XML FAIL exit status 1 FAIL _<https://ci.centos.org/job/libvirt-go-xml-check/systems=libvirt-fedora-rawhide/ws/> 14.291s Build step 'Execute shell' marked build as failure

See <https://ci.centos.org/job/libvirt-go-xml-check/systems=libvirt-fedora-rawhide/1001/display/redirect> ------------------------------------------ Started by upstream project "libvirt-go-xml-check" build number 1001 originally caused by: Started by upstream project "libvirt-go-xml-build" build number 1004 originally caused by: Started by upstream project "libvirt-build" build number 1170 originally caused by: Started by an SCM change Running as SYSTEM [EnvInject] - Loading node environment variables. Building remotely on libvirt-fedora-rawhide (libvirt) in workspace <https://ci.centos.org/job/libvirt-go-xml-check/systems=libvirt-fedora-rawhide/ws/> [libvirt-go-xml] $ /bin/sh -xe /tmp/jenkins14493951507954277140.sh + export 'TEST_ARGS=-tags xmlroundtrip' + TEST_ARGS='-tags xmlroundtrip' + go test -tags xmlroundtrip --- FAIL: TestRoundTrip (52.07s) xml_test.go:374: testdata/libvirt/tests/qemuxml2argvdata/net-virtio-teaming-network.xml: /domain[0]/devices[0]/interface[0]/teaming[0]: element in expected XML missing in actual XML FAIL exit status 1 FAIL _<https://ci.centos.org/job/libvirt-go-xml-check/systems=libvirt-fedora-rawhide/ws/> 52.241s Build step 'Execute shell' marked build as failure

participants (1)
-
ci@centos.org