[Libvirt-ci] Build failed in Jenkins: libvirt-go-check » libvirt-fedora-rawhide #191

See <https://ci.centos.org/job/libvirt-go-check/systems=libvirt-fedora-rawhide/191/display/redirect> ------------------------------------------ Started by upstream project "libvirt-go-check" build number 191 originally caused by: Started by upstream project "libvirt-go-build" build number 195 originally caused by: Started by upstream project "libvirt-build" build number 229 originally caused by: Started by an SCM change Started by an SCM change Started by an SCM change Started by an SCM change [EnvInject] - Loading node environment variables. Building remotely on libvirt-fedora-rawhide (libvirt) in workspace <https://ci.centos.org/job/libvirt-go-check/systems=libvirt-fedora-rawhide/ws/> [libvirt-go] $ /bin/sh -xe /tmp/jenkins4839028526320043833.sh + export 'TEST_ARGS=-tags api' + TEST_ARGS='-tags api' + go test -tags api --- FAIL: TestPackUnpack (0.00s) typedparams_test.go:91: Expected 5 output parameters, not 0 FAIL exit status 1 FAIL _<https://ci.centos.org/job/libvirt-go-check/systems=libvirt-fedora-rawhide/ws/> 1.953s Build step 'Execute shell' marked build as failure

See <https://ci.centos.org/job/libvirt-go-check/systems=libvirt-fedora-rawhide/192/display/redirect> ------------------------------------------ Started by upstream project "libvirt-go-check" build number 192 originally caused by: Started by upstream project "libvirt-go-build" build number 196 originally caused by: Started by upstream project "libvirt-build" build number 230 originally caused by: Started by an SCM change Started by an SCM change [EnvInject] - Loading node environment variables. Building remotely on libvirt-fedora-rawhide (libvirt) in workspace <https://ci.centos.org/job/libvirt-go-check/systems=libvirt-fedora-rawhide/ws/> [libvirt-go] $ /bin/sh -xe /tmp/jenkins3333692214464767148.sh + export 'TEST_ARGS=-tags api' + TEST_ARGS='-tags api' + go test -tags api --- FAIL: TestPackUnpack (0.00s) typedparams_test.go:91: Expected 5 output parameters, not 0 FAIL exit status 1 FAIL _<https://ci.centos.org/job/libvirt-go-check/systems=libvirt-fedora-rawhide/ws/> 2.611s Build step 'Execute shell' marked build as failure

See <https://ci.centos.org/job/libvirt-go-check/systems=libvirt-fedora-rawhide/193/display/redirect> ------------------------------------------ Started by upstream project "libvirt-go-check" build number 193 originally caused by: Started by upstream project "libvirt-go-build" build number 197 originally caused by: Started by upstream project "libvirt-build" build number 231 originally caused by: Started by an SCM change [EnvInject] - Loading node environment variables. Building remotely on libvirt-fedora-rawhide (libvirt) in workspace <https://ci.centos.org/job/libvirt-go-check/systems=libvirt-fedora-rawhide/ws/> [libvirt-go] $ /bin/sh -xe /tmp/jenkins2445418295377271630.sh + export 'TEST_ARGS=-tags api' + TEST_ARGS='-tags api' + go test -tags api --- FAIL: TestPackUnpack (0.00s) typedparams_test.go:91: Expected 5 output parameters, not 0 FAIL exit status 1 FAIL _<https://ci.centos.org/job/libvirt-go-check/systems=libvirt-fedora-rawhide/ws/> 2.437s Build step 'Execute shell' marked build as failure

See <https://ci.centos.org/job/libvirt-go-check/systems=libvirt-fedora-rawhide/194/display/redirect> ------------------------------------------ Started by upstream project "libvirt-go-check" build number 194 originally caused by: Started by upstream project "libvirt-go-build" build number 198 originally caused by: Started by upstream project "libvirt-build" build number 232 originally caused by: Started by an SCM change Started by an SCM change Started by an SCM change Started by an SCM change Started by an SCM change Started by an SCM change [EnvInject] - Loading node environment variables. Building remotely on libvirt-fedora-rawhide (libvirt) in workspace <https://ci.centos.org/job/libvirt-go-check/systems=libvirt-fedora-rawhide/ws/> [libvirt-go] $ /bin/sh -xe /tmp/jenkins8851838161248029726.sh + export 'TEST_ARGS=-tags api' + TEST_ARGS='-tags api' + go test -tags api --- FAIL: TestPackUnpack (0.00s) typedparams_test.go:91: Expected 5 output parameters, not 0 FAIL exit status 1 FAIL _<https://ci.centos.org/job/libvirt-go-check/systems=libvirt-fedora-rawhide/ws/> 3.541s Build step 'Execute shell' marked build as failure

See <https://ci.centos.org/job/libvirt-go-check/systems=libvirt-fedora-rawhide/195/display/redirect> ------------------------------------------ Started by upstream project "libvirt-go-check" build number 195 originally caused by: Started by upstream project "libvirt-go-build" build number 199 originally caused by: Started by upstream project "libvirt-build" build number 233 originally caused by: Started by an SCM change [EnvInject] - Loading node environment variables. Building remotely on libvirt-fedora-rawhide (libvirt) in workspace <https://ci.centos.org/job/libvirt-go-check/systems=libvirt-fedora-rawhide/ws/> [libvirt-go] $ /bin/sh -xe /tmp/jenkins6829100555128825276.sh + export 'TEST_ARGS=-tags api' + TEST_ARGS='-tags api' + go test -tags api --- FAIL: TestPackUnpack (0.01s) typedparams_test.go:91: Expected 5 output parameters, not 0 FAIL exit status 1 FAIL _<https://ci.centos.org/job/libvirt-go-check/systems=libvirt-fedora-rawhide/ws/> 3.421s Build step 'Execute shell' marked build as failure

See <https://ci.centos.org/job/libvirt-go-check/systems=libvirt-fedora-rawhide/196/display/redirect> ------------------------------------------ Started by upstream project "libvirt-go-check" build number 196 originally caused by: Started by upstream project "libvirt-go-build" build number 200 originally caused by: Started by upstream project "libvirt-build" build number 235 originally caused by: Started by an SCM change [EnvInject] - Loading node environment variables. Building remotely on libvirt-fedora-rawhide (libvirt) in workspace <https://ci.centos.org/job/libvirt-go-check/systems=libvirt-fedora-rawhide/ws/> [libvirt-go] $ /bin/sh -xe /tmp/jenkins4733966022099382103.sh + export 'TEST_ARGS=-tags api' + TEST_ARGS='-tags api' + go test -tags api --- FAIL: TestPackUnpack (0.00s) typedparams_test.go:91: Expected 5 output parameters, not 0 FAIL exit status 1 FAIL _<https://ci.centos.org/job/libvirt-go-check/systems=libvirt-fedora-rawhide/ws/> 5.083s Build step 'Execute shell' marked build as failure

See <https://ci.centos.org/job/libvirt-go-check/systems=libvirt-fedora-rawhide/197/display/redirect> ------------------------------------------ Started by upstream project "libvirt-go-check" build number 197 originally caused by: Started by upstream project "libvirt-go-build" build number 201 originally caused by: Started by upstream project "libvirt-build" build number 236 originally caused by: Started by an SCM change [EnvInject] - Loading node environment variables. Building remotely on libvirt-fedora-rawhide (libvirt) in workspace <https://ci.centos.org/job/libvirt-go-check/systems=libvirt-fedora-rawhide/ws/> [libvirt-go] $ /bin/sh -xe /tmp/jenkins5744082411552271167.sh + export 'TEST_ARGS=-tags api' + TEST_ARGS='-tags api' + go test -tags api --- FAIL: TestPackUnpack (0.00s) typedparams_test.go:91: Expected 5 output parameters, not 0 FAIL exit status 1 FAIL _<https://ci.centos.org/job/libvirt-go-check/systems=libvirt-fedora-rawhide/ws/> 3.081s Build step 'Execute shell' marked build as failure

See <https://ci.centos.org/job/libvirt-go-check/systems=libvirt-fedora-rawhide/198/display/redirect> ------------------------------------------ Started by upstream project "libvirt-go-check" build number 198 originally caused by: Started by upstream project "libvirt-go-build" build number 202 originally caused by: Started by upstream project "libvirt-build" build number 237 originally caused by: Started by an SCM change Started by an SCM change Started by an SCM change Started by an SCM change Started by an SCM change [EnvInject] - Loading node environment variables. Building remotely on libvirt-fedora-rawhide (libvirt) in workspace <https://ci.centos.org/job/libvirt-go-check/systems=libvirt-fedora-rawhide/ws/> [libvirt-go] $ /bin/sh -xe /tmp/jenkins9109504258671693749.sh + export 'TEST_ARGS=-tags api' + TEST_ARGS='-tags api' + go test -tags api --- FAIL: TestPackUnpack (0.00s) typedparams_test.go:91: Expected 5 output parameters, not 0 FAIL exit status 1 FAIL _<https://ci.centos.org/job/libvirt-go-check/systems=libvirt-fedora-rawhide/ws/> 7.805s Build step 'Execute shell' marked build as failure

See <https://ci.centos.org/job/libvirt-go-check/systems=libvirt-fedora-rawhide/199/display/redirect> ------------------------------------------ Started by upstream project "libvirt-go-check" build number 199 originally caused by: Started by upstream project "libvirt-go-build" build number 203 originally caused by: Started by upstream project "libvirt-build" build number 238 originally caused by: Started by an SCM change [EnvInject] - Loading node environment variables. Building remotely on libvirt-fedora-rawhide (libvirt) in workspace <https://ci.centos.org/job/libvirt-go-check/systems=libvirt-fedora-rawhide/ws/> [libvirt-go] $ /bin/sh -xe /tmp/jenkins5849917338886066733.sh + export 'TEST_ARGS=-tags api' + TEST_ARGS='-tags api' + go test -tags api --- FAIL: TestPackUnpack (0.00s) typedparams_test.go:91: Expected 5 output parameters, not 0 FAIL exit status 1 FAIL _<https://ci.centos.org/job/libvirt-go-check/systems=libvirt-fedora-rawhide/ws/> 4.540s Build step 'Execute shell' marked build as failure

See <https://ci.centos.org/job/libvirt-go-check/systems=libvirt-fedora-rawhide/200/display/redirect> ------------------------------------------ Started by upstream project "libvirt-go-check" build number 200 originally caused by: Started by upstream project "libvirt-go-build" build number 204 originally caused by: Started by upstream project "libvirt-build" build number 239 originally caused by: Started by an SCM change Started by an SCM change Started by an SCM change Started by an SCM change Started by an SCM change Started by an SCM change [EnvInject] - Loading node environment variables. Building remotely on libvirt-fedora-rawhide (libvirt) in workspace <https://ci.centos.org/job/libvirt-go-check/systems=libvirt-fedora-rawhide/ws/> [libvirt-go] $ /bin/sh -xe /tmp/jenkins4055826626212872629.sh + export 'TEST_ARGS=-tags api' + TEST_ARGS='-tags api' + go test -tags api --- FAIL: TestPackUnpack (0.00s) typedparams_test.go:91: Expected 5 output parameters, not 0 FAIL exit status 1 FAIL _<https://ci.centos.org/job/libvirt-go-check/systems=libvirt-fedora-rawhide/ws/> 3.409s Build step 'Execute shell' marked build as failure

See <https://ci.centos.org/job/libvirt-go-check/systems=libvirt-fedora-rawhide/201/display/redirect> ------------------------------------------ Started by upstream project "libvirt-go-check" build number 201 originally caused by: Started by upstream project "libvirt-go-build" build number 205 originally caused by: Started by upstream project "libvirt-build" build number 240 originally caused by: Started by an SCM change [EnvInject] - Loading node environment variables. Building remotely on libvirt-fedora-rawhide (libvirt) in workspace <https://ci.centos.org/job/libvirt-go-check/systems=libvirt-fedora-rawhide/ws/> [libvirt-go] $ /bin/sh -xe /tmp/jenkins5570887142416893328.sh + export 'TEST_ARGS=-tags api' + TEST_ARGS='-tags api' + go test -tags api --- FAIL: TestPackUnpack (0.00s) typedparams_test.go:91: Expected 5 output parameters, not 0 FAIL exit status 1 FAIL _<https://ci.centos.org/job/libvirt-go-check/systems=libvirt-fedora-rawhide/ws/> 1.660s Build step 'Execute shell' marked build as failure

See <https://ci.centos.org/job/libvirt-go-check/systems=libvirt-fedora-rawhide/202/display/redirect> ------------------------------------------ Started by upstream project "libvirt-go-check" build number 202 originally caused by: Started by upstream project "libvirt-go-build" build number 206 originally caused by: Started by upstream project "libvirt-build" build number 241 originally caused by: Started by an SCM change Started by an SCM change Started by an SCM change Started by an SCM change [EnvInject] - Loading node environment variables. Building remotely on libvirt-fedora-rawhide (libvirt) in workspace <https://ci.centos.org/job/libvirt-go-check/systems=libvirt-fedora-rawhide/ws/> [libvirt-go] $ /bin/sh -xe /tmp/jenkins4475525270120224071.sh + export 'TEST_ARGS=-tags api' + TEST_ARGS='-tags api' + go test -tags api --- FAIL: TestPackUnpack (0.00s) typedparams_test.go:91: Expected 5 output parameters, not 0 FAIL exit status 1 FAIL _<https://ci.centos.org/job/libvirt-go-check/systems=libvirt-fedora-rawhide/ws/> 5.155s Build step 'Execute shell' marked build as failure

See <https://ci.centos.org/job/libvirt-go-check/systems=libvirt-fedora-rawhide/203/display/redirect> ------------------------------------------ Started by upstream project "libvirt-go-check" build number 203 originally caused by: Started by upstream project "libvirt-go-build" build number 207 originally caused by: Started by upstream project "libvirt-build" build number 242 originally caused by: Started by an SCM change Started by an SCM change Started by an SCM change Started by an SCM change [EnvInject] - Loading node environment variables. Building remotely on libvirt-fedora-rawhide (libvirt) in workspace <https://ci.centos.org/job/libvirt-go-check/systems=libvirt-fedora-rawhide/ws/> [libvirt-go] $ /bin/sh -xe /tmp/jenkins3769292432528947778.sh + export 'TEST_ARGS=-tags api' + TEST_ARGS='-tags api' + go test -tags api --- FAIL: TestPackUnpack (0.00s) typedparams_test.go:91: Expected 5 output parameters, not 0 FAIL exit status 1 FAIL _<https://ci.centos.org/job/libvirt-go-check/systems=libvirt-fedora-rawhide/ws/> 5.528s Build step 'Execute shell' marked build as failure

See <https://ci.centos.org/job/libvirt-go-check/systems=libvirt-fedora-rawhide/204/display/redirect> ------------------------------------------ Started by upstream project "libvirt-go-check" build number 204 originally caused by: Started by upstream project "libvirt-go-build" build number 208 originally caused by: Started by upstream project "libvirt-build" build number 243 originally caused by: Started by an SCM change Started by an SCM change Started by an SCM change Started by an SCM change [EnvInject] - Loading node environment variables. Building remotely on libvirt-fedora-rawhide (libvirt) in workspace <https://ci.centos.org/job/libvirt-go-check/systems=libvirt-fedora-rawhide/ws/> [libvirt-go] $ /bin/sh -xe /tmp/jenkins98300834914187479.sh + export 'TEST_ARGS=-tags api' + TEST_ARGS='-tags api' + go test -tags api --- FAIL: TestPackUnpack (0.00s) typedparams_test.go:91: Expected 5 output parameters, not 0 FAIL exit status 1 FAIL _<https://ci.centos.org/job/libvirt-go-check/systems=libvirt-fedora-rawhide/ws/> 4.612s Build step 'Execute shell' marked build as failure

See <https://ci.centos.org/job/libvirt-go-check/systems=libvirt-fedora-rawhide/205/display/redirect> ------------------------------------------ Started by upstream project "libvirt-go-check" build number 205 originally caused by: Started by upstream project "libvirt-go-build" build number 209 originally caused by: Started by upstream project "libvirt-build" build number 244 originally caused by: Started by an SCM change [EnvInject] - Loading node environment variables. Building remotely on libvirt-fedora-rawhide (libvirt) in workspace <https://ci.centos.org/job/libvirt-go-check/systems=libvirt-fedora-rawhide/ws/> [libvirt-go] $ /bin/sh -xe /tmp/jenkins8285193867320404374.sh + export 'TEST_ARGS=-tags api' + TEST_ARGS='-tags api' + go test -tags api --- FAIL: TestPackUnpack (0.00s) typedparams_test.go:91: Expected 5 output parameters, not 0 FAIL exit status 1 FAIL _<https://ci.centos.org/job/libvirt-go-check/systems=libvirt-fedora-rawhide/ws/> 4.012s Build step 'Execute shell' marked build as failure

See <https://ci.centos.org/job/libvirt-go-check/systems=libvirt-fedora-rawhide/206/display/redirect> ------------------------------------------ Started by upstream project "libvirt-go-check" build number 206 originally caused by: Started by upstream project "libvirt-go-build" build number 210 originally caused by: Started by upstream project "libvirt-build" build number 245 originally caused by: Started by an SCM change [EnvInject] - Loading node environment variables. Building remotely on libvirt-fedora-rawhide (libvirt) in workspace <https://ci.centos.org/job/libvirt-go-check/systems=libvirt-fedora-rawhide/ws/> [libvirt-go] $ /bin/sh -xe /tmp/jenkins5609494290098422317.sh + export 'TEST_ARGS=-tags api' + TEST_ARGS='-tags api' + go test -tags api --- FAIL: TestPackUnpack (0.00s) typedparams_test.go:91: Expected 5 output parameters, not 0 FAIL exit status 1 FAIL _<https://ci.centos.org/job/libvirt-go-check/systems=libvirt-fedora-rawhide/ws/> 1.949s Build step 'Execute shell' marked build as failure

See <https://ci.centos.org/job/libvirt-go-check/systems=libvirt-fedora-rawhide/207/display/redirect> ------------------------------------------ Started by upstream project "libvirt-go-check" build number 207 originally caused by: Started by upstream project "libvirt-go-build" build number 211 originally caused by: Started by upstream project "libvirt-build" build number 246 originally caused by: Started by an SCM change Started by an SCM change Started by an SCM change Started by an SCM change Started by an SCM change Started by an SCM change Started by an SCM change Started by an SCM change [EnvInject] - Loading node environment variables. Building remotely on libvirt-fedora-rawhide (libvirt) in workspace <https://ci.centos.org/job/libvirt-go-check/systems=libvirt-fedora-rawhide/ws/> [libvirt-go] $ /bin/sh -xe /tmp/jenkins6132927141712154956.sh + export 'TEST_ARGS=-tags api' + TEST_ARGS='-tags api' + go test -tags api --- FAIL: TestPackUnpack (0.00s) typedparams_test.go:91: Expected 5 output parameters, not 0 FAIL exit status 1 FAIL _<https://ci.centos.org/job/libvirt-go-check/systems=libvirt-fedora-rawhide/ws/> 3.577s Build step 'Execute shell' marked build as failure

See <https://ci.centos.org/job/libvirt-go-check/systems=libvirt-fedora-rawhide/208/display/redirect> ------------------------------------------ Started by upstream project "libvirt-go-check" build number 208 originally caused by: Started by upstream project "libvirt-go-build" build number 212 originally caused by: Started by an SCM change [EnvInject] - Loading node environment variables. Building remotely on libvirt-fedora-rawhide (libvirt) in workspace <https://ci.centos.org/job/libvirt-go-check/systems=libvirt-fedora-rawhide/ws/> [libvirt-go] $ /bin/sh -xe /tmp/jenkins6568223129878523313.sh + export 'TEST_ARGS=-tags api' + TEST_ARGS='-tags api' + go test -tags api --- FAIL: TestPackUnpack (0.00s) typedparams_test.go:91: Expected 5 output parameters, not 0 FAIL exit status 1 FAIL _<https://ci.centos.org/job/libvirt-go-check/systems=libvirt-fedora-rawhide/ws/> 0.637s Build step 'Execute shell' marked build as failure

See <https://ci.centos.org/job/libvirt-go-check/systems=libvirt-fedora-rawhide/209/display/redirect> ------------------------------------------ Started by upstream project "libvirt-go-check" build number 209 originally caused by: Started by upstream project "libvirt-go-build" build number 213 originally caused by: Started by upstream project "libvirt-build" build number 271 originally caused by: Started by user Libvirt [EnvInject] - Loading node environment variables. Building remotely on libvirt-fedora-rawhide (libvirt) in workspace <https://ci.centos.org/job/libvirt-go-check/systems=libvirt-fedora-rawhide/ws/> [libvirt-go] $ /bin/sh -xe /tmp/jenkins1490432291112518446.sh + export 'TEST_ARGS=-tags api' + TEST_ARGS='-tags api' + go test -tags api --- FAIL: TestPackUnpack (0.00s) typedparams_test.go:91: Expected 5 output parameters, not 0 FAIL exit status 1 FAIL _<https://ci.centos.org/job/libvirt-go-check/systems=libvirt-fedora-rawhide/ws/> 2.845s Build step 'Execute shell' marked build as failure

See <https://ci.centos.org/job/libvirt-go-check/systems=libvirt-fedora-rawhide/210/display/redirect> ------------------------------------------ Started by upstream project "libvirt-go-check" build number 210 originally caused by: Started by upstream project "libvirt-go-build" build number 214 originally caused by: Started by upstream project "libvirt-build" build number 272 originally caused by: Started by an SCM change [EnvInject] - Loading node environment variables. Building remotely on libvirt-fedora-rawhide (libvirt) in workspace <https://ci.centos.org/job/libvirt-go-check/systems=libvirt-fedora-rawhide/ws/> [libvirt-go] $ /bin/sh -xe /tmp/jenkins7817984863665025481.sh + export 'TEST_ARGS=-tags api' + TEST_ARGS='-tags api' + go test -tags api --- FAIL: TestPackUnpack (0.00s) typedparams_test.go:91: Expected 5 output parameters, not 0 FAIL exit status 1 FAIL _<https://ci.centos.org/job/libvirt-go-check/systems=libvirt-fedora-rawhide/ws/> 3.809s Build step 'Execute shell' marked build as failure

See <https://ci.centos.org/job/libvirt-go-check/systems=libvirt-fedora-rawhide/211/display/redirect> ------------------------------------------ Started by upstream project "libvirt-go-check" build number 211 originally caused by: Started by upstream project "libvirt-go-build" build number 215 originally caused by: Started by an SCM change Started by an SCM change Started by upstream project "libvirt-build" build number 273 originally caused by: Started by an SCM change Started by an SCM change Started by an SCM change Started by an SCM change Started by an SCM change [EnvInject] - Loading node environment variables. Building remotely on libvirt-fedora-rawhide (libvirt) in workspace <https://ci.centos.org/job/libvirt-go-check/systems=libvirt-fedora-rawhide/ws/> [libvirt-go] $ /bin/sh -xe /tmp/jenkins8495460561461149785.sh + export 'TEST_ARGS=-tags api' + TEST_ARGS='-tags api' + go test -tags api Missing function 'virTypedParamsClear' Missing macro 'VIR_TYPED_PARAM_FIELD_LENGTH' Missing enum 'VIR_TYPED_PARAM_BOOLEAN' Missing enum 'VIR_TYPED_PARAM_DOUBLE' Missing enum 'VIR_TYPED_PARAM_INT' Missing enum 'VIR_TYPED_PARAM_LLONG' Missing enum 'VIR_TYPED_PARAM_STRING' Missing enum 'VIR_TYPED_PARAM_UINT' Missing enum 'VIR_TYPED_PARAM_ULLONG' --- FAIL: TestAPICoverage (1.05s) panic: Missing symbols found [recovered] panic: Missing symbols found goroutine 19 [running]: testing.tRunner.func1(0xc0000c2100) /usr/lib/golang/src/testing/testing.go:827 +0x388 panic(0x5cd4e0, 0x642c30) /usr/lib/golang/src/runtime/panic.go:522 +0x1b5 _<https://ci.centos.org/job/libvirt-go-check/systems=libvirt-fedora-rawhide/ws/.TestAPICoverage(0xc0000c2100)> <https://ci.centos.org/job/libvirt-go-check/systems=libvirt-fedora-rawhide/ws/api_test.go>:507 +0x551 testing.tRunner(0xc0000c2100, 0x61d160) /usr/lib/golang/src/testing/testing.go:862 +0xc0 created by testing.(*T).Run /usr/lib/golang/src/testing/testing.go:913 +0x357 exit status 2 FAIL _<https://ci.centos.org/job/libvirt-go-check/systems=libvirt-fedora-rawhide/ws/> 1.501s Build step 'Execute shell' marked build as failure

participants (1)
-
ci@centos.org