[Libvirt-ci] Build failed in Jenkins: libvirt-go-check » libvirt-debian-9 #329

See <https://ci.centos.org/job/libvirt-go-check/systems=libvirt-debian-9/329/display/redirect> ------------------------------------------ Started by upstream project "libvirt-go-check" build number 329 originally caused by: Started by upstream project "libvirt-go-build" build number 335 originally caused by: Started by upstream project "libvirt-build" build number 424 originally caused by: Started by an SCM change Started by an SCM change Started by an SCM change Started by an SCM change Started by an SCM change Started by an SCM change Started by an SCM change Started by an SCM change Started by an SCM change [EnvInject] - Loading node environment variables. Building remotely on libvirt-debian-9 (libvirt) in workspace <https://ci.centos.org/job/libvirt-go-check/systems=libvirt-debian-9/ws/> [libvirt-go] $ /bin/sh -xe /tmp/jenkins5715722844702116400.sh + export TEST_ARGS=-tags api + go test -tags api Missing enum 'VIR_ERR_INVALID_DOMAIN_CHECKPOINT' Missing enum 'VIR_ERR_NO_DOMAIN_BACKUP' Missing enum 'VIR_ERR_NO_DOMAIN_CHECKPOINT' Missing enum 'VIR_FROM_DOMAIN_CHECKPOINT' --- FAIL: TestAPICoverage (0.51s) panic: Missing symbols found [recovered] panic: Missing symbols found goroutine 19 [running]: panic(0x5650115a51c0, 0xc420432590) /usr/lib/go-1.7/src/runtime/panic.go:500 +0x1a1 testing.tRunner.func1(0xc420086180) /usr/lib/go-1.7/src/testing/testing.go:579 +0x25d panic(0x5650115a51c0, 0xc420432590) /usr/lib/go-1.7/src/runtime/panic.go:458 +0x243 _<https://ci.centos.org/job/libvirt-go-check/systems=libvirt-debian-9/ws/.TestAPICoverage(0xc420086180)> <https://ci.centos.org/job/libvirt-go-check/systems=libvirt-debian-9/ws/api_test.go>:501 +0x5ff testing.tRunner(0xc420086180, 0x5650115f8908) /usr/lib/go-1.7/src/testing/testing.go:610 +0x81 created by testing.(*T).Run /usr/lib/go-1.7/src/testing/testing.go:646 +0x2ec exit status 2 FAIL _<https://ci.centos.org/job/libvirt-go-check/systems=libvirt-debian-9/ws/> 0.614s Build step 'Execute shell' marked build as failure

See <https://ci.centos.org/job/libvirt-go-check/systems=libvirt-debian-9/330/display/redirect> ------------------------------------------ Started by upstream project "libvirt-go-check" build number 330 originally caused by: Started by upstream project "libvirt-go-build" build number 336 originally caused by: Started by upstream project "libvirt-build" build number 426 originally caused by: Started by an SCM change Started by an SCM change [EnvInject] - Loading node environment variables. Building remotely on libvirt-debian-9 (libvirt) in workspace <https://ci.centos.org/job/libvirt-go-check/systems=libvirt-debian-9/ws/> [libvirt-go] $ /bin/sh -xe /tmp/jenkins2282965032397390283.sh + export TEST_ARGS=-tags api + go test -tags api Missing macro 'VIR_MIGRATE_PARAM_PARALLEL_CONNECTIONS' Missing enum 'VIR_ERR_INVALID_DOMAIN_CHECKPOINT' Missing enum 'VIR_ERR_NO_DOMAIN_BACKUP' Missing enum 'VIR_ERR_NO_DOMAIN_CHECKPOINT' Missing enum 'VIR_FROM_DOMAIN_CHECKPOINT' Missing enum 'VIR_MIGRATE_PARALLEL' --- FAIL: TestAPICoverage (0.41s) panic: Missing symbols found [recovered] panic: Missing symbols found goroutine 5 [running]: panic(0x55fa98b511c0, 0xc42042c7d0) /usr/lib/go-1.7/src/runtime/panic.go:500 +0x1a1 testing.tRunner.func1(0xc420078180) /usr/lib/go-1.7/src/testing/testing.go:579 +0x25d panic(0x55fa98b511c0, 0xc42042c7d0) /usr/lib/go-1.7/src/runtime/panic.go:458 +0x243 _<https://ci.centos.org/job/libvirt-go-check/systems=libvirt-debian-9/ws/.TestAPICoverage(0xc420078180)> <https://ci.centos.org/job/libvirt-go-check/systems=libvirt-debian-9/ws/api_test.go>:501 +0x5ff testing.tRunner(0xc420078180, 0x55fa98ba4908) /usr/lib/go-1.7/src/testing/testing.go:610 +0x81 created by testing.(*T).Run /usr/lib/go-1.7/src/testing/testing.go:646 +0x2ec exit status 2 FAIL _<https://ci.centos.org/job/libvirt-go-check/systems=libvirt-debian-9/ws/> 0.505s Build step 'Execute shell' marked build as failure

See <https://ci.centos.org/job/libvirt-go-check/systems=libvirt-debian-9/331/display/redirect> ------------------------------------------ Started by upstream project "libvirt-go-check" build number 331 originally caused by: Started by upstream project "libvirt-go-build" build number 337 originally caused by: Started by upstream project "libvirt-build" build number 428 originally caused by: Started by an SCM change [EnvInject] - Loading node environment variables. Building remotely on libvirt-debian-9 (libvirt) in workspace <https://ci.centos.org/job/libvirt-go-check/systems=libvirt-debian-9/ws/> [libvirt-go] $ /bin/sh -xe /tmp/jenkins7837006371076983489.sh + export TEST_ARGS=-tags api + go test -tags api Missing macro 'VIR_MIGRATE_PARAM_PARALLEL_CONNECTIONS' Missing enum 'VIR_ERR_INVALID_DOMAIN_CHECKPOINT' Missing enum 'VIR_ERR_NO_DOMAIN_BACKUP' Missing enum 'VIR_ERR_NO_DOMAIN_CHECKPOINT' Missing enum 'VIR_FROM_DOMAIN_CHECKPOINT' Missing enum 'VIR_MIGRATE_PARALLEL' --- FAIL: TestAPICoverage (0.72s) panic: Missing symbols found [recovered] panic: Missing symbols found goroutine 5 [running]: panic(0x55f013acb1c0, 0xc420432740) /usr/lib/go-1.7/src/runtime/panic.go:500 +0x1a1 testing.tRunner.func1(0xc420078180) /usr/lib/go-1.7/src/testing/testing.go:579 +0x25d panic(0x55f013acb1c0, 0xc420432740) /usr/lib/go-1.7/src/runtime/panic.go:458 +0x243 _<https://ci.centos.org/job/libvirt-go-check/systems=libvirt-debian-9/ws/.TestAPICoverage(0xc420078180)> <https://ci.centos.org/job/libvirt-go-check/systems=libvirt-debian-9/ws/api_test.go>:501 +0x5ff testing.tRunner(0xc420078180, 0x55f013b1e908) /usr/lib/go-1.7/src/testing/testing.go:610 +0x81 created by testing.(*T).Run /usr/lib/go-1.7/src/testing/testing.go:646 +0x2ec exit status 2 FAIL _<https://ci.centos.org/job/libvirt-go-check/systems=libvirt-debian-9/ws/> 0.836s Build step 'Execute shell' marked build as failure

See <https://ci.centos.org/job/libvirt-go-check/systems=libvirt-debian-9/332/display/redirect> ------------------------------------------ Started by upstream project "libvirt-go-check" build number 332 originally caused by: Started by upstream project "libvirt-go-build" build number 338 originally caused by: Started by upstream project "libvirt-build" build number 429 originally caused by: Started by an SCM change [EnvInject] - Loading node environment variables. Building remotely on libvirt-debian-9 (libvirt) in workspace <https://ci.centos.org/job/libvirt-go-check/systems=libvirt-debian-9/ws/> [libvirt-go] $ /bin/sh -xe /tmp/jenkins1193179848697509215.sh + export TEST_ARGS=-tags api + go test -tags api Missing macro 'VIR_MIGRATE_PARAM_PARALLEL_CONNECTIONS' Missing enum 'VIR_ERR_INVALID_DOMAIN_CHECKPOINT' Missing enum 'VIR_ERR_NO_DOMAIN_BACKUP' Missing enum 'VIR_ERR_NO_DOMAIN_CHECKPOINT' Missing enum 'VIR_FROM_DOMAIN_CHECKPOINT' Missing enum 'VIR_MIGRATE_PARALLEL' --- FAIL: TestAPICoverage (0.80s) panic: Missing symbols found [recovered] panic: Missing symbols found goroutine 5 [running]: panic(0x55be558261c0, 0xc420430580) /usr/lib/go-1.7/src/runtime/panic.go:500 +0x1a1 testing.tRunner.func1(0xc420078180) /usr/lib/go-1.7/src/testing/testing.go:579 +0x25d panic(0x55be558261c0, 0xc420430580) /usr/lib/go-1.7/src/runtime/panic.go:458 +0x243 _<https://ci.centos.org/job/libvirt-go-check/systems=libvirt-debian-9/ws/.TestAPICoverage(0xc420078180)> <https://ci.centos.org/job/libvirt-go-check/systems=libvirt-debian-9/ws/api_test.go>:501 +0x5ff testing.tRunner(0xc420078180, 0x55be55879908) /usr/lib/go-1.7/src/testing/testing.go:610 +0x81 created by testing.(*T).Run /usr/lib/go-1.7/src/testing/testing.go:646 +0x2ec exit status 2 FAIL _<https://ci.centos.org/job/libvirt-go-check/systems=libvirt-debian-9/ws/> 0.993s Build step 'Execute shell' marked build as failure

See <https://ci.centos.org/job/libvirt-go-check/systems=libvirt-debian-9/333/display/redirect> ------------------------------------------ Started by upstream project "libvirt-go-check" build number 333 originally caused by: Started by upstream project "libvirt-go-build" build number 339 originally caused by: Started by upstream project "libvirt-build" build number 430 originally caused by: Started by an SCM change [EnvInject] - Loading node environment variables. Building remotely on libvirt-debian-9 (libvirt) in workspace <https://ci.centos.org/job/libvirt-go-check/systems=libvirt-debian-9/ws/> [libvirt-go] $ /bin/sh -xe /tmp/jenkins3998216783566539591.sh + export TEST_ARGS=-tags api + go test -tags api Missing macro 'VIR_MIGRATE_PARAM_PARALLEL_CONNECTIONS' Missing enum 'VIR_ERR_INVALID_DOMAIN_CHECKPOINT' Missing enum 'VIR_ERR_NO_DOMAIN_BACKUP' Missing enum 'VIR_ERR_NO_DOMAIN_CHECKPOINT' Missing enum 'VIR_FROM_DOMAIN_CHECKPOINT' Missing enum 'VIR_MIGRATE_PARALLEL' --- FAIL: TestAPICoverage (0.34s) panic: Missing symbols found [recovered] panic: Missing symbols found goroutine 5 [running]: panic(0x55de183891c0, 0xc4204305c0) /usr/lib/go-1.7/src/runtime/panic.go:500 +0x1a1 testing.tRunner.func1(0xc420078180) /usr/lib/go-1.7/src/testing/testing.go:579 +0x25d panic(0x55de183891c0, 0xc4204305c0) /usr/lib/go-1.7/src/runtime/panic.go:458 +0x243 _<https://ci.centos.org/job/libvirt-go-check/systems=libvirt-debian-9/ws/.TestAPICoverage(0xc420078180)> <https://ci.centos.org/job/libvirt-go-check/systems=libvirt-debian-9/ws/api_test.go>:501 +0x5ff testing.tRunner(0xc420078180, 0x55de183dc908) /usr/lib/go-1.7/src/testing/testing.go:610 +0x81 created by testing.(*T).Run /usr/lib/go-1.7/src/testing/testing.go:646 +0x2ec exit status 2 FAIL _<https://ci.centos.org/job/libvirt-go-check/systems=libvirt-debian-9/ws/> 0.388s Build step 'Execute shell' marked build as failure

participants (1)
-
ci@centos.org