[Libvirt-ci] Build failed in Jenkins: libvirt-go-master-check » libvirt-debian-8 #1057

See <https://ci.centos.org/job/libvirt-go-master-check/systems=libvirt-debian-8/1057/display/redirect> ------------------------------------------ Started by upstream project "libvirt-go-master-check" build number 1057 originally caused by: Started by upstream project "libvirt-go-master-build" build number 1068 originally caused by: Started by upstream project "libvirt-master-build" build number 1465 originally caused by: Started by an SCM change [EnvInject] - Loading node environment variables. Building remotely on libvirt-debian-8 (libvirt) in workspace <https://ci.centos.org/job/libvirt-go-master-check/systems=libvirt-debian-8/ws/> [libvirt-go-master] $ /bin/sh -xe /tmp/jenkins3709190768133479490.sh + export TEST_ARGS=-tags api + go test -tags api 2018-05-28 12:25:38.978+0000: 4329: info : libvirt version: 4.4.0 2018-05-28 12:25:38.978+0000: 4329: info : hostname: libvirt-debian-8 2018-05-28 12:25:38.978+0000: 4329: warning : virEventRegisterImpl:245 : Ignoring attempt to replace registered event loop 2018-05-28 12:25:38.995+0000: 4329: warning : virEventRegisterImpl:245 : Ignoring attempt to replace registered event loop 2018-05-28 12:25:38.995+0000: 4329: warning : virEventRegisterImpl:245 : Ignoring attempt to replace registered event loop Missing function 'virDomainDetachDeviceAlias' --- FAIL: TestAPICoverage (0.81 seconds) panic: Missing symbols found [recovered] panic: Missing symbols found goroutine 20 [running]: runtime.panic(0x5e6880, 0xc208101960) /usr/lib/go/src/pkg/runtime/panic.c:279 +0xf5 testing.func·006() /usr/lib/go/src/pkg/testing/testing.go:416 +0x176 runtime.panic(0x5e6880, 0xc208101960) /usr/lib/go/src/pkg/runtime/panic.c:248 +0x18d _<https://ci.centos.org/job/libvirt-go-master-check/systems=libvirt-debian-8/ws/.TestAPICoverage(0xc208026090)> <https://ci.centos.org/job/libvirt-go-master-check/systems=libvirt-debian-8/ws/api_test.go>:504 +0x515 testing.tRunner(0xc208026090, 0xa01300) /usr/lib/go/src/pkg/testing/testing.go:422 +0x8b created by testing.RunTests /usr/lib/go/src/pkg/testing/testing.go:504 +0x8db goroutine 16 [chan receive]: testing.RunTests(0x70f8c0, 0xa01300, 0x77, 0x77, 0x41c001) /usr/lib/go/src/pkg/testing/testing.go:505 +0x923 testing.Main(0x70f8c0, 0xa01300, 0x77, 0x77, 0xa14700, 0x0, 0x0, 0xa14700, 0x0, 0x0) /usr/lib/go/src/pkg/testing/testing.go:435 +0x84 main.main() _<https://ci.centos.org/job/libvirt-go-master-check/systems=libvirt-debian-8/ws/_test/_testmain.go>:283 +0x9c goroutine 19 [finalizer wait]: runtime.park(0x42b430, 0xa10650, 0x9ffec9) /usr/lib/go/src/pkg/runtime/proc.c:1369 +0x89 runtime.parkunlock(0xa10650, 0x9ffec9) /usr/lib/go/src/pkg/runtime/proc.c:1385 +0x3b runfinq() /usr/lib/go/src/pkg/runtime/mgc0.c:2644 +0xcf runtime.goexit() /usr/lib/go/src/pkg/runtime/proc.c:1445 goroutine 17 [syscall]: runtime.goexit() /usr/lib/go/src/pkg/runtime/proc.c:1445 exit status 2 FAIL _<https://ci.centos.org/job/libvirt-go-master-check/systems=libvirt-debian-8/ws/> 0.937s Build step 'Execute shell' marked build as failure

See <https://ci.centos.org/job/libvirt-go-master-check/systems=libvirt-debian-8/1058/display/redirect> ------------------------------------------ Started by upstream project "libvirt-go-master-check" build number 1058 originally caused by: Started by upstream project "libvirt-go-master-build" build number 1069 originally caused by: Started by upstream project "libvirt-master-build" build number 1466 originally caused by: Started by an SCM change [EnvInject] - Loading node environment variables. Building remotely on libvirt-debian-8 (libvirt) in workspace <https://ci.centos.org/job/libvirt-go-master-check/systems=libvirt-debian-8/ws/> [libvirt-go-master] $ /bin/sh -xe /tmp/jenkins5797779262402912492.sh + export TEST_ARGS=-tags api + go test -tags api 2018-05-28 15:25:52.432+0000: 8748: info : libvirt version: 4.4.0 2018-05-28 15:25:52.432+0000: 8748: info : hostname: libvirt-debian-8 2018-05-28 15:25:52.432+0000: 8748: warning : virEventRegisterImpl:245 : Ignoring attempt to replace registered event loop 2018-05-28 15:25:52.432+0000: 8748: warning : virEventRegisterImpl:245 : Ignoring attempt to replace registered event loop 2018-05-28 15:25:52.433+0000: 8748: warning : virEventRegisterImpl:245 : Ignoring attempt to replace registered event loop Missing function 'virConnectBaselineHypervisorCPU' Missing function 'virConnectCompareHypervisorCPU' Missing function 'virDomainDetachDeviceAlias' --- FAIL: TestAPICoverage (0.35 seconds) panic: Missing symbols found [recovered] panic: Missing symbols found goroutine 20 [running]: runtime.panic(0x5e6880, 0xc20810db00) /usr/lib/go/src/pkg/runtime/panic.c:279 +0xf5 testing.func·006() /usr/lib/go/src/pkg/testing/testing.go:416 +0x176 runtime.panic(0x5e6880, 0xc20810db00) /usr/lib/go/src/pkg/runtime/panic.c:248 +0x18d _<https://ci.centos.org/job/libvirt-go-master-check/systems=libvirt-debian-8/ws/.TestAPICoverage(0xc208026090)> <https://ci.centos.org/job/libvirt-go-master-check/systems=libvirt-debian-8/ws/api_test.go>:504 +0x515 testing.tRunner(0xc208026090, 0xa01300) /usr/lib/go/src/pkg/testing/testing.go:422 +0x8b created by testing.RunTests /usr/lib/go/src/pkg/testing/testing.go:504 +0x8db goroutine 16 [chan receive]: testing.RunTests(0x70f8c0, 0xa01300, 0x77, 0x77, 0x41c001) /usr/lib/go/src/pkg/testing/testing.go:505 +0x923 testing.Main(0x70f8c0, 0xa01300, 0x77, 0x77, 0xa14700, 0x0, 0x0, 0xa14700, 0x0, 0x0) /usr/lib/go/src/pkg/testing/testing.go:435 +0x84 main.main() _<https://ci.centos.org/job/libvirt-go-master-check/systems=libvirt-debian-8/ws/_test/_testmain.go>:283 +0x9c goroutine 19 [finalizer wait]: runtime.park(0x42b430, 0xa10650, 0x9ffec9) /usr/lib/go/src/pkg/runtime/proc.c:1369 +0x89 runtime.parkunlock(0xa10650, 0x9ffec9) /usr/lib/go/src/pkg/runtime/proc.c:1385 +0x3b runfinq() /usr/lib/go/src/pkg/runtime/mgc0.c:2644 +0xcf runtime.goexit() /usr/lib/go/src/pkg/runtime/proc.c:1445 goroutine 17 [syscall]: runtime.goexit() /usr/lib/go/src/pkg/runtime/proc.c:1445 exit status 2 FAIL _<https://ci.centos.org/job/libvirt-go-master-check/systems=libvirt-debian-8/ws/> 0.416s Build step 'Execute shell' marked build as failure

See <https://ci.centos.org/job/libvirt-go-master-check/systems=libvirt-debian-8/1059/display/redirect> ------------------------------------------ Started by upstream project "libvirt-go-master-check" build number 1059 originally caused by: Started by upstream project "libvirt-go-master-build" build number 1070 originally caused by: Started by upstream project "libvirt-master-build" build number 1467 originally caused by: Started by an SCM change Started by an SCM change [EnvInject] - Loading node environment variables. Building remotely on libvirt-debian-8 (libvirt) in workspace <https://ci.centos.org/job/libvirt-go-master-check/systems=libvirt-debian-8/ws/> [libvirt-go-master] $ /bin/sh -xe /tmp/jenkins60708120294009662.sh + export TEST_ARGS=-tags api + go test -tags api 2018-05-28 16:50:26.974+0000: 8736: info : libvirt version: 4.4.0 2018-05-28 16:50:26.974+0000: 8736: info : hostname: libvirt-debian-8 2018-05-28 16:50:26.974+0000: 8736: warning : virEventRegisterImpl:245 : Ignoring attempt to replace registered event loop 2018-05-28 16:50:26.975+0000: 8736: warning : virEventRegisterImpl:245 : Ignoring attempt to replace registered event loop 2018-05-28 16:50:26.977+0000: 8736: warning : virEventRegisterImpl:245 : Ignoring attempt to replace registered event loop Missing function 'virConnectBaselineHypervisorCPU' Missing function 'virConnectCompareHypervisorCPU' Missing function 'virDomainDetachDeviceAlias' --- FAIL: TestAPICoverage (0.33 seconds) panic: Missing symbols found [recovered] panic: Missing symbols found goroutine 20 [running]: runtime.panic(0x5e6880, 0xc2080ae8e0) /usr/lib/go/src/pkg/runtime/panic.c:279 +0xf5 testing.func·006() /usr/lib/go/src/pkg/testing/testing.go:416 +0x176 runtime.panic(0x5e6880, 0xc2080ae8e0) /usr/lib/go/src/pkg/runtime/panic.c:248 +0x18d _<https://ci.centos.org/job/libvirt-go-master-check/systems=libvirt-debian-8/ws/.TestAPICoverage(0xc208026090)> <https://ci.centos.org/job/libvirt-go-master-check/systems=libvirt-debian-8/ws/api_test.go>:504 +0x515 testing.tRunner(0xc208026090, 0xa01300) /usr/lib/go/src/pkg/testing/testing.go:422 +0x8b created by testing.RunTests /usr/lib/go/src/pkg/testing/testing.go:504 +0x8db goroutine 16 [chan receive]: testing.RunTests(0x70f8c0, 0xa01300, 0x77, 0x77, 0x41c001) /usr/lib/go/src/pkg/testing/testing.go:505 +0x923 testing.Main(0x70f8c0, 0xa01300, 0x77, 0x77, 0xa14700, 0x0, 0x0, 0xa14700, 0x0, 0x0) /usr/lib/go/src/pkg/testing/testing.go:435 +0x84 main.main() _<https://ci.centos.org/job/libvirt-go-master-check/systems=libvirt-debian-8/ws/_test/_testmain.go>:283 +0x9c goroutine 19 [finalizer wait]: runtime.park(0x42b430, 0xa10650, 0x9ffec9) /usr/lib/go/src/pkg/runtime/proc.c:1369 +0x89 runtime.parkunlock(0xa10650, 0x9ffec9) /usr/lib/go/src/pkg/runtime/proc.c:1385 +0x3b runfinq() /usr/lib/go/src/pkg/runtime/mgc0.c:2644 +0xcf runtime.goexit() /usr/lib/go/src/pkg/runtime/proc.c:1445 goroutine 17 [syscall]: runtime.goexit() /usr/lib/go/src/pkg/runtime/proc.c:1445 exit status 2 FAIL _<https://ci.centos.org/job/libvirt-go-master-check/systems=libvirt-debian-8/ws/> 0.399s Build step 'Execute shell' marked build as failure

See <https://ci.centos.org/job/libvirt-go-master-check/systems=libvirt-debian-8/1060/display/redirect> ------------------------------------------ Started by upstream project "libvirt-go-master-check" build number 1060 originally caused by: Started by upstream project "libvirt-go-master-build" build number 1071 originally caused by: Started by upstream project "libvirt-master-build" build number 1468 originally caused by: Started by an SCM change [EnvInject] - Loading node environment variables. Building remotely on libvirt-debian-8 (libvirt) in workspace <https://ci.centos.org/job/libvirt-go-master-check/systems=libvirt-debian-8/ws/> [libvirt-go-master] $ /bin/sh -xe /tmp/jenkins3399794405530740739.sh + export TEST_ARGS=-tags api + go test -tags api 2018-05-29 09:47:31.646+0000: 10625: info : libvirt version: 4.4.0 2018-05-29 09:47:31.646+0000: 10625: info : hostname: libvirt-debian-8 2018-05-29 09:47:31.646+0000: 10625: warning : virEventRegisterImpl:245 : Ignoring attempt to replace registered event loop 2018-05-29 09:47:31.646+0000: 10625: warning : virEventRegisterImpl:245 : Ignoring attempt to replace registered event loop 2018-05-29 09:47:31.646+0000: 10625: warning : virEventRegisterImpl:245 : Ignoring attempt to replace registered event loop Missing function 'virConnectBaselineHypervisorCPU' Missing function 'virConnectCompareHypervisorCPU' Missing function 'virDomainDetachDeviceAlias' --- FAIL: TestAPICoverage (0.35 seconds) panic: Missing symbols found [recovered] panic: Missing symbols found goroutine 20 [running]: runtime.panic(0x5e6880, 0xc2080d6e10) /usr/lib/go/src/pkg/runtime/panic.c:279 +0xf5 testing.func·006() /usr/lib/go/src/pkg/testing/testing.go:416 +0x176 runtime.panic(0x5e6880, 0xc2080d6e10) /usr/lib/go/src/pkg/runtime/panic.c:248 +0x18d _<https://ci.centos.org/job/libvirt-go-master-check/systems=libvirt-debian-8/ws/.TestAPICoverage(0xc208026090)> <https://ci.centos.org/job/libvirt-go-master-check/systems=libvirt-debian-8/ws/api_test.go>:504 +0x515 testing.tRunner(0xc208026090, 0xa01300) /usr/lib/go/src/pkg/testing/testing.go:422 +0x8b created by testing.RunTests /usr/lib/go/src/pkg/testing/testing.go:504 +0x8db goroutine 16 [chan receive]: testing.RunTests(0x70f8c0, 0xa01300, 0x77, 0x77, 0x41c001) /usr/lib/go/src/pkg/testing/testing.go:505 +0x923 testing.Main(0x70f8c0, 0xa01300, 0x77, 0x77, 0xa14700, 0x0, 0x0, 0xa14700, 0x0, 0x0) /usr/lib/go/src/pkg/testing/testing.go:435 +0x84 main.main() _<https://ci.centos.org/job/libvirt-go-master-check/systems=libvirt-debian-8/ws/_test/_testmain.go>:283 +0x9c goroutine 19 [finalizer wait]: runtime.park(0x42b430, 0xa10650, 0x9ffec9) /usr/lib/go/src/pkg/runtime/proc.c:1369 +0x89 runtime.parkunlock(0xa10650, 0x9ffec9) /usr/lib/go/src/pkg/runtime/proc.c:1385 +0x3b runfinq() /usr/lib/go/src/pkg/runtime/mgc0.c:2644 +0xcf runtime.goexit() /usr/lib/go/src/pkg/runtime/proc.c:1445 goroutine 17 [syscall]: runtime.goexit() /usr/lib/go/src/pkg/runtime/proc.c:1445 exit status 2 FAIL _<https://ci.centos.org/job/libvirt-go-master-check/systems=libvirt-debian-8/ws/> 0.400s Build step 'Execute shell' marked build as failure

See <https://ci.centos.org/job/libvirt-go-master-check/systems=libvirt-debian-8/1061/display/redirect> ------------------------------------------ Started by upstream project "libvirt-go-master-check" build number 1061 originally caused by: Started by upstream project "libvirt-go-master-build" build number 1072 originally caused by: Started by upstream project "libvirt-master-build" build number 1469 originally caused by: Started by an SCM change [EnvInject] - Loading node environment variables. Building remotely on libvirt-debian-8 (libvirt) in workspace <https://ci.centos.org/job/libvirt-go-master-check/systems=libvirt-debian-8/ws/> [libvirt-go-master] $ /bin/sh -xe /tmp/jenkins2563854902064248520.sh + export TEST_ARGS=-tags api + go test -tags api 2018-05-29 13:29:04.893+0000: 11860: info : libvirt version: 4.4.0 2018-05-29 13:29:04.893+0000: 11860: info : hostname: libvirt-debian-8 2018-05-29 13:29:04.893+0000: 11860: warning : virEventRegisterImpl:245 : Ignoring attempt to replace registered event loop 2018-05-29 13:29:04.893+0000: 11860: warning : virEventRegisterImpl:245 : Ignoring attempt to replace registered event loop 2018-05-29 13:29:04.896+0000: 11860: warning : virEventRegisterImpl:245 : Ignoring attempt to replace registered event loop Missing function 'virConnectBaselineHypervisorCPU' Missing function 'virConnectCompareHypervisorCPU' Missing function 'virDomainDetachDeviceAlias' --- FAIL: TestAPICoverage (0.37 seconds) panic: Missing symbols found [recovered] panic: Missing symbols found goroutine 20 [running]: runtime.panic(0x5e6880, 0xc208104050) /usr/lib/go/src/pkg/runtime/panic.c:279 +0xf5 testing.func·006() /usr/lib/go/src/pkg/testing/testing.go:416 +0x176 runtime.panic(0x5e6880, 0xc208104050) /usr/lib/go/src/pkg/runtime/panic.c:248 +0x18d _<https://ci.centos.org/job/libvirt-go-master-check/systems=libvirt-debian-8/ws/.TestAPICoverage(0xc208026090)> <https://ci.centos.org/job/libvirt-go-master-check/systems=libvirt-debian-8/ws/api_test.go>:504 +0x515 testing.tRunner(0xc208026090, 0xa01300) /usr/lib/go/src/pkg/testing/testing.go:422 +0x8b created by testing.RunTests /usr/lib/go/src/pkg/testing/testing.go:504 +0x8db goroutine 16 [chan receive]: testing.RunTests(0x70f8c0, 0xa01300, 0x77, 0x77, 0x41c001) /usr/lib/go/src/pkg/testing/testing.go:505 +0x923 testing.Main(0x70f8c0, 0xa01300, 0x77, 0x77, 0xa14700, 0x0, 0x0, 0xa14700, 0x0, 0x0) /usr/lib/go/src/pkg/testing/testing.go:435 +0x84 main.main() _<https://ci.centos.org/job/libvirt-go-master-check/systems=libvirt-debian-8/ws/_test/_testmain.go>:283 +0x9c goroutine 19 [finalizer wait]: runtime.park(0x42b430, 0xa10650, 0x9ffec9) /usr/lib/go/src/pkg/runtime/proc.c:1369 +0x89 runtime.parkunlock(0xa10650, 0x9ffec9) /usr/lib/go/src/pkg/runtime/proc.c:1385 +0x3b runfinq() /usr/lib/go/src/pkg/runtime/mgc0.c:2644 +0xcf runtime.goexit() /usr/lib/go/src/pkg/runtime/proc.c:1445 goroutine 17 [syscall]: runtime.goexit() /usr/lib/go/src/pkg/runtime/proc.c:1445 exit status 2 FAIL _<https://ci.centos.org/job/libvirt-go-master-check/systems=libvirt-debian-8/ws/> 0.635s Build step 'Execute shell' marked build as failure

See <https://ci.centos.org/job/libvirt-go-master-check/systems=libvirt-debian-8/1062/display/redirect> ------------------------------------------ Started by upstream project "libvirt-go-master-check" build number 1062 originally caused by: Started by upstream project "libvirt-go-master-build" build number 1073 originally caused by: Started by upstream project "libvirt-master-build" build number 1470 originally caused by: Started by an SCM change [EnvInject] - Loading node environment variables. Building remotely on libvirt-debian-8 (libvirt) in workspace <https://ci.centos.org/job/libvirt-go-master-check/systems=libvirt-debian-8/ws/> [libvirt-go-master] $ /bin/sh -xe /tmp/jenkins1461599988150674691.sh + export TEST_ARGS=-tags api + go test -tags api 2018-05-29 15:13:17.364+0000: 4403: info : libvirt version: 4.4.0 2018-05-29 15:13:17.364+0000: 4403: info : hostname: libvirt-debian-8 2018-05-29 15:13:17.364+0000: 4403: warning : virEventRegisterImpl:245 : Ignoring attempt to replace registered event loop 2018-05-29 15:13:17.369+0000: 4403: warning : virEventRegisterImpl:245 : Ignoring attempt to replace registered event loop 2018-05-29 15:13:17.369+0000: 4403: warning : virEventRegisterImpl:245 : Ignoring attempt to replace registered event loop Missing function 'virConnectBaselineHypervisorCPU' Missing function 'virConnectCompareHypervisorCPU' Missing function 'virDomainDetachDeviceAlias' --- FAIL: TestAPICoverage (0.37 seconds) panic: Missing symbols found [recovered] panic: Missing symbols found goroutine 20 [running]: runtime.panic(0x5e6880, 0xc20810f680) /usr/lib/go/src/pkg/runtime/panic.c:279 +0xf5 testing.func·006() /usr/lib/go/src/pkg/testing/testing.go:416 +0x176 runtime.panic(0x5e6880, 0xc20810f680) /usr/lib/go/src/pkg/runtime/panic.c:248 +0x18d _<https://ci.centos.org/job/libvirt-go-master-check/systems=libvirt-debian-8/ws/.TestAPICoverage(0xc208026090)> <https://ci.centos.org/job/libvirt-go-master-check/systems=libvirt-debian-8/ws/api_test.go>:504 +0x515 testing.tRunner(0xc208026090, 0xa01300) /usr/lib/go/src/pkg/testing/testing.go:422 +0x8b created by testing.RunTests /usr/lib/go/src/pkg/testing/testing.go:504 +0x8db goroutine 16 [chan receive]: testing.RunTests(0x70f8c0, 0xa01300, 0x77, 0x77, 0x41c001) /usr/lib/go/src/pkg/testing/testing.go:505 +0x923 testing.Main(0x70f8c0, 0xa01300, 0x77, 0x77, 0xa14700, 0x0, 0x0, 0xa14700, 0x0, 0x0) /usr/lib/go/src/pkg/testing/testing.go:435 +0x84 main.main() _<https://ci.centos.org/job/libvirt-go-master-check/systems=libvirt-debian-8/ws/_test/_testmain.go>:283 +0x9c goroutine 19 [finalizer wait]: runtime.park(0x42b430, 0xa10650, 0x9ffec9) /usr/lib/go/src/pkg/runtime/proc.c:1369 +0x89 runtime.parkunlock(0xa10650, 0x9ffec9) /usr/lib/go/src/pkg/runtime/proc.c:1385 +0x3b runfinq() /usr/lib/go/src/pkg/runtime/mgc0.c:2644 +0xcf runtime.goexit() /usr/lib/go/src/pkg/runtime/proc.c:1445 goroutine 17 [syscall]: runtime.goexit() /usr/lib/go/src/pkg/runtime/proc.c:1445 exit status 2 FAIL _<https://ci.centos.org/job/libvirt-go-master-check/systems=libvirt-debian-8/ws/> 0.708s Build step 'Execute shell' marked build as failure

See <https://ci.centos.org/job/libvirt-go-master-check/systems=libvirt-debian-8/1063/display/redirect> ------------------------------------------ Started by upstream project "libvirt-go-master-check" build number 1063 originally caused by: Started by upstream project "libvirt-go-master-build" build number 1074 originally caused by: Started by upstream project "libvirt-master-build" build number 1471 originally caused by: Started by an SCM change Started by an SCM change [EnvInject] - Loading node environment variables. Building remotely on libvirt-debian-8 (libvirt) in workspace <https://ci.centos.org/job/libvirt-go-master-check/systems=libvirt-debian-8/ws/> [libvirt-go-master] $ /bin/sh -xe /tmp/jenkins8437371558463418167.sh + export TEST_ARGS=-tags api + go test -tags api 2018-05-29 16:09:28.889+0000: 14630: info : libvirt version: 4.4.0 2018-05-29 16:09:28.889+0000: 14630: info : hostname: libvirt-debian-8 2018-05-29 16:09:28.889+0000: 14630: warning : virEventRegisterImpl:245 : Ignoring attempt to replace registered event loop 2018-05-29 16:09:28.889+0000: 14630: warning : virEventRegisterImpl:245 : Ignoring attempt to replace registered event loop 2018-05-29 16:09:28.889+0000: 14630: warning : virEventRegisterImpl:245 : Ignoring attempt to replace registered event loop Missing function 'virConnectBaselineHypervisorCPU' Missing function 'virConnectCompareHypervisorCPU' Missing function 'virDomainDetachDeviceAlias' --- FAIL: TestAPICoverage (0.54 seconds) panic: Missing symbols found [recovered] panic: Missing symbols found goroutine 20 [running]: runtime.panic(0x5e6880, 0xc2080fe960) /usr/lib/go/src/pkg/runtime/panic.c:279 +0xf5 testing.func·006() /usr/lib/go/src/pkg/testing/testing.go:416 +0x176 runtime.panic(0x5e6880, 0xc2080fe960) /usr/lib/go/src/pkg/runtime/panic.c:248 +0x18d _<https://ci.centos.org/job/libvirt-go-master-check/systems=libvirt-debian-8/ws/.TestAPICoverage(0xc208026090)> <https://ci.centos.org/job/libvirt-go-master-check/systems=libvirt-debian-8/ws/api_test.go>:504 +0x515 testing.tRunner(0xc208026090, 0xa01300) /usr/lib/go/src/pkg/testing/testing.go:422 +0x8b created by testing.RunTests /usr/lib/go/src/pkg/testing/testing.go:504 +0x8db goroutine 16 [chan receive]: testing.RunTests(0x70f8c0, 0xa01300, 0x77, 0x77, 0x41c001) /usr/lib/go/src/pkg/testing/testing.go:505 +0x923 testing.Main(0x70f8c0, 0xa01300, 0x77, 0x77, 0xa14700, 0x0, 0x0, 0xa14700, 0x0, 0x0) /usr/lib/go/src/pkg/testing/testing.go:435 +0x84 main.main() _<https://ci.centos.org/job/libvirt-go-master-check/systems=libvirt-debian-8/ws/_test/_testmain.go>:283 +0x9c goroutine 19 [finalizer wait]: runtime.park(0x42b430, 0xa10650, 0x9ffec9) /usr/lib/go/src/pkg/runtime/proc.c:1369 +0x89 runtime.parkunlock(0xa10650, 0x9ffec9) /usr/lib/go/src/pkg/runtime/proc.c:1385 +0x3b runfinq() /usr/lib/go/src/pkg/runtime/mgc0.c:2644 +0xcf runtime.goexit() /usr/lib/go/src/pkg/runtime/proc.c:1445 goroutine 17 [syscall]: runtime.goexit() /usr/lib/go/src/pkg/runtime/proc.c:1445 exit status 2 FAIL _<https://ci.centos.org/job/libvirt-go-master-check/systems=libvirt-debian-8/ws/> 0.583s Build step 'Execute shell' marked build as failure

See <https://ci.centos.org/job/libvirt-go-master-check/systems=libvirt-debian-8/1064/display/redirect> ------------------------------------------ Started by upstream project "libvirt-go-master-check" build number 1064 originally caused by: Started by upstream project "libvirt-go-master-build" build number 1075 originally caused by: Started by upstream project "libvirt-master-build" build number 1472 originally caused by: Started by an SCM change [EnvInject] - Loading node environment variables. Building remotely on libvirt-debian-8 (libvirt) in workspace <https://ci.centos.org/job/libvirt-go-master-check/systems=libvirt-debian-8/ws/> [libvirt-go-master] $ /bin/sh -xe /tmp/jenkins6098900806348887959.sh + export TEST_ARGS=-tags api + go test -tags api 2018-05-30 10:19:03.030+0000: 21721: info : libvirt version: 4.4.0 2018-05-30 10:19:03.030+0000: 21721: info : hostname: libvirt-debian-8 2018-05-30 10:19:03.030+0000: 21721: warning : virEventRegisterImpl:245 : Ignoring attempt to replace registered event loop 2018-05-30 10:19:03.035+0000: 21721: warning : virEventRegisterImpl:245 : Ignoring attempt to replace registered event loop 2018-05-30 10:19:03.035+0000: 21721: warning : virEventRegisterImpl:245 : Ignoring attempt to replace registered event loop Missing function 'virConnectBaselineHypervisorCPU' Missing function 'virConnectCompareHypervisorCPU' Missing function 'virDomainDetachDeviceAlias' --- FAIL: TestAPICoverage (0.32 seconds) panic: Missing symbols found [recovered] panic: Missing symbols found goroutine 20 [running]: runtime.panic(0x5e6880, 0xc208103220) /usr/lib/go/src/pkg/runtime/panic.c:279 +0xf5 testing.func·006() /usr/lib/go/src/pkg/testing/testing.go:416 +0x176 runtime.panic(0x5e6880, 0xc208103220) /usr/lib/go/src/pkg/runtime/panic.c:248 +0x18d _<https://ci.centos.org/job/libvirt-go-master-check/systems=libvirt-debian-8/ws/.TestAPICoverage(0xc208026090)> <https://ci.centos.org/job/libvirt-go-master-check/systems=libvirt-debian-8/ws/api_test.go>:504 +0x515 testing.tRunner(0xc208026090, 0xa01300) /usr/lib/go/src/pkg/testing/testing.go:422 +0x8b created by testing.RunTests /usr/lib/go/src/pkg/testing/testing.go:504 +0x8db goroutine 16 [chan receive]: testing.RunTests(0x70f8c0, 0xa01300, 0x77, 0x77, 0x41c001) /usr/lib/go/src/pkg/testing/testing.go:505 +0x923 testing.Main(0x70f8c0, 0xa01300, 0x77, 0x77, 0xa14700, 0x0, 0x0, 0xa14700, 0x0, 0x0) /usr/lib/go/src/pkg/testing/testing.go:435 +0x84 main.main() _<https://ci.centos.org/job/libvirt-go-master-check/systems=libvirt-debian-8/ws/_test/_testmain.go>:283 +0x9c goroutine 19 [finalizer wait]: runtime.park(0x42b430, 0xa10650, 0x9ffec9) /usr/lib/go/src/pkg/runtime/proc.c:1369 +0x89 runtime.parkunlock(0xa10650, 0x9ffec9) /usr/lib/go/src/pkg/runtime/proc.c:1385 +0x3b runfinq() /usr/lib/go/src/pkg/runtime/mgc0.c:2644 +0xcf runtime.goexit() /usr/lib/go/src/pkg/runtime/proc.c:1445 goroutine 17 [syscall]: runtime.goexit() /usr/lib/go/src/pkg/runtime/proc.c:1445 exit status 2 FAIL _<https://ci.centos.org/job/libvirt-go-master-check/systems=libvirt-debian-8/ws/> 0.627s Build step 'Execute shell' marked build as failure

See <https://ci.centos.org/job/libvirt-go-master-check/systems=libvirt-debian-8/1065/display/redirect> ------------------------------------------ Started by upstream project "libvirt-go-master-check" build number 1065 originally caused by: Started by upstream project "libvirt-go-master-build" build number 1076 originally caused by: Started by upstream project "libvirt-master-build" build number 1473 originally caused by: Started by an SCM change [EnvInject] - Loading node environment variables. Building remotely on libvirt-debian-8 (libvirt) in workspace <https://ci.centos.org/job/libvirt-go-master-check/systems=libvirt-debian-8/ws/> [libvirt-go-master] $ /bin/sh -xe /tmp/jenkins4905418469331916058.sh + export TEST_ARGS=-tags api + go test -tags api 2018-05-30 14:50:06.290+0000: 21570: info : libvirt version: 4.4.0 2018-05-30 14:50:06.290+0000: 21570: info : hostname: libvirt-debian-8 2018-05-30 14:50:06.290+0000: 21570: warning : virEventRegisterImpl:245 : Ignoring attempt to replace registered event loop 2018-05-30 14:50:06.291+0000: 21570: warning : virEventRegisterImpl:245 : Ignoring attempt to replace registered event loop 2018-05-30 14:50:06.291+0000: 21570: warning : virEventRegisterImpl:245 : Ignoring attempt to replace registered event loop Missing function 'virConnectBaselineHypervisorCPU' Missing function 'virConnectCompareHypervisorCPU' Missing function 'virDomainDetachDeviceAlias' --- FAIL: TestAPICoverage (0.32 seconds) panic: Missing symbols found [recovered] panic: Missing symbols found goroutine 20 [running]: runtime.panic(0x5e6880, 0xc208109680) /usr/lib/go/src/pkg/runtime/panic.c:279 +0xf5 testing.func·006() /usr/lib/go/src/pkg/testing/testing.go:416 +0x176 runtime.panic(0x5e6880, 0xc208109680) /usr/lib/go/src/pkg/runtime/panic.c:248 +0x18d _<https://ci.centos.org/job/libvirt-go-master-check/systems=libvirt-debian-8/ws/.TestAPICoverage(0xc208026090)> <https://ci.centos.org/job/libvirt-go-master-check/systems=libvirt-debian-8/ws/api_test.go>:504 +0x515 testing.tRunner(0xc208026090, 0xa01300) /usr/lib/go/src/pkg/testing/testing.go:422 +0x8b created by testing.RunTests /usr/lib/go/src/pkg/testing/testing.go:504 +0x8db goroutine 16 [chan receive]: testing.RunTests(0x70f8c0, 0xa01300, 0x77, 0x77, 0x41c001) /usr/lib/go/src/pkg/testing/testing.go:505 +0x923 testing.Main(0x70f8c0, 0xa01300, 0x77, 0x77, 0xa14700, 0x0, 0x0, 0xa14700, 0x0, 0x0) /usr/lib/go/src/pkg/testing/testing.go:435 +0x84 main.main() _<https://ci.centos.org/job/libvirt-go-master-check/systems=libvirt-debian-8/ws/_test/_testmain.go>:283 +0x9c goroutine 19 [finalizer wait]: runtime.park(0x42b430, 0xa10650, 0x9ffec9) /usr/lib/go/src/pkg/runtime/proc.c:1369 +0x89 runtime.parkunlock(0xa10650, 0x9ffec9) /usr/lib/go/src/pkg/runtime/proc.c:1385 +0x3b runfinq() /usr/lib/go/src/pkg/runtime/mgc0.c:2644 +0xcf runtime.goexit() /usr/lib/go/src/pkg/runtime/proc.c:1445 goroutine 17 [syscall]: runtime.goexit() /usr/lib/go/src/pkg/runtime/proc.c:1445 exit status 2 FAIL _<https://ci.centos.org/job/libvirt-go-master-check/systems=libvirt-debian-8/ws/> 0.474s Build step 'Execute shell' marked build as failure

See <https://ci.centos.org/job/libvirt-go-master-check/systems=libvirt-debian-8/1066/display/redirect> ------------------------------------------ Started by upstream project "libvirt-go-master-check" build number 1066 originally caused by: Started by upstream project "libvirt-go-master-build" build number 1077 originally caused by: Started by upstream project "libvirt-master-build" build number 1474 originally caused by: Started by an SCM change Started by an SCM change Started by an SCM change [EnvInject] - Loading node environment variables. Building remotely on libvirt-debian-8 (libvirt) in workspace <https://ci.centos.org/job/libvirt-go-master-check/systems=libvirt-debian-8/ws/> [libvirt-go-master] $ /bin/sh -xe /tmp/jenkins6855102131228122802.sh + export TEST_ARGS=-tags api + go test -tags api 2018-05-30 15:56:47.550+0000: 21324: info : libvirt version: 4.4.0 2018-05-30 15:56:47.550+0000: 21324: info : hostname: libvirt-debian-8 2018-05-30 15:56:47.550+0000: 21324: warning : virEventRegisterImpl:245 : Ignoring attempt to replace registered event loop 2018-05-30 15:56:47.551+0000: 21324: warning : virEventRegisterImpl:245 : Ignoring attempt to replace registered event loop 2018-05-30 15:56:47.552+0000: 21324: warning : virEventRegisterImpl:245 : Ignoring attempt to replace registered event loop Missing function 'virConnectBaselineHypervisorCPU' Missing function 'virConnectCompareHypervisorCPU' Missing function 'virDomainDetachDeviceAlias' --- FAIL: TestAPICoverage (0.34 seconds) panic: Missing symbols found [recovered] panic: Missing symbols found goroutine 20 [running]: runtime.panic(0x5e6880, 0xc2080e6b80) /usr/lib/go/src/pkg/runtime/panic.c:279 +0xf5 testing.func·006() /usr/lib/go/src/pkg/testing/testing.go:416 +0x176 runtime.panic(0x5e6880, 0xc2080e6b80) /usr/lib/go/src/pkg/runtime/panic.c:248 +0x18d _<https://ci.centos.org/job/libvirt-go-master-check/systems=libvirt-debian-8/ws/.TestAPICoverage(0xc208026090)> <https://ci.centos.org/job/libvirt-go-master-check/systems=libvirt-debian-8/ws/api_test.go>:504 +0x515 testing.tRunner(0xc208026090, 0xa01300) /usr/lib/go/src/pkg/testing/testing.go:422 +0x8b created by testing.RunTests /usr/lib/go/src/pkg/testing/testing.go:504 +0x8db goroutine 16 [chan receive]: testing.RunTests(0x70f8c0, 0xa01300, 0x77, 0x77, 0x41c001) /usr/lib/go/src/pkg/testing/testing.go:505 +0x923 testing.Main(0x70f8c0, 0xa01300, 0x77, 0x77, 0xa14700, 0x0, 0x0, 0xa14700, 0x0, 0x0) /usr/lib/go/src/pkg/testing/testing.go:435 +0x84 main.main() _<https://ci.centos.org/job/libvirt-go-master-check/systems=libvirt-debian-8/ws/_test/_testmain.go>:283 +0x9c goroutine 19 [finalizer wait]: runtime.park(0x42b430, 0xa10650, 0x9ffec9) /usr/lib/go/src/pkg/runtime/proc.c:1369 +0x89 runtime.parkunlock(0xa10650, 0x9ffec9) /usr/lib/go/src/pkg/runtime/proc.c:1385 +0x3b runfinq() /usr/lib/go/src/pkg/runtime/mgc0.c:2644 +0xcf runtime.goexit() /usr/lib/go/src/pkg/runtime/proc.c:1445 goroutine 17 [syscall]: runtime.goexit() /usr/lib/go/src/pkg/runtime/proc.c:1445 exit status 2 FAIL _<https://ci.centos.org/job/libvirt-go-master-check/systems=libvirt-debian-8/ws/> 0.443s Build step 'Execute shell' marked build as failure

See <https://ci.centos.org/job/libvirt-go-master-check/systems=libvirt-debian-8/1067/display/redirect> ------------------------------------------ Started by upstream project "libvirt-go-master-check" build number 1067 originally caused by: Started by upstream project "libvirt-go-master-build" build number 1078 originally caused by: Started by upstream project "libvirt-master-build" build number 1475 originally caused by: Started by an SCM change [EnvInject] - Loading node environment variables. Building remotely on libvirt-debian-8 (libvirt) in workspace <https://ci.centos.org/job/libvirt-go-master-check/systems=libvirt-debian-8/ws/> [libvirt-go-master] $ /bin/sh -xe /tmp/jenkins3862797793801758596.sh + export TEST_ARGS=-tags api + go test -tags api 2018-05-31 08:26:58.733+0000: 21752: info : libvirt version: 4.4.0 2018-05-31 08:26:58.733+0000: 21752: info : hostname: libvirt-debian-8 2018-05-31 08:26:58.733+0000: 21752: warning : virEventRegisterImpl:245 : Ignoring attempt to replace registered event loop 2018-05-31 08:26:58.733+0000: 21752: warning : virEventRegisterImpl:245 : Ignoring attempt to replace registered event loop 2018-05-31 08:26:58.733+0000: 21752: warning : virEventRegisterImpl:245 : Ignoring attempt to replace registered event loop Missing function 'virConnectBaselineHypervisorCPU' Missing function 'virConnectCompareHypervisorCPU' Missing function 'virDomainDetachDeviceAlias' --- FAIL: TestAPICoverage (0.55 seconds) panic: Missing symbols found [recovered] panic: Missing symbols found goroutine 20 [running]: runtime.panic(0x5e6880, 0xc20810ffb0) /usr/lib/go/src/pkg/runtime/panic.c:279 +0xf5 testing.func·006() /usr/lib/go/src/pkg/testing/testing.go:416 +0x176 runtime.panic(0x5e6880, 0xc20810ffb0) /usr/lib/go/src/pkg/runtime/panic.c:248 +0x18d _<https://ci.centos.org/job/libvirt-go-master-check/systems=libvirt-debian-8/ws/.TestAPICoverage(0xc208026090)> <https://ci.centos.org/job/libvirt-go-master-check/systems=libvirt-debian-8/ws/api_test.go>:504 +0x515 testing.tRunner(0xc208026090, 0xa01300) /usr/lib/go/src/pkg/testing/testing.go:422 +0x8b created by testing.RunTests /usr/lib/go/src/pkg/testing/testing.go:504 +0x8db goroutine 16 [chan receive]: testing.RunTests(0x70f8c0, 0xa01300, 0x77, 0x77, 0x41c001) /usr/lib/go/src/pkg/testing/testing.go:505 +0x923 testing.Main(0x70f8c0, 0xa01300, 0x77, 0x77, 0xa14700, 0x0, 0x0, 0xa14700, 0x0, 0x0) /usr/lib/go/src/pkg/testing/testing.go:435 +0x84 main.main() _<https://ci.centos.org/job/libvirt-go-master-check/systems=libvirt-debian-8/ws/_test/_testmain.go>:283 +0x9c goroutine 19 [finalizer wait]: runtime.park(0x42b430, 0xa10650, 0x9ffec9) /usr/lib/go/src/pkg/runtime/proc.c:1369 +0x89 runtime.parkunlock(0xa10650, 0x9ffec9) /usr/lib/go/src/pkg/runtime/proc.c:1385 +0x3b runfinq() /usr/lib/go/src/pkg/runtime/mgc0.c:2644 +0xcf runtime.goexit() /usr/lib/go/src/pkg/runtime/proc.c:1445 goroutine 17 [syscall]: runtime.goexit() /usr/lib/go/src/pkg/runtime/proc.c:1445 exit status 2 FAIL _<https://ci.centos.org/job/libvirt-go-master-check/systems=libvirt-debian-8/ws/> 0.590s Build step 'Execute shell' marked build as failure

See <https://ci.centos.org/job/libvirt-go-master-check/systems=libvirt-debian-8/1068/display/redirect> ------------------------------------------ Started by upstream project "libvirt-go-master-check" build number 1068 originally caused by: Started by upstream project "libvirt-go-master-build" build number 1079 originally caused by: Started by upstream project "libvirt-master-build" build number 1476 originally caused by: Started by an SCM change [EnvInject] - Loading node environment variables. Building remotely on libvirt-debian-8 (libvirt) in workspace <https://ci.centos.org/job/libvirt-go-master-check/systems=libvirt-debian-8/ws/> [libvirt-go-master] $ /bin/sh -xe /tmp/jenkins6921966288087949078.sh + export TEST_ARGS=-tags api + go test -tags api 2018-05-31 10:28:31.156+0000: 21492: info : libvirt version: 4.4.0 2018-05-31 10:28:31.156+0000: 21492: info : hostname: libvirt-debian-8 2018-05-31 10:28:31.156+0000: 21492: warning : virEventRegisterImpl:245 : Ignoring attempt to replace registered event loop 2018-05-31 10:28:31.157+0000: 21492: warning : virEventRegisterImpl:245 : Ignoring attempt to replace registered event loop 2018-05-31 10:28:31.157+0000: 21492: warning : virEventRegisterImpl:245 : Ignoring attempt to replace registered event loop Missing function 'virConnectBaselineHypervisorCPU' Missing function 'virConnectCompareHypervisorCPU' Missing function 'virDomainDetachDeviceAlias' --- FAIL: TestAPICoverage (0.67 seconds) panic: Missing symbols found [recovered] panic: Missing symbols found goroutine 20 [running]: runtime.panic(0x5e6880, 0xc208108620) /usr/lib/go/src/pkg/runtime/panic.c:279 +0xf5 testing.func·006() /usr/lib/go/src/pkg/testing/testing.go:416 +0x176 runtime.panic(0x5e6880, 0xc208108620) /usr/lib/go/src/pkg/runtime/panic.c:248 +0x18d _<https://ci.centos.org/job/libvirt-go-master-check/systems=libvirt-debian-8/ws/.TestAPICoverage(0xc208026090)> <https://ci.centos.org/job/libvirt-go-master-check/systems=libvirt-debian-8/ws/api_test.go>:504 +0x515 testing.tRunner(0xc208026090, 0xa01300) /usr/lib/go/src/pkg/testing/testing.go:422 +0x8b created by testing.RunTests /usr/lib/go/src/pkg/testing/testing.go:504 +0x8db goroutine 16 [chan receive]: testing.RunTests(0x70f8c0, 0xa01300, 0x77, 0x77, 0x41c001) /usr/lib/go/src/pkg/testing/testing.go:505 +0x923 testing.Main(0x70f8c0, 0xa01300, 0x77, 0x77, 0xa14700, 0x0, 0x0, 0xa14700, 0x0, 0x0) /usr/lib/go/src/pkg/testing/testing.go:435 +0x84 main.main() _<https://ci.centos.org/job/libvirt-go-master-check/systems=libvirt-debian-8/ws/_test/_testmain.go>:283 +0x9c goroutine 19 [finalizer wait]: runtime.park(0x42b430, 0xa10650, 0x9ffec9) /usr/lib/go/src/pkg/runtime/proc.c:1369 +0x89 runtime.parkunlock(0xa10650, 0x9ffec9) /usr/lib/go/src/pkg/runtime/proc.c:1385 +0x3b runfinq() /usr/lib/go/src/pkg/runtime/mgc0.c:2644 +0xcf runtime.goexit() /usr/lib/go/src/pkg/runtime/proc.c:1445 goroutine 17 [syscall]: runtime.goexit() /usr/lib/go/src/pkg/runtime/proc.c:1445 exit status 2 FAIL _<https://ci.centos.org/job/libvirt-go-master-check/systems=libvirt-debian-8/ws/> 0.752s Build step 'Execute shell' marked build as failure

See <https://ci.centos.org/job/libvirt-go-master-check/systems=libvirt-debian-8/1069/display/redirect> ------------------------------------------ Started by upstream project "libvirt-go-master-check" build number 1069 originally caused by: Started by upstream project "libvirt-go-master-build" build number 1080 originally caused by: Started by upstream project "libvirt-master-build" build number 1477 originally caused by: Started by an SCM change Started by an SCM change Started by an SCM change [EnvInject] - Loading node environment variables. Building remotely on libvirt-debian-8 (libvirt) in workspace <https://ci.centos.org/job/libvirt-go-master-check/systems=libvirt-debian-8/ws/> [libvirt-go-master] $ /bin/sh -xe /tmp/jenkins817067272419569921.sh + export TEST_ARGS=-tags api + go test -tags api 2018-05-31 11:48:07.329+0000: 21309: info : libvirt version: 4.4.0 2018-05-31 11:48:07.329+0000: 21309: info : hostname: libvirt-debian-8 2018-05-31 11:48:07.329+0000: 21309: warning : virEventRegisterImpl:245 : Ignoring attempt to replace registered event loop 2018-05-31 11:48:07.329+0000: 21309: warning : virEventRegisterImpl:245 : Ignoring attempt to replace registered event loop 2018-05-31 11:48:07.329+0000: 21309: warning : virEventRegisterImpl:245 : Ignoring attempt to replace registered event loop Missing function 'virConnectBaselineHypervisorCPU' Missing function 'virConnectCompareHypervisorCPU' Missing function 'virDomainDetachDeviceAlias' --- FAIL: TestAPICoverage (0.58 seconds) panic: Missing symbols found [recovered] panic: Missing symbols found goroutine 20 [running]: runtime.panic(0x5e6880, 0xc20810fb10) /usr/lib/go/src/pkg/runtime/panic.c:279 +0xf5 testing.func·006() /usr/lib/go/src/pkg/testing/testing.go:416 +0x176 runtime.panic(0x5e6880, 0xc20810fb10) /usr/lib/go/src/pkg/runtime/panic.c:248 +0x18d _<https://ci.centos.org/job/libvirt-go-master-check/systems=libvirt-debian-8/ws/.TestAPICoverage(0xc208026090)> <https://ci.centos.org/job/libvirt-go-master-check/systems=libvirt-debian-8/ws/api_test.go>:504 +0x515 testing.tRunner(0xc208026090, 0xa01300) /usr/lib/go/src/pkg/testing/testing.go:422 +0x8b created by testing.RunTests /usr/lib/go/src/pkg/testing/testing.go:504 +0x8db goroutine 16 [chan receive]: testing.RunTests(0x70f8c0, 0xa01300, 0x77, 0x77, 0x41c001) /usr/lib/go/src/pkg/testing/testing.go:505 +0x923 testing.Main(0x70f8c0, 0xa01300, 0x77, 0x77, 0xa14700, 0x0, 0x0, 0xa14700, 0x0, 0x0) /usr/lib/go/src/pkg/testing/testing.go:435 +0x84 main.main() _<https://ci.centos.org/job/libvirt-go-master-check/systems=libvirt-debian-8/ws/_test/_testmain.go>:283 +0x9c goroutine 19 [finalizer wait]: runtime.park(0x42b430, 0xa10650, 0x9ffec9) /usr/lib/go/src/pkg/runtime/proc.c:1369 +0x89 runtime.parkunlock(0xa10650, 0x9ffec9) /usr/lib/go/src/pkg/runtime/proc.c:1385 +0x3b runfinq() /usr/lib/go/src/pkg/runtime/mgc0.c:2644 +0xcf runtime.goexit() /usr/lib/go/src/pkg/runtime/proc.c:1445 goroutine 17 [syscall]: runtime.goexit() /usr/lib/go/src/pkg/runtime/proc.c:1445 exit status 2 FAIL _<https://ci.centos.org/job/libvirt-go-master-check/systems=libvirt-debian-8/ws/> 0.647s Build step 'Execute shell' marked build as failure

See <https://ci.centos.org/job/libvirt-go-master-check/systems=libvirt-debian-8/1070/display/redirect> ------------------------------------------ Started by upstream project "libvirt-go-master-check" build number 1070 originally caused by: Started by upstream project "libvirt-go-master-build" build number 1081 originally caused by: Started by upstream project "libvirt-master-build" build number 1478 originally caused by: Started by an SCM change [EnvInject] - Loading node environment variables. Building remotely on libvirt-debian-8 (libvirt) in workspace <https://ci.centos.org/job/libvirt-go-master-check/systems=libvirt-debian-8/ws/> [libvirt-go-master] $ /bin/sh -xe /tmp/jenkins4145340030781506523.sh + export TEST_ARGS=-tags api + go test -tags api 2018-05-31 14:18:39.557+0000: 21150: info : libvirt version: 4.4.0 2018-05-31 14:18:39.557+0000: 21150: info : hostname: libvirt-debian-8 2018-05-31 14:18:39.557+0000: 21150: warning : virEventRegisterImpl:245 : Ignoring attempt to replace registered event loop 2018-05-31 14:18:39.570+0000: 21150: warning : virEventRegisterImpl:245 : Ignoring attempt to replace registered event loop 2018-05-31 14:18:39.570+0000: 21150: warning : virEventRegisterImpl:245 : Ignoring attempt to replace registered event loop Missing function 'virConnectBaselineHypervisorCPU' Missing function 'virConnectCompareHypervisorCPU' Missing function 'virDomainDetachDeviceAlias' --- FAIL: TestAPICoverage (0.50 seconds) panic: Missing symbols found [recovered] panic: Missing symbols found goroutine 20 [running]: runtime.panic(0x5e6880, 0xc208000700) /usr/lib/go/src/pkg/runtime/panic.c:279 +0xf5 testing.func·006() /usr/lib/go/src/pkg/testing/testing.go:416 +0x176 runtime.panic(0x5e6880, 0xc208000700) /usr/lib/go/src/pkg/runtime/panic.c:248 +0x18d _<https://ci.centos.org/job/libvirt-go-master-check/systems=libvirt-debian-8/ws/.TestAPICoverage(0xc208026090)> <https://ci.centos.org/job/libvirt-go-master-check/systems=libvirt-debian-8/ws/api_test.go>:504 +0x515 testing.tRunner(0xc208026090, 0xa01300) /usr/lib/go/src/pkg/testing/testing.go:422 +0x8b created by testing.RunTests /usr/lib/go/src/pkg/testing/testing.go:504 +0x8db goroutine 16 [chan receive]: testing.RunTests(0x70f8c0, 0xa01300, 0x77, 0x77, 0x41c001) /usr/lib/go/src/pkg/testing/testing.go:505 +0x923 testing.Main(0x70f8c0, 0xa01300, 0x77, 0x77, 0xa14700, 0x0, 0x0, 0xa14700, 0x0, 0x0) /usr/lib/go/src/pkg/testing/testing.go:435 +0x84 main.main() _<https://ci.centos.org/job/libvirt-go-master-check/systems=libvirt-debian-8/ws/_test/_testmain.go>:283 +0x9c goroutine 19 [finalizer wait]: runtime.park(0x42b430, 0xa10650, 0x9ffec9) /usr/lib/go/src/pkg/runtime/proc.c:1369 +0x89 runtime.parkunlock(0xa10650, 0x9ffec9) /usr/lib/go/src/pkg/runtime/proc.c:1385 +0x3b runfinq() /usr/lib/go/src/pkg/runtime/mgc0.c:2644 +0xcf runtime.goexit() /usr/lib/go/src/pkg/runtime/proc.c:1445 goroutine 17 [syscall]: runtime.goexit() /usr/lib/go/src/pkg/runtime/proc.c:1445 exit status 2 FAIL _<https://ci.centos.org/job/libvirt-go-master-check/systems=libvirt-debian-8/ws/> 0.574s Build step 'Execute shell' marked build as failure

See <https://ci.centos.org/job/libvirt-go-master-check/systems=libvirt-debian-8/1071/display/redirect> ------------------------------------------ Started by upstream project "libvirt-go-master-check" build number 1071 originally caused by: Started by upstream project "libvirt-go-master-build" build number 1082 originally caused by: Started by upstream project "libvirt-master-build" build number 1479 originally caused by: Started by an SCM change [EnvInject] - Loading node environment variables. Building remotely on libvirt-debian-8 (libvirt) in workspace <https://ci.centos.org/job/libvirt-go-master-check/systems=libvirt-debian-8/ws/> [libvirt-go-master] $ /bin/sh -xe /tmp/jenkins7983444532792132157.sh + export TEST_ARGS=-tags api + go test -tags api 2018-05-31 15:45:28.653+0000: 20893: info : libvirt version: 4.4.0 2018-05-31 15:45:28.653+0000: 20893: info : hostname: libvirt-debian-8 2018-05-31 15:45:28.653+0000: 20893: warning : virEventRegisterImpl:245 : Ignoring attempt to replace registered event loop 2018-05-31 15:45:28.653+0000: 20893: warning : virEventRegisterImpl:245 : Ignoring attempt to replace registered event loop 2018-05-31 15:45:28.653+0000: 20893: warning : virEventRegisterImpl:245 : Ignoring attempt to replace registered event loop Missing function 'virConnectBaselineHypervisorCPU' Missing function 'virConnectCompareHypervisorCPU' Missing function 'virDomainDetachDeviceAlias' --- FAIL: TestAPICoverage (0.53 seconds) panic: Missing symbols found [recovered] panic: Missing symbols found goroutine 20 [running]: runtime.panic(0x5e6880, 0xc208109670) /usr/lib/go/src/pkg/runtime/panic.c:279 +0xf5 testing.func·006() /usr/lib/go/src/pkg/testing/testing.go:416 +0x176 runtime.panic(0x5e6880, 0xc208109670) /usr/lib/go/src/pkg/runtime/panic.c:248 +0x18d _<https://ci.centos.org/job/libvirt-go-master-check/systems=libvirt-debian-8/ws/.TestAPICoverage(0xc208026090)> <https://ci.centos.org/job/libvirt-go-master-check/systems=libvirt-debian-8/ws/api_test.go>:504 +0x515 testing.tRunner(0xc208026090, 0xa01300) /usr/lib/go/src/pkg/testing/testing.go:422 +0x8b created by testing.RunTests /usr/lib/go/src/pkg/testing/testing.go:504 +0x8db goroutine 16 [chan receive]: testing.RunTests(0x70f8c0, 0xa01300, 0x77, 0x77, 0x41c001) /usr/lib/go/src/pkg/testing/testing.go:505 +0x923 testing.Main(0x70f8c0, 0xa01300, 0x77, 0x77, 0xa14700, 0x0, 0x0, 0xa14700, 0x0, 0x0) /usr/lib/go/src/pkg/testing/testing.go:435 +0x84 main.main() _<https://ci.centos.org/job/libvirt-go-master-check/systems=libvirt-debian-8/ws/_test/_testmain.go>:283 +0x9c goroutine 19 [finalizer wait]: runtime.park(0x42b430, 0xa10650, 0x9ffec9) /usr/lib/go/src/pkg/runtime/proc.c:1369 +0x89 runtime.parkunlock(0xa10650, 0x9ffec9) /usr/lib/go/src/pkg/runtime/proc.c:1385 +0x3b runfinq() /usr/lib/go/src/pkg/runtime/mgc0.c:2644 +0xcf runtime.goexit() /usr/lib/go/src/pkg/runtime/proc.c:1445 goroutine 17 [syscall]: runtime.goexit() /usr/lib/go/src/pkg/runtime/proc.c:1445 exit status 2 FAIL _<https://ci.centos.org/job/libvirt-go-master-check/systems=libvirt-debian-8/ws/> 0.575s Build step 'Execute shell' marked build as failure

See <https://ci.centos.org/job/libvirt-go-master-check/systems=libvirt-debian-8/1072/display/redirect> ------------------------------------------ Started by upstream project "libvirt-go-master-check" build number 1072 originally caused by: Started by upstream project "libvirt-go-master-build" build number 1083 originally caused by: Started by upstream project "libvirt-master-build" build number 1480 originally caused by: Started by an SCM change [EnvInject] - Loading node environment variables. Building remotely on libvirt-debian-8 (libvirt) in workspace <https://ci.centos.org/job/libvirt-go-master-check/systems=libvirt-debian-8/ws/> [libvirt-go-master] $ /bin/sh -xe /tmp/jenkins8421045869988829244.sh + export TEST_ARGS=-tags api + go test -tags api 2018-06-01 12:38:34.591+0000: 19440: info : libvirt version: 4.4.0 2018-06-01 12:38:34.591+0000: 19440: info : hostname: libvirt-debian-8 2018-06-01 12:38:34.591+0000: 19440: warning : virEventRegisterImpl:245 : Ignoring attempt to replace registered event loop 2018-06-01 12:38:34.593+0000: 19440: warning : virEventRegisterImpl:245 : Ignoring attempt to replace registered event loop 2018-06-01 12:38:34.593+0000: 19440: warning : virEventRegisterImpl:245 : Ignoring attempt to replace registered event loop Missing function 'virConnectBaselineHypervisorCPU' Missing function 'virConnectCompareHypervisorCPU' Missing function 'virDomainDetachDeviceAlias' --- FAIL: TestAPICoverage (0.64 seconds) panic: Missing symbols found [recovered] panic: Missing symbols found goroutine 20 [running]: runtime.panic(0x5e6880, 0xc20810fd40) /usr/lib/go/src/pkg/runtime/panic.c:279 +0xf5 testing.func·006() /usr/lib/go/src/pkg/testing/testing.go:416 +0x176 runtime.panic(0x5e6880, 0xc20810fd40) /usr/lib/go/src/pkg/runtime/panic.c:248 +0x18d _<https://ci.centos.org/job/libvirt-go-master-check/systems=libvirt-debian-8/ws/.TestAPICoverage(0xc208026090)> <https://ci.centos.org/job/libvirt-go-master-check/systems=libvirt-debian-8/ws/api_test.go>:504 +0x515 testing.tRunner(0xc208026090, 0xa01300) /usr/lib/go/src/pkg/testing/testing.go:422 +0x8b created by testing.RunTests /usr/lib/go/src/pkg/testing/testing.go:504 +0x8db goroutine 16 [chan receive]: testing.RunTests(0x70f8c0, 0xa01300, 0x77, 0x77, 0x41c001) /usr/lib/go/src/pkg/testing/testing.go:505 +0x923 testing.Main(0x70f8c0, 0xa01300, 0x77, 0x77, 0xa14700, 0x0, 0x0, 0xa14700, 0x0, 0x0) /usr/lib/go/src/pkg/testing/testing.go:435 +0x84 main.main() _<https://ci.centos.org/job/libvirt-go-master-check/systems=libvirt-debian-8/ws/_test/_testmain.go>:283 +0x9c goroutine 19 [finalizer wait]: runtime.park(0x42b430, 0xa10650, 0x9ffec9) /usr/lib/go/src/pkg/runtime/proc.c:1369 +0x89 runtime.parkunlock(0xa10650, 0x9ffec9) /usr/lib/go/src/pkg/runtime/proc.c:1385 +0x3b runfinq() /usr/lib/go/src/pkg/runtime/mgc0.c:2644 +0xcf runtime.goexit() /usr/lib/go/src/pkg/runtime/proc.c:1445 goroutine 17 [syscall]: runtime.goexit() /usr/lib/go/src/pkg/runtime/proc.c:1445 exit status 2 FAIL _<https://ci.centos.org/job/libvirt-go-master-check/systems=libvirt-debian-8/ws/> 0.728s Build step 'Execute shell' marked build as failure

See <https://ci.centos.org/job/libvirt-go-master-check/systems=libvirt-debian-8/1073/display/redirect> ------------------------------------------ Started by upstream project "libvirt-go-master-check" build number 1073 originally caused by: Started by upstream project "libvirt-go-master-build" build number 1084 originally caused by: Started by upstream project "libvirt-master-build" build number 1481 originally caused by: Started by an SCM change Started by an SCM change [EnvInject] - Loading node environment variables. Building remotely on libvirt-debian-8 (libvirt) in workspace <https://ci.centos.org/job/libvirt-go-master-check/systems=libvirt-debian-8/ws/> [libvirt-go-master] $ /bin/sh -xe /tmp/jenkins3903787607215400046.sh + export TEST_ARGS=-tags api + go test -tags api 2018-06-01 13:57:58.822+0000: 21330: info : libvirt version: 4.4.0 2018-06-01 13:57:58.822+0000: 21330: info : hostname: libvirt-debian-8 2018-06-01 13:57:58.822+0000: 21330: warning : virEventRegisterImpl:245 : Ignoring attempt to replace registered event loop 2018-06-01 13:57:58.822+0000: 21330: warning : virEventRegisterImpl:245 : Ignoring attempt to replace registered event loop 2018-06-01 13:57:58.822+0000: 21330: warning : virEventRegisterImpl:245 : Ignoring attempt to replace registered event loop Missing function 'virConnectBaselineHypervisorCPU' Missing function 'virConnectCompareHypervisorCPU' Missing function 'virDomainDetachDeviceAlias' --- FAIL: TestAPICoverage (0.30 seconds) panic: Missing symbols found [recovered] panic: Missing symbols found goroutine 20 [running]: runtime.panic(0x5e6880, 0xc208127e10) /usr/lib/go/src/pkg/runtime/panic.c:279 +0xf5 testing.func·006() /usr/lib/go/src/pkg/testing/testing.go:416 +0x176 runtime.panic(0x5e6880, 0xc208127e10) /usr/lib/go/src/pkg/runtime/panic.c:248 +0x18d _<https://ci.centos.org/job/libvirt-go-master-check/systems=libvirt-debian-8/ws/.TestAPICoverage(0xc208026090)> <https://ci.centos.org/job/libvirt-go-master-check/systems=libvirt-debian-8/ws/api_test.go>:504 +0x515 testing.tRunner(0xc208026090, 0xa01300) /usr/lib/go/src/pkg/testing/testing.go:422 +0x8b created by testing.RunTests /usr/lib/go/src/pkg/testing/testing.go:504 +0x8db goroutine 16 [chan receive]: testing.RunTests(0x70f8c0, 0xa01300, 0x77, 0x77, 0x41c001) /usr/lib/go/src/pkg/testing/testing.go:505 +0x923 testing.Main(0x70f8c0, 0xa01300, 0x77, 0x77, 0xa14700, 0x0, 0x0, 0xa14700, 0x0, 0x0) /usr/lib/go/src/pkg/testing/testing.go:435 +0x84 main.main() _<https://ci.centos.org/job/libvirt-go-master-check/systems=libvirt-debian-8/ws/_test/_testmain.go>:283 +0x9c goroutine 19 [finalizer wait]: runtime.park(0x42b430, 0xa10650, 0x9ffec9) /usr/lib/go/src/pkg/runtime/proc.c:1369 +0x89 runtime.parkunlock(0xa10650, 0x9ffec9) /usr/lib/go/src/pkg/runtime/proc.c:1385 +0x3b runfinq() /usr/lib/go/src/pkg/runtime/mgc0.c:2644 +0xcf runtime.goexit() /usr/lib/go/src/pkg/runtime/proc.c:1445 goroutine 17 [syscall]: runtime.goexit() /usr/lib/go/src/pkg/runtime/proc.c:1445 exit status 2 FAIL _<https://ci.centos.org/job/libvirt-go-master-check/systems=libvirt-debian-8/ws/> 0.358s Build step 'Execute shell' marked build as failure

See <https://ci.centos.org/job/libvirt-go-master-check/systems=libvirt-debian-8/1074/display/redirect> ------------------------------------------ Started by upstream project "libvirt-go-master-check" build number 1074 originally caused by: Started by upstream project "libvirt-go-master-build" build number 1085 originally caused by: Started by upstream project "libvirt-master-build" build number 1482 originally caused by: Started by an SCM change [EnvInject] - Loading node environment variables. Building remotely on libvirt-debian-8 (libvirt) in workspace <https://ci.centos.org/job/libvirt-go-master-check/systems=libvirt-debian-8/ws/> [libvirt-go-master] $ /bin/sh -xe /tmp/jenkins8767763823634485903.sh + export TEST_ARGS=-tags api + go test -tags api 2018-06-01 16:29:56.425+0000: 19417: info : libvirt version: 4.4.0 2018-06-01 16:29:56.425+0000: 19417: info : hostname: libvirt-debian-8 2018-06-01 16:29:56.425+0000: 19417: warning : virEventRegisterImpl:245 : Ignoring attempt to replace registered event loop 2018-06-01 16:29:56.425+0000: 19417: warning : virEventRegisterImpl:245 : Ignoring attempt to replace registered event loop 2018-06-01 16:29:56.425+0000: 19417: warning : virEventRegisterImpl:245 : Ignoring attempt to replace registered event loop Missing function 'virConnectBaselineHypervisorCPU' Missing function 'virConnectCompareHypervisorCPU' Missing function 'virDomainDetachDeviceAlias' --- FAIL: TestAPICoverage (0.56 seconds) panic: Missing symbols found [recovered] panic: Missing symbols found goroutine 20 [running]: runtime.panic(0x5e6880, 0xc2080b6140) /usr/lib/go/src/pkg/runtime/panic.c:279 +0xf5 testing.func·006() /usr/lib/go/src/pkg/testing/testing.go:416 +0x176 runtime.panic(0x5e6880, 0xc2080b6140) /usr/lib/go/src/pkg/runtime/panic.c:248 +0x18d _<https://ci.centos.org/job/libvirt-go-master-check/systems=libvirt-debian-8/ws/.TestAPICoverage(0xc208026090)> <https://ci.centos.org/job/libvirt-go-master-check/systems=libvirt-debian-8/ws/api_test.go>:504 +0x515 testing.tRunner(0xc208026090, 0xa01300) /usr/lib/go/src/pkg/testing/testing.go:422 +0x8b created by testing.RunTests /usr/lib/go/src/pkg/testing/testing.go:504 +0x8db goroutine 16 [chan receive]: testing.RunTests(0x70f8c0, 0xa01300, 0x77, 0x77, 0x41c001) /usr/lib/go/src/pkg/testing/testing.go:505 +0x923 testing.Main(0x70f8c0, 0xa01300, 0x77, 0x77, 0xa14700, 0x0, 0x0, 0xa14700, 0x0, 0x0) /usr/lib/go/src/pkg/testing/testing.go:435 +0x84 main.main() _<https://ci.centos.org/job/libvirt-go-master-check/systems=libvirt-debian-8/ws/_test/_testmain.go>:283 +0x9c goroutine 19 [finalizer wait]: runtime.park(0x42b430, 0xa10650, 0x9ffec9) /usr/lib/go/src/pkg/runtime/proc.c:1369 +0x89 runtime.parkunlock(0xa10650, 0x9ffec9) /usr/lib/go/src/pkg/runtime/proc.c:1385 +0x3b runfinq() /usr/lib/go/src/pkg/runtime/mgc0.c:2644 +0xcf runtime.goexit() /usr/lib/go/src/pkg/runtime/proc.c:1445 goroutine 17 [syscall]: runtime.goexit() /usr/lib/go/src/pkg/runtime/proc.c:1445 exit status 2 FAIL _<https://ci.centos.org/job/libvirt-go-master-check/systems=libvirt-debian-8/ws/> 0.606s Build step 'Execute shell' marked build as failure

participants (1)
-
ci@centos.org