[Libvirt-ci] Build failed in Jenkins: libvirt-go-xml-check » libvirt-fedora-29 #287

See <https://ci.centos.org/job/libvirt-go-xml-check/systems=libvirt-fedora-29/287/display/redirect> ------------------------------------------ Started by upstream project "libvirt-go-xml-check" build number 287 originally caused by: Started by upstream project "libvirt-go-xml-build" build number 287 originally caused by: Started by upstream project "libvirt-build" build number 352 originally caused by: Started by an SCM change [EnvInject] - Loading node environment variables. Building remotely on libvirt-fedora-29 (libvirt) in workspace <https://ci.centos.org/job/libvirt-go-xml-check/systems=libvirt-fedora-29/ws/> [libvirt-go-xml] $ /bin/sh -xe /tmp/jenkins5828021555539501324.sh + export 'TEST_ARGS=-tags xmlroundtrip' + TEST_ARGS='-tags xmlroundtrip' + go test -tags xmlroundtrip --- FAIL: TestRoundTrip (21.14s) xml_test.go:400: testdata/libvirt/tests/qemuxml2argvdata/virtio-non-transitional.xml: /domain[0]/devices[0]/disk[0]/@model: attribute 'virtio-non-transitional' in expected XML missing in actual XML FAIL exit status 1 FAIL _<https://ci.centos.org/job/libvirt-go-xml-check/systems=libvirt-fedora-29/ws/> 21.355s Build step 'Execute shell' marked build as failure

See <https://ci.centos.org/job/libvirt-go-xml-check/systems=libvirt-fedora-29/288/display/redirect> ------------------------------------------ Started by upstream project "libvirt-go-xml-check" build number 288 originally caused by: Started by upstream project "libvirt-go-xml-build" build number 288 originally caused by: Started by upstream project "libvirt-build" build number 353 originally caused by: Started by an SCM change Started by an SCM change Started by an SCM change Started by an SCM change Started by an SCM change Started by an SCM change Started by an SCM change Started by an SCM change [EnvInject] - Loading node environment variables. Building remotely on libvirt-fedora-29 (libvirt) in workspace <https://ci.centos.org/job/libvirt-go-xml-check/systems=libvirt-fedora-29/ws/> [libvirt-go-xml] $ /bin/sh -xe /tmp/jenkins2320087892572719567.sh + export 'TEST_ARGS=-tags xmlroundtrip' + TEST_ARGS='-tags xmlroundtrip' + go test -tags xmlroundtrip --- FAIL: TestRoundTrip (15.65s) xml_test.go:400: testdata/libvirt/tests/qemuxml2argvdata/virtio-non-transitional.xml: /domain[0]/devices[0]/disk[0]/@model: attribute 'virtio-non-transitional' in expected XML missing in actual XML FAIL exit status 1 FAIL _<https://ci.centos.org/job/libvirt-go-xml-check/systems=libvirt-fedora-29/ws/> 15.731s Build step 'Execute shell' marked build as failure

See <https://ci.centos.org/job/libvirt-go-xml-check/systems=libvirt-fedora-29/289/display/redirect> ------------------------------------------ Started by upstream project "libvirt-go-xml-check" build number 289 originally caused by: Started by upstream project "libvirt-go-xml-build" build number 289 originally caused by: Started by upstream project "libvirt-build" build number 354 originally caused by: Started by an SCM change [EnvInject] - Loading node environment variables. Building remotely on libvirt-fedora-29 (libvirt) in workspace <https://ci.centos.org/job/libvirt-go-xml-check/systems=libvirt-fedora-29/ws/> [libvirt-go-xml] $ /bin/sh -xe /tmp/jenkins851697812884686584.sh + export 'TEST_ARGS=-tags xmlroundtrip' + TEST_ARGS='-tags xmlroundtrip' + go test -tags xmlroundtrip --- FAIL: TestRoundTrip (22.85s) xml_test.go:400: testdata/libvirt/tests/qemuxml2argvdata/virtio-non-transitional.xml: /domain[0]/devices[0]/disk[0]/@model: attribute 'virtio-non-transitional' in expected XML missing in actual XML FAIL exit status 1 FAIL _<https://ci.centos.org/job/libvirt-go-xml-check/systems=libvirt-fedora-29/ws/> 22.923s Build step 'Execute shell' marked build as failure

See <https://ci.centos.org/job/libvirt-go-xml-check/systems=libvirt-fedora-29/290/display/redirect> ------------------------------------------ Started by upstream project "libvirt-go-xml-check" build number 290 originally caused by: Started by upstream project "libvirt-go-xml-build" build number 290 originally caused by: Started by upstream project "libvirt-build" build number 355 originally caused by: Started by an SCM change Started by an SCM change Started by an SCM change Started by an SCM change Started by an SCM change Started by an SCM change Started by an SCM change Started by an SCM change Started by an SCM change Started by an SCM change [EnvInject] - Loading node environment variables. Building remotely on libvirt-fedora-29 (libvirt) in workspace <https://ci.centos.org/job/libvirt-go-xml-check/systems=libvirt-fedora-29/ws/> [libvirt-go-xml] $ /bin/sh -xe /tmp/jenkins6937794190004639138.sh + export 'TEST_ARGS=-tags xmlroundtrip' + TEST_ARGS='-tags xmlroundtrip' + go test -tags xmlroundtrip --- FAIL: TestRoundTrip (20.58s) xml_test.go:400: testdata/libvirt/tests/qemuxml2argvdata/virtio-non-transitional.xml: /domain[0]/devices[0]/disk[0]/@model: attribute 'virtio-non-transitional' in expected XML missing in actual XML FAIL exit status 1 FAIL _<https://ci.centos.org/job/libvirt-go-xml-check/systems=libvirt-fedora-29/ws/> 20.770s Build step 'Execute shell' marked build as failure

See <https://ci.centos.org/job/libvirt-go-xml-check/systems=libvirt-fedora-29/291/display/redirect> ------------------------------------------ Started by upstream project "libvirt-go-xml-check" build number 291 originally caused by: Started by upstream project "libvirt-go-xml-build" build number 291 originally caused by: Started by upstream project "libvirt-build" build number 356 originally caused by: Started by an SCM change [EnvInject] - Loading node environment variables. Building remotely on libvirt-fedora-29 (libvirt) in workspace <https://ci.centos.org/job/libvirt-go-xml-check/systems=libvirt-fedora-29/ws/> [libvirt-go-xml] $ /bin/sh -xe /tmp/jenkins7731031919607752342.sh + export 'TEST_ARGS=-tags xmlroundtrip' + TEST_ARGS='-tags xmlroundtrip' + go test -tags xmlroundtrip --- FAIL: TestRoundTrip (27.05s) xml_test.go:400: testdata/libvirt/tests/qemuxml2argvdata/virtio-non-transitional.xml: /domain[0]/devices[0]/disk[0]/@model: attribute 'virtio-non-transitional' in expected XML missing in actual XML FAIL exit status 1 FAIL _<https://ci.centos.org/job/libvirt-go-xml-check/systems=libvirt-fedora-29/ws/> 27.139s Build step 'Execute shell' marked build as failure

participants (1)
-
ci@centos.org