|
builds
|
|
x64-centos-8-clang
|
[361/1207] Compiling C object 'src/qemu/9802133@@virt_driver_qemu_impl@sta/qemu_command.c.o' [362/1207] Compiling C object 'src/qemu/9802133@@virt_driver_qemu_impl@sta/qemu_domain_address.c.o' [363/1207] Compiling C object 'src/qemu/9802133@@virt_driver_qemu_impl@sta/qemu_domain.c.o' [364/1207] Compiling C object 'src/qemu/9802133@@virt_driver_qemu_impl@sta/qemu_domainjob.c.o' [365/1207] Compiling C object 'src/qemu/9802133@@virt_driver_qemu_impl@sta/qemu_extdevice.c.o' [366/1207] Compiling C object 'src/qemu/9802133@@virt_driver_qemu_impl@sta/qemu_firmware.c.o' [367/1207] Compiling C object 'src/qemu/9802133@@virt_driver_qemu_impl@sta/qemu_hostdev.c.o' [368/1207] Compiling C object 'src/qemu/9802133@@virt_driver_qemu_impl@sta/qemu_hotplug.c.o' [369/1207] Compiling C object 'src/qemu/9802133@@virt_driver_qemu_impl@sta/qemu_interface.c.o' [370/1207] Compiling C object 'src/qemu/9802133@@virt_driver_qemu_impl@sta/qemu_interop_config.c.o' [371/1207] Compiling C object 'src/qemu/9802133@@virt_driver_qemu_impl@sta/qemu_driver.c.o' [372/1207] Compiling C object 'src/qemu/9802133@@virt_driver_qemu_impl@sta/qemu_migration.c.o' FAILED: src/qemu/9802133@@virt_driver_qemu_impl@sta/qemu_migration.c.o clang -Isrc/qemu/9802133@@virt_driver_qemu_impl@sta -Isrc/qemu -I../dist-unpack/libvirt-6.8.0/src/qemu -Isrc/conf -I../dist-unpack/libvirt-6.8.0/src/conf -Isrc/hypervisor -I../dist-unpack/libvirt-6.8.0/src/hypervisor -Isrc/access -I../dist-unpack/libvirt-6.8.0/src/access -Isrc/logging -I../dist-unpack/libvirt-6.8.0/src/logging -Isrc/util -I../dist-unpack/libvirt-6.8.0/src/util -Iinclude -I../dist-unpack/libvirt-6.8.0/include -Isrc -I../dist-unpack/libvirt-6.8.0/src -I. -I../dist-unpack/libvirt-6.8.0 -I/usr/include/p11-kit-1 -I/usr/include/libnl3 -I/usr/include/glib-2.0 -I/usr/lib64/glib-2.0/include -I/usr/include/libxml2 -I/usr/include/tirpc -Xclang -fcolor-diagnostics -pipe -D_FILE_OFFSET_BITS=64 -Wall -Winvalid-pch -Wextra -Werror -std=gnu99 -O2 -g -fno-common -W -Wabsolute-value -Waddress -Waddress-of-packed-member -Wall -Wattributes -Wbuiltin-macro-redefined -Wcast-align -Wchar-subscripts -Wcomment -Wcomments -Wcpp -Wdangling-else -Wdate-time -Wdeclaration-after-statement -Wdeprecated-declarations -Wdiv-by-zero -Wduplicate-decl-specifier -Wempty-body -Wendif-labels -Wexpansion-to-defined -Wextra -Wformat-extra-args -Wformat-nonliteral -Wformat-security -Wformat-y2k -Wformat-zero-length -Wignored-attributes -Wignored-qualifiers -Wimplicit -Wimplicit-function-declaration -Wimplicit-int -Wincompatible-pointer-types -Winit-self -Winline -Wint-conversion -Wint-to-pointer-cast -Winvalid-pch -Wlogical-not-parentheses -Wmain -Wmemset-transposed-args -Wmissing-braces -Wmissing-declarations -Wmissing-field-initializers -Wmissing-include-dirs -Wmissing-prototypes -Wmultichar -Wnarrowing -Wnested-externs -Wnonnull -Wnull-dereference -Wodr -Wold-style-definition -Woverflow -Woverride-init -Wparentheses -Wpointer-arith -Wpointer-sign -Wpointer-to-int-cast -Wpragmas -Wreturn-type -Wsequence-point -Wshadow -Wshift-count-negative -Wshift-count-overflow -Wshift-negative-value -Wsizeof-array-argument -Wsizeof-pointer-div -Wsizeof-pointer-memaccess -Wstrict-aliasing -Wstrict-prototypes -Wswitch -Wswitch-bool -Wtautological-compare -Wtrigraphs -Wtype-limits -Wuninitialized -Wunknown-pragmas -Wunused -Wunused-function -Wunused-label -Wunused-local-typedefs -Wunused-parameter -Wunused-result -Wunused-value -Wunused-variable -Wvarargs -Wvariadic-macros -Wvla -Wvolatile-register-var -Wwrite-strings -Wno-sign-compare -Wno-typedef-redefinition -Wswitch-enum -Wno-format-nonliteral -Wframe-larger-than=4096 -fexceptions -fasynchronous-unwind-tables -fstack-protector-strong -Wdouble-promotion -Wno-unused-function -fPIC -pthread -DIN_LIBVIRT '-Dabs_top_builddir="/builds/libvirt/libvirt/build/meson-private/dist-build"' '-Dabs_top_srcdir="/builds/libvirt/libvirt/build/meson-private/dist-unpack/libvirt-6.8.0"' -MD -MQ 'src/qemu/9802133@@virt_driver_qemu_impl@sta/qemu_migration.c.o' -MF 'src/qemu/9802133@@virt_driver_qemu_impl@sta/qemu_migration.c.o.d' -o 'src/qemu/9802133@@virt_driver_qemu_impl@sta/qemu_migration.c.o' -c ../dist-unpack/libvirt-6.8.0/src/qemu/qemu_migration.c ../dist-unpack/libvirt-6.8.0/src/qemu/qemu_migration.c:4091:36: error: unused variable 'cfg' [-Werror,-Wunused-variable] g_autoptr(virQEMUDriverConfig) cfg = virQEMUDriverGetConfig(driver); ^ 1 error generated. [373/1207] Compiling C object 'src/qemu/9802133@@virt_driver_qemu_impl@sta/qemu_migration_cookie.c.o' ninja: build stopped: subcommand failed. Running custom dist script '/builds/libvirt/libvirt/scripts/meson-python.sh /usr/bin/python3 /builds/libvirt/libvirt/scripts/meson-dist.py /builds/libvirt/libvirt/build libvirt.spec' Running custom dist script '/builds/libvirt/libvirt/scripts/meson-python.sh /usr/bin/python3 /builds/libvirt/libvirt/scripts/meson-dist.py /builds/libvirt/libvirt/build AUTHORS.rst' Testing distribution package /builds/libvirt/libvirt/build/meson-dist/libvirt-6.8.0.tar.xz Compiling the distribution package failed Dist check build directory was /builds/libvirt/libvirt/build/meson-private/dist-build FAILED: meson-dist /usr/local/bin/meson dist ninja: build stopped: subcommand failed. ERROR: Job failed: exit code 1
|
|
builds
|
|
x64-fedora-rawhide-clang
|
[372/1244] Compiling C object src/qemu/libvirt_driver_qemu_impl.a.p/qemu_extdevice.c.o [373/1244] Compiling C object src/qemu/libvirt_driver_qemu_impl.a.p/qemu_capabilities.c.o [374/1244] Compiling C object src/qemu/libvirt_driver_qemu_impl.a.p/qemu_cgroup.c.o [375/1244] Compiling C object src/qemu/libvirt_driver_qemu_impl.a.p/qemu_conf.c.o [376/1244] Compiling C object src/qemu/libvirt_driver_qemu_impl.a.p/qemu_dbus.c.o [377/1244] Compiling C object src/qemu/libvirt_driver_qemu_impl.a.p/qemu_driver.c.o [378/1244] Compiling C object src/qemu/libvirt_driver_qemu_impl.a.p/qemu_domain_address.c.o [379/1244] Compiling C object src/qemu/libvirt_driver_qemu_impl.a.p/qemu_domainjob.c.o [380/1244] Compiling C object src/qemu/libvirt_driver_qemu_impl.a.p/qemu_domain.c.o [381/1244] Compiling C object src/qemu/libvirt_driver_qemu_impl.a.p/qemu_firmware.c.o [382/1244] Compiling C object src/qemu/libvirt_driver_qemu_impl.a.p/qemu_interop_config.c.o [383/1244] Compiling C object src/qemu/libvirt_driver_qemu_impl.a.p/qemu_migration.c.o FAILED: src/qemu/libvirt_driver_qemu_impl.a.p/qemu_migration.c.o clang -Isrc/qemu/libvirt_driver_qemu_impl.a.p -Isrc/qemu -I../dist-unpack/libvirt-6.8.0/src/qemu -Isrc/conf -I../dist-unpack/libvirt-6.8.0/src/conf -Isrc/hypervisor -I../dist-unpack/libvirt-6.8.0/src/hypervisor -Isrc/access -I../dist-unpack/libvirt-6.8.0/src/access -Isrc/logging -I../dist-unpack/libvirt-6.8.0/src/logging -Isrc/util -I../dist-unpack/libvirt-6.8.0/src/util -Iinclude -I../dist-unpack/libvirt-6.8.0/include -Isrc -I../dist-unpack/libvirt-6.8.0/src -I. -I../dist-unpack/libvirt-6.8.0 -I/usr/include/p11-kit-1 -I/usr/include/libnl3 -I/usr/include/glib-2.0 -I/usr/lib64/glib-2.0/include -I/usr/include/libmount -I/usr/include/blkid -I/usr/include/libxml2 -I/usr/include/tirpc -Xclang -fcolor-diagnostics -pipe -D_FILE_OFFSET_BITS=64 -Wall -Winvalid-pch -Wextra -Werror -std=gnu99 -O2 -g -fno-common -W -Wabsolute-value -Waddress -Waddress-of-packed-member -Wall -Wattributes -Wbool-operation -Wbuiltin-macro-redefined -Wcast-align -Wchar-subscripts -Wcomment -Wcomments -Wcpp -Wdangling-else -Wdate-time -Wdeclaration-after-statement -Wdeprecated-declarations -Wdiv-by-zero -Wduplicate-decl-specifier -Wempty-body -Wendif-labels -Wexpansion-to-defined -Wextra -Wformat-extra-args -Wformat-nonliteral -Wformat-security -Wformat-y2k -Wformat-zero-length -Wframe-address -Wignored-attributes -Wignored-qualifiers -Wimplicit -Wimplicit-function-declaration -Wimplicit-int -Wincompatible-pointer-types -Winit-self -Winline -Wint-conversion -Wint-in-bool-context -Wint-to-pointer-cast -Winvalid-pch -Wlogical-not-parentheses -Wmain -Wmemset-transposed-args -Wmisleading-indentation -Wmissing-braces -Wmissing-declarations -Wmissing-field-initializers -Wmissing-include-dirs -Wmissing-prototypes -Wmultichar -Wnarrowing -Wnested-externs -Wnonnull -Wnull-dereference -Wodr -Wold-style-definition -Woverflow -Woverride-init -Wparentheses -Wpointer-arith -Wpointer-compare -Wpointer-sign -Wpointer-to-int-cast -Wpragmas -Wpsabi -Wreturn-type -Wsequence-point -Wshadow -Wshift-count-negative -Wshift-count-overflow -Wshift-negative-value -Wsizeof-array-argument -Wsizeof-pointer-div -Wsizeof-pointer-memaccess -Wstrict-aliasing -Wstrict-prototypes -Wswitch -Wswitch-bool -Wtautological-compare -Wtrigraphs -Wtype-limits -Wuninitialized -Wunknown-pragmas -Wunused -Wunused-function -Wunused-label -Wunused-local-typedefs -Wunused-parameter -Wunused-result -Wunused-value -Wunused-variable -Wvarargs -Wvariadic-macros -Wvla -Wvolatile-register-var -Wwrite-strings -Wno-sign-compare -Wno-typedef-redefinition -Wswitch-enum -Wno-format-nonliteral -Wframe-larger-than=4096 -fexceptions -fasynchronous-unwind-tables -fstack-protector-strong -Wdouble-promotion -Wno-unused-function -fPIC -pthread -DIN_LIBVIRT '-Dabs_top_builddir="/builds/libvirt/libvirt/build/meson-private/dist-build"' '-Dabs_top_srcdir="/builds/libvirt/libvirt/build/meson-private/dist-unpack/libvirt-6.8.0"' -MD -MQ src/qemu/libvirt_driver_qemu_impl.a.p/qemu_migration.c.o -MF src/qemu/libvirt_driver_qemu_impl.a.p/qemu_migration.c.o.d -o src/qemu/libvirt_driver_qemu_impl.a.p/qemu_migration.c.o -c ../dist-unpack/libvirt-6.8.0/src/qemu/qemu_migration.c ../dist-unpack/libvirt-6.8.0/src/qemu/qemu_migration.c:4091:36: error: unused variable 'cfg' [-Werror,-Wunused-variable] g_autoptr(virQEMUDriverConfig) cfg = virQEMUDriverGetConfig(driver); ^ 1 error generated. [384/1244] Compiling C object src/qemu/libvirt_driver_qemu_impl.a.p/qemu_hostdev.c.o ninja: build stopped: subcommand failed. Running custom dist script '/builds/libvirt/libvirt/scripts/meson-python.sh /usr/bin/python3 /builds/libvirt/libvirt/scripts/meson-dist.py /builds/libvirt/libvirt/build libvirt.spec' Running custom dist script '/builds/libvirt/libvirt/scripts/meson-python.sh /usr/bin/python3 /builds/libvirt/libvirt/scripts/meson-dist.py /builds/libvirt/libvirt/build AUTHORS.rst' Testing distribution package /builds/libvirt/libvirt/build/meson-dist/libvirt-6.8.0.tar.xz Compiling the distribution package failed Dist check build directory was /builds/libvirt/libvirt/build/meson-private/dist-build FAILED: meson-dist /usr/bin/meson dist ninja: build stopped: subcommand failed. ERROR: Job failed: exit code 1
|
|
builds
|
|
x64-debian-10-clang
|
[367/1237] Compiling C object 'src/qemu/9802133@@virt_driver_qemu_impl@sta/qemu_command.c.o' [368/1237] Compiling C object 'src/qemu/9802133@@virt_driver_qemu_impl@sta/qemu_domain_address.c.o' [369/1237] Compiling C object 'src/qemu/9802133@@virt_driver_qemu_impl@sta/qemu_domainjob.c.o' [370/1237] Compiling C object 'src/qemu/9802133@@virt_driver_qemu_impl@sta/qemu_domain.c.o' [371/1237] Compiling C object 'src/qemu/9802133@@virt_driver_qemu_impl@sta/qemu_extdevice.c.o' [372/1237] Compiling C object 'src/qemu/9802133@@virt_driver_qemu_impl@sta/qemu_firmware.c.o' [373/1237] Compiling C object 'src/qemu/9802133@@virt_driver_qemu_impl@sta/qemu_hostdev.c.o' [374/1237] Compiling C object 'src/qemu/9802133@@virt_driver_qemu_impl@sta/qemu_hotplug.c.o' [375/1237] Compiling C object 'src/qemu/9802133@@virt_driver_qemu_impl@sta/qemu_interface.c.o' [376/1237] Compiling C object 'src/qemu/9802133@@virt_driver_qemu_impl@sta/qemu_interop_config.c.o' [377/1237] Compiling C object 'src/qemu/9802133@@virt_driver_qemu_impl@sta/qemu_driver.c.o' [378/1237] Compiling C object 'src/qemu/9802133@@virt_driver_qemu_impl@sta/qemu_migration.c.o' FAILED: src/qemu/9802133@@virt_driver_qemu_impl@sta/qemu_migration.c.o clang -Isrc/qemu/9802133@@virt_driver_qemu_impl@sta -Isrc/qemu -I../dist-unpack/libvirt-6.8.0/src/qemu -Isrc/conf -I../dist-unpack/libvirt-6.8.0/src/conf -Isrc/hypervisor -I../dist-unpack/libvirt-6.8.0/src/hypervisor -Isrc/access -I../dist-unpack/libvirt-6.8.0/src/access -Isrc/logging -I../dist-unpack/libvirt-6.8.0/src/logging -Isrc/util -I../dist-unpack/libvirt-6.8.0/src/util -Iinclude -I../dist-unpack/libvirt-6.8.0/include -Isrc -I../dist-unpack/libvirt-6.8.0/src -I. -I../dist-unpack/libvirt-6.8.0 -I/usr/include/p11-kit-1 -I/usr/include/libnl3 -I/usr/include/glib-2.0 -I/usr/lib/x86_64-linux-gnu/glib-2.0/include -I/usr/include/libmount -I/usr/include/blkid -I/usr/include/uuid -I/usr/include/libxml2 -I/usr/include/tirpc -Xclang -fcolor-diagnostics -pipe -D_FILE_OFFSET_BITS=64 -Wall -Winvalid-pch -Wextra -Werror -std=gnu99 -O2 -g -fno-common -W -Wabsolute-value -Waddress -Waddress-of-packed-member -Wall -Wattributes -Wbuiltin-macro-redefined -Wcast-align -Wchar-subscripts -Wcomment -Wcomments -Wcpp -Wdangling-else -Wdate-time -Wdeclaration-after-statement -Wdeprecated-declarations -Wdiv-by-zero -Wduplicate-decl-specifier -Wempty-body -Wendif-labels -Wexpansion-to-defined -Wextra -Wformat-extra-args -Wformat-nonliteral -Wformat-security -Wformat-y2k -Wformat-zero-length -Wignored-attributes -Wignored-qualifiers -Wimplicit -Wimplicit-function-declaration -Wimplicit-int -Wincompatible-pointer-types -Winit-self -Winline -Wint-conversion -Wint-to-pointer-cast -Winvalid-pch -Wlogical-not-parentheses -Wmain -Wmemset-transposed-args -Wmissing-braces -Wmissing-declarations -Wmissing-field-initializers -Wmissing-include-dirs -Wmissing-prototypes -Wmultichar -Wnarrowing -Wnested-externs -Wnonnull -Wnull-dereference -Wodr -Wold-style-definition -Woverflow -Wparentheses -Wpointer-arith -Wpointer-sign -Wpointer-to-int-cast -Wpragmas -Wreturn-type -Wsequence-point -Wshadow -Wshift-count-negative -Wshift-count-overflow -Wshift-negative-value -Wsizeof-array-argument -Wsizeof-pointer-memaccess -Wstrict-aliasing -Wstrict-prototypes -Wswitch -Wswitch-bool -Wtautological-compare -Wtrigraphs -Wtype-limits -Wuninitialized -Wunknown-pragmas -Wunused -Wunused-function -Wunused-label -Wunused-local-typedefs -Wunused-parameter -Wunused-result -Wunused-value -Wunused-variable -Wvarargs -Wvariadic-macros -Wvla -Wvolatile-register-var -Wwrite-strings -Wno-sign-compare -Wno-typedef-redefinition -Wswitch-enum -Wno-format-nonliteral -Wframe-larger-than=4096 -fexceptions -fasynchronous-unwind-tables -fstack-protector-strong -Wno-unused-function -fPIC -pthread -DIN_LIBVIRT '-Dabs_top_builddir="/builds/libvirt/libvirt/build/meson-private/dist-build"' '-Dabs_top_srcdir="/builds/libvirt/libvirt/build/meson-private/dist-unpack/libvirt-6.8.0"' -MD -MQ 'src/qemu/9802133@@virt_driver_qemu_impl@sta/qemu_migration.c.o' -MF 'src/qemu/9802133@@virt_driver_qemu_impl@sta/qemu_migration.c.o.d' -o 'src/qemu/9802133@@virt_driver_qemu_impl@sta/qemu_migration.c.o' -c ../dist-unpack/libvirt-6.8.0/src/qemu/qemu_migration.c ../dist-unpack/libvirt-6.8.0/src/qemu/qemu_migration.c:4091:36: error: unused variable 'cfg' [-Werror,-Wunused-variable] g_autoptr(virQEMUDriverConfig) cfg = virQEMUDriverGetConfig(driver); ^ 1 error generated. [379/1237] Compiling C object 'src/qemu/9802133@@virt_driver_qemu_impl@sta/qemu_migration_cookie.c.o' ninja: build stopped: subcommand failed. Running custom dist script '/builds/libvirt/libvirt/scripts/meson-python.sh /usr/bin/python3 /builds/libvirt/libvirt/scripts/meson-dist.py /builds/libvirt/libvirt/build libvirt.spec' Running custom dist script '/builds/libvirt/libvirt/scripts/meson-python.sh /usr/bin/python3 /builds/libvirt/libvirt/scripts/meson-dist.py /builds/libvirt/libvirt/build AUTHORS.rst' Testing distribution package /builds/libvirt/libvirt/build/meson-dist/libvirt-6.8.0.tar.xz Compiling the distribution package failed Dist check build directory was /builds/libvirt/libvirt/build/meson-private/dist-build FAILED: meson-dist /usr/local/bin/meson dist ninja: build stopped: subcommand failed. ERROR: Job failed: exit code 1
|
|
builds
|
|
x64-macos-1015-build
|
[303/1007] Compiling C object 'src/qemu/9802133@@virt_driver_qemu_impl@sta/qemu_cgroup.c.o' [304/1007] Compiling C object 'src/qemu/9802133@@virt_driver_qemu_impl@sta/qemu_checkpoint.c.o' [305/1007] Compiling C object 'src/qemu/9802133@@virt_driver_qemu_impl@sta/qemu_dbus.c.o' [306/1007] Compiling C object 'src/qemu/9802133@@virt_driver_qemu_impl@sta/qemu_conf.c.o' [307/1007] Compiling C object 'src/qemu/9802133@@virt_driver_qemu_impl@sta/qemu_capabilities.c.o' [308/1007] Compiling C object 'src/qemu/9802133@@virt_driver_qemu_impl@sta/qemu_domain_address.c.o' [309/1007] Compiling C object 'src/qemu/9802133@@virt_driver_qemu_impl@sta/qemu_domainjob.c.o' [310/1007] Compiling C object 'src/qemu/9802133@@virt_driver_qemu_impl@sta/qemu_hostdev.c.o' [311/1007] Compiling C object 'src/qemu/9802133@@virt_driver_qemu_impl@sta/qemu_firmware.c.o' [312/1007] Compiling C object 'src/qemu/9802133@@virt_driver_qemu_impl@sta/qemu_interop_config.c.o' [313/1007] Compiling C object 'src/qemu/9802133@@virt_driver_qemu_impl@sta/qemu_command.c.o' [314/1007] Compiling C object 'src/qemu/9802133@@virt_driver_qemu_impl@sta/qemu_interface.c.o' [315/1007] Compiling C object 'src/qemu/9802133@@virt_driver_qemu_impl@sta/qemu_domain.c.o' [316/1007] Compiling C object 'src/qemu/9802133@@virt_driver_qemu_impl@sta/qemu_migration.c.o' FAILED: src/qemu/9802133@@virt_driver_qemu_impl@sta/qemu_migration.c.o ccache cc -Isrc/qemu/9802133@@virt_driver_qemu_impl@sta -Isrc/qemu -I../src/qemu -Isrc/conf -I../src/conf -Isrc/hypervisor -I../src/hypervisor -Isrc/access -I../src/access -Isrc/logging -I../src/logging -Isrc/util -I../src/util -Iinclude -I../include -Isrc -I../src -I. -I.. -I/usr/local/Cellar/gnutls/3.6.13/include -I/usr/local/Cellar/nettle/3.4.1/include -I/usr/local/Cellar/libtasn1/4.16.0/include -I/usr/local/Cellar/p11-kit/0.23.20_1/include/p11-kit-1 -I/usr/local/Cellar/glib/2.64.2_1/include/glib-2.0 -I/usr/local/Cellar/glib/2.64.2_1/lib/glib-2.0/include -I/usr/local/opt/gettext/include -I/usr/local/Cellar/pcre/8.44/include -I/usr/local/Cellar/libffi/3.3/include -I/usr/local/Cellar/glib/2.64.2_1/include -I/usr/local/Cellar/libxml2/2.9.10_1/include/libxml2 -Xclang -fcolor-diagnostics -pipe -Wall -Winvalid-pch -Wextra -std=gnu99 -O2 -g -Werror -fno-common -W -Wabsolute-value -Waddress -Waddress-of-packed-member -Wall -Wattributes -Wbuiltin-macro-redefined -Wcast-align -Wchar-subscripts -Wcomment -Wcomments -Wcpp -Wdangling-else -Wdate-time -Wdeclaration-after-statement -Wdeprecated-declarations -Wdiv-by-zero -Wduplicate-decl-specifier -Wempty-body -Wendif-labels -Wexpansion-to-defined -Wextra -Wformat-extra-args -Wformat-nonliteral -Wformat-security -Wformat-y2k -Wformat-zero-length -Wignored-attributes -Wignored-qualifiers -Wimplicit -Wimplicit-function-declaration -Wimplicit-int -Wincompatible-pointer-types -Winit-self -Winline -Wint-conversion -Wint-to-pointer-cast -Winvalid-pch -Wlogical-not-parentheses -Wmain -Wmemset-transposed-args -Wmissing-braces -Wmissing-declarations -Wmissing-field-initializers -Wmissing-include-dirs -Wmissing-prototypes -Wmultichar -Wnarrowing -Wnested-externs -Wnonnull -Wnull-dereference -Wodr -Wold-style-definition -Woverflow -Wparentheses -Wpointer-arith -Wpointer-sign -Wpointer-to-int-cast -Wpragmas -Wreturn-type -Wsequence-point -Wshadow -Wshift-count-negative -Wshift-count-overflow -Wshift-negative-value -Wsizeof-array-argument -Wsizeof-pointer-div -Wsizeof-pointer-memaccess -Wstrict-aliasing -Wstrict-prototypes -Wswitch -Wswitch-bool -Wtautological-compare -Wtrigraphs -Wtype-limits -Wuninitialized -Wunknown-pragmas -Wunused -Wunused-function -Wunused-label -Wunused-local-typedefs -Wunused-parameter -Wunused-result -Wunused-value -Wunused-variable -Wvarargs -Wvariadic-macros -Wvla -Wvolatile-register-var -Wwrite-strings -Wno-sign-compare -Wno-typedef-redefinition -Wswitch-enum -Wno-format-nonliteral -Wframe-larger-than=4096 -fexceptions -fasynchronous-unwind-tables -Wdouble-promotion -Wno-unused-function -DIN_LIBVIRT '-Dabs_top_builddir="/private/var/folders/3y/l0z1x3693dl_8n0qybp4dqwh0000gn/T/cirrus-ci-build/build"' '-Dabs_top_srcdir="/private/var/folders/3y/l0z1x3693dl_8n0qybp4dqwh0000gn/T/cirrus-ci-build"' -MD -MQ 'src/qemu/9802133@@virt_driver_qemu_impl@sta/qemu_migration.c.o' -MF 'src/qemu/9802133@@virt_driver_qemu_impl@sta/qemu_migration.c.o.d' -o 'src/qemu/9802133@@virt_driver_qemu_impl@sta/qemu_migration.c.o' -c ../src/qemu/qemu_migration.c ../src/qemu/qemu_migration.c:4091:36: error: unused variable 'cfg' [-Werror,-Wunused-variable] g_autoptr(virQEMUDriverConfig) cfg = virQEMUDriverGetConfig(driver); ^ 1 error generated. [317/1007] Compiling C object 'src/qemu/9802133@@virt_driver_qemu_impl@sta/qemu_migration_cookie.c.o' [318/1007] Compiling C object 'src/25a6634@@virtsecretd@exe/remote_remote_daemon_stream.c.o' [319/1007] Compiling C object 'src/qemu/9802133@@virt_driver_qemu_impl@sta/qemu_hotplug.c.o' [320/1007] Compiling C object 'src/esx/1e74bf6@@virt_driver_esx@sta/esx_vi_types.c.o' [321/1007] Compiling C object 'src/qemu/9802133@@virt_driver_qemu_impl@sta/qemu_driver.c.o' ninja: build stopped: subcommand failed.
Build failed: https://cirrus-ci.com/build/5325928198832128 ERROR: Job failed: exit code 1
|