
See <https://ci.centos.org/job/libvirt-dbus-check/systems=libvirt-fedora-rawhide/253/display/redirect> ------------------------------------------ [...truncated 4.38 KB...] gmake[1]: Entering directory '<https://ci.centos.org/job/libvirt-dbus-check/systems=libvirt-fedora-rawhide/ws/build/tests'> /usr/bin/gmake test_util gmake[2]: Entering directory '<https://ci.centos.org/job/libvirt-dbus-check/systems=libvirt-fedora-rawhide/ws/build/tests'> CC test_util-test_util.o CCLD test_util gmake[2]: Leaving directory '<https://ci.centos.org/job/libvirt-dbus-check/systems=libvirt-fedora-rawhide/ws/build/tests'> /usr/bin/gmake check-TESTS gmake[2]: Entering directory '<https://ci.centos.org/job/libvirt-dbus-check/systems=libvirt-fedora-rawhide/ws/build/tests'> gmake[3]: Entering directory '<https://ci.centos.org/job/libvirt-dbus-check/systems=libvirt-fedora-rawhide/ws/build/tests'> PASS: test_util PASS: test_interface.py FAIL: test_domain.py PASS: test_network.py PASS: test_nodedev.py PASS: test_connect.py PASS: test_storage.py ============================================================================ Testsuite summary for libvirt-dbus 1.4.0 ============================================================================ # TOTAL: 7 # PASS: 6 # SKIP: 0 # XFAIL: 0 # FAIL: 1 # XPASS: 0 # ERROR: 0 ============================================================================ See tests/test-suite.log Please report to libvir-list@redhat.com ============================================================================ gmake[3]: *** [Makefile:766: test-suite.log] Error 1 gmake[3]: Leaving directory '<https://ci.centos.org/job/libvirt-dbus-check/systems=libvirt-fedora-rawhide/ws/build/tests'> gmake[2]: *** [Makefile:874: check-TESTS] Error 2 gmake[2]: Leaving directory '<https://ci.centos.org/job/libvirt-dbus-check/systems=libvirt-fedora-rawhide/ws/build/tests'> gmake[1]: *** [Makefile:990: check-am] Error 2 gmake[1]: Leaving directory '<https://ci.centos.org/job/libvirt-dbus-check/systems=libvirt-fedora-rawhide/ws/build/tests'> gmake: *** [Makefile:460: check-recursive] Error 1 + cat tests/test-suite.log ============================================== libvirt-dbus 1.4.0: tests/test-suite.log ============================================== # TOTAL: 7 # PASS: 6 # SKIP: 0 # XFAIL: 0 # FAIL: 1 # XPASS: 0 # ERROR: 0 .. contents:: :depth: 2 FAIL: test_domain.py ==================== ============================= test session starts ============================== platform linux -- Python 3.7.2, pytest-3.9.3, py-1.7.0, pluggy-0.8.1 rootdir: <https://ci.centos.org/job/libvirt-dbus-check/systems=libvirt-fedora-rawhide/ws/,> inifile: collected 10 items ../../tests/test_domain.py ...E..FF.. [100%] ==================================== ERRORS ==================================== ______________ ERROR at setup of TestDomain.test_domain_metadata _______________ self = <test_domain.TestDomain object at 0x7faee09d8f28> request = <SubRequest 'libvirt_dbus_setup' for <Function 'test_domain_metadata'>> @pytest.fixture(autouse=True) def libvirt_dbus_setup(self, request): """Start libvirt-dbus for each test function """ os.environ['LIBVIRT_DEBUG'] = '3' self.libvirt_dbus = subprocess.Popen([exe, '--session']) self.bus = dbus.SessionBus() for i in range(10): if self.bus.name_has_owner('org.libvirt'): break time.sleep(0.1) else:
raise TimeoutError('error starting libvirt-dbus')
E TimeoutError: error starting libvirt-dbus ../../tests/libvirttest.py:44: TimeoutError =================================== FAILURES =================================== ___________________________ TestDomain.test_suspend ____________________________ self = <test_domain.TestDomain object at 0x7faee0aa14a8> def test_suspend(self): def domain_suspended(path, event, detail): if event != libvirttest.DomainEvent.SUSPENDED: return assert detail == libvirttest.DomainEventSuspendedDetailType.PAUSED assert isinstance(path, dbus.ObjectPath) self.loop.quit() self.connect.connect_to_signal('DomainEvent', domain_suspended) obj, domain = self.get_test_domain()
domain.Suspend()
../../tests/test_domain.py:125: _ _ _ _ _ _ _ _ _ _ _ _ _ _ _ _ _ _ _ _ _ _ _ _ _ _ _ _ _ _ _ _ _ _ _ _ _ _ _ _ /usr/lib64/python3.7/site-packages/dbus/proxies.py:70: in __call__ return self._proxy_method(*args, **keywords) /usr/lib64/python3.7/site-packages/dbus/proxies.py:145: in __call__ **keywords) _ _ _ _ _ _ _ _ _ _ _ _ _ _ _ _ _ _ _ _ _ _ _ _ _ _ _ _ _ _ _ _ _ _ _ _ _ _ _ _ self = <dbus._dbus.SessionBus (session) at 0x7faee0c1e6d0> bus_name = dbus.String(':1.4') object_path = dbus.ObjectPath('/org/libvirt/Test/domain/_6695eb01_f6a4_8304_79aa_97f2502e193f') dbus_interface = 'org.libvirt.Domain', method = 'Suspend', signature = '' args = (), timeout = -1.0, byte_arrays = False, kwargs = {} get_args_opts = {'byte_arrays': False} message = <dbus.lowlevel.MethodCallMessage path: /org/libvirt/Test/domain/_6695eb01_f6a4_8304_79aa_97f2502e193f, iface: org.libvirt.Domain, member: Suspend dest: :1.4> def call_blocking(self, bus_name, object_path, dbus_interface, method, signature, args, timeout=-1.0, byte_arrays=False, **kwargs): """Call the given method, synchronously. :Since: 0.81.0 """ if object_path == LOCAL_PATH: raise DBusException('Methods may not be called on the reserved ' 'path %s' % LOCAL_PATH) if dbus_interface == LOCAL_IFACE: raise DBusException('Methods may not be called on the reserved ' 'interface %s' % LOCAL_IFACE) # no need to validate other args - MethodCallMessage ctor will do get_args_opts = dict(byte_arrays=byte_arrays) if is_py2: get_args_opts['utf8_strings'] = kwargs.get('utf8_strings', False) elif 'utf8_strings' in kwargs: raise TypeError("unexpected keyword argument 'utf8_strings'") message = MethodCallMessage(destination=bus_name, path=object_path, interface=dbus_interface, method=method) # Add the arguments to the function try: message.append(signature=signature, *args) except Exception as e: logging.basicConfig() _logger.error('Unable to set arguments %r according to ' 'signature %r: %s: %s', args, signature, e.__class__, e) raise # make a blocking call reply_message = self.send_message_with_reply_and_block(
message, timeout)
E dbus.exceptions.DBusException: org.libvirt.Error: internal error: domain 'test' not running /usr/lib64/python3.7/site-packages/dbus/connection.py:651: DBusException ___________________________ TestDomain.test_undefine ___________________________ self = <test_domain.TestDomain object at 0x7faee08dc4a8> def test_undefine(self): def domain_undefined(path, event, detail): if event != libvirttest.DomainEvent.UNDEFINED: return assert detail == libvirttest.DomainEventUndefinedDetailType.REMOVED assert isinstance(path, dbus.ObjectPath) self.loop.quit() self.connect.connect_to_signal('DomainEvent', domain_undefined) _, domain = self.get_test_domain()
domain.Shutdown(0)
../../tests/test_domain.py:143: _ _ _ _ _ _ _ _ _ _ _ _ _ _ _ _ _ _ _ _ _ _ _ _ _ _ _ _ _ _ _ _ _ _ _ _ _ _ _ _ /usr/lib64/python3.7/site-packages/dbus/proxies.py:70: in __call__ return self._proxy_method(*args, **keywords) /usr/lib64/python3.7/site-packages/dbus/proxies.py:145: in __call__ **keywords) _ _ _ _ _ _ _ _ _ _ _ _ _ _ _ _ _ _ _ _ _ _ _ _ _ _ _ _ _ _ _ _ _ _ _ _ _ _ _ _ self = <dbus._dbus.SessionBus (session) at 0x7faee0c1e6d0> bus_name = dbus.String(':1.4') object_path = dbus.ObjectPath('/org/libvirt/Test/domain/_6695eb01_f6a4_8304_79aa_97f2502e193f') dbus_interface = 'org.libvirt.Domain', method = 'Shutdown', signature = 'u' args = (0,), timeout = -1.0, byte_arrays = False, kwargs = {} get_args_opts = {'byte_arrays': False} message = <dbus.lowlevel.MethodCallMessage path: /org/libvirt/Test/domain/_6695eb01_f6a4_8304_79aa_97f2502e193f, iface: org.libvirt.Domain, member: Shutdown dest: :1.4> def call_blocking(self, bus_name, object_path, dbus_interface, method, signature, args, timeout=-1.0, byte_arrays=False, **kwargs): """Call the given method, synchronously. :Since: 0.81.0 """ if object_path == LOCAL_PATH: raise DBusException('Methods may not be called on the reserved ' 'path %s' % LOCAL_PATH) if dbus_interface == LOCAL_IFACE: raise DBusException('Methods may not be called on the reserved ' 'interface %s' % LOCAL_IFACE) # no need to validate other args - MethodCallMessage ctor will do get_args_opts = dict(byte_arrays=byte_arrays) if is_py2: get_args_opts['utf8_strings'] = kwargs.get('utf8_strings', False) elif 'utf8_strings' in kwargs: raise TypeError("unexpected keyword argument 'utf8_strings'") message = MethodCallMessage(destination=bus_name, path=object_path, interface=dbus_interface, method=method) # Add the arguments to the function try: message.append(signature=signature, *args) except Exception as e: logging.basicConfig() _logger.error('Unable to set arguments %r according to ' 'signature %r: %s: %s', args, signature, e.__class__, e) raise # make a blocking call reply_message = self.send_message_with_reply_and_block(
message, timeout)
E dbus.exceptions.DBusException: org.libvirt.Error: internal error: domain 'test' not running /usr/lib64/python3.7/site-packages/dbus/connection.py:651: DBusException --------------------------- Captured stderr teardown --------------------------- Disconnected from D-Bus. =============================== warnings summary =============================== tests/test_domain.py::TestDomain::()::test_suspend source:362: DeprecationWarning: invalid escape sequence \ source:399: DeprecationWarning: invalid escape sequence \ tests/test_domain.py::TestDomain::()::test_undefine source:362: DeprecationWarning: invalid escape sequence \ source:399: DeprecationWarning: invalid escape sequence \ -- Docs: https://docs.pytest.org/en/latest/warnings.html =========== 2 failed, 7 passed, 4 warnings, 1 error in 8.35 seconds ============ FAIL test_domain.py (exit status: 1) + exit 1 Build step 'Execute shell' marked build as failure